Peak time (h),y position,Long-distance coupling strength,Local coupling strength
98.6,1,0,0
111.2,2,0,0
105.8,3,0,0
104.2,4,0,0
107.4,5,0,0
101.2,6,0,0
103.4,7,0,0
95.8,8,0,0
104.6,9,0,0
107.8,10,0,0
108.6,11,0,0
101.4,12,0,0
101,13,0,0
104.2,14,0,0
101.6,15,0,0
102.4,16,0,0
103.6,17,0,0
102.8,18,0,0
97.2,19,0,0
105.4,20,0,0
100.6,21,0,0
102.8,22,0,0
97.6,23,0,0
99.8,24,0,0
102,25,0,0
111.8,26,0,0
110.2,27,0,0
114.2,28,0,0
112.2,29,0,0
111,30,0,0
111.8,31,0,0
111.8,32,0,0
111.4,33,0,0
111,34,0,0
112.8,35,0,0
113.2,36,0,0
113.2,37,0,0
112,38,0,0
112.8,39,0,0
111.2,40,0,0
109.8,41,0,0
110.8,42,0,0
109.8,43,0,0
112.4,44,0,0
110.8,45,0,0
110.6,46,0,0
112.6,47,0,0
113.4,48,0,0
113.6,49,0,0
110.6,50,0,0
110.4,51,0,0
108.8,52,0,0
109,53,0,0
127.8,54,0,0
126.4,55,0,0
127.4,56,0,0
116.4,57,0,0
118.2,58,0,0
126.2,59,0,0
130.4,60,0,0
132,61,0,0
126.2,62,0,0
130.2,63,0,0
126.4,64,0,0
NaN,65,0,0
118.4,66,0,0
127,67,0,0
119.4,68,0,0
123.8,69,0,0
123.4,70,0,0
120.4,71,0,0
122.6,72,0,0
124.6,73,0,0
122.6,74,0,0
129,75,0,0
124.8,76,0,0
109.6,77,0,0
121.6,78,0,0
110.4,79,0,0
127.6,80,0,0
NaN,81,0,0
119.8,82,0,0
122.8,83,0,0
109,84,0,0
125.4,85,0,0
124.8,86,0,0
123.4,87,0,0
113,88,0,0
130.8,89,0,0
125,90,0,0
126.8,91,0,0
120.6,92,0,0
114.2,93,0,0
122.2,94,0,0
128,95,0,0
129,96,0,0
122.4,97,0,0
123,98,0,0
125.2,99,0,0
125.8,100,0,0
NaN,101,0,0
121,102,0,0
116.4,103,0,0
122.2,104,0,0
122.4,105,0,0
125,106,0,0
124,107,0,0
120.4,108,0,0
125,109,0,0
120.4,110,0,0
119.2,111,0,0
NaN,112,0,0
98.6,1,2,0
111.2,2,2,0
105.6,3,2,0
104.2,4,2,0
107.4,5,2,0
101.2,6,2,0
103.4,7,2,0
95.8,8,2,0
104.6,9,2,0
107.6,10,2,0
108.6,11,2,0
101.4,12,2,0
101,13,2,0
104.2,14,2,0
101.6,15,2,0
102.2,16,2,0
103.4,17,2,0
102.6,18,2,0
97.2,19,2,0
105.4,20,2,0
100.6,21,2,0
102.8,22,2,0
97.6,23,2,0
99.6,24,2,0
102,25,2,0
111.8,26,2,0
110.2,27,2,0
114.2,28,2,0
112.2,29,2,0
111,30,2,0
111.8,31,2,0
111.6,32,2,0
111.4,33,2,0
111,34,2,0
112.8,35,2,0
113.2,36,2,0
113.2,37,2,0
112,38,2,0
112.8,39,2,0
111.2,40,2,0
109.8,41,2,0
110.8,42,2,0
109.8,43,2,0
112.2,44,2,0
110.8,45,2,0
110.6,46,2,0
112.6,47,2,0
113.2,48,2,0
113.6,49,2,0
110.4,50,2,0
110.4,51,2,0
108.8,52,2,0
108.8,53,2,0
127.8,54,2,0
126.4,55,2,0
127.4,56,2,0
116.4,57,2,0
118.2,58,2,0
126.2,59,2,0
130.4,60,2,0
132,61,2,0
126,62,2,0
130.2,63,2,0
126.4,64,2,0
NaN,65,2,0
118.4,66,2,0
127,67,2,0
119.4,68,2,0
123.8,69,2,0
123.4,70,2,0
120.4,71,2,0
122.6,72,2,0
124.6,73,2,0
122.4,74,2,0
129,75,2,0
124.8,76,2,0
109.6,77,2,0
121.6,78,2,0
110.4,79,2,0
127.6,80,2,0
NaN,81,2,0
119.8,82,2,0
122.8,83,2,0
109,84,2,0
125.4,85,2,0
124.8,86,2,0
123.4,87,2,0
113,88,2,0
130.8,89,2,0
124.8,90,2,0
126.6,91,2,0
120.6,92,2,0
114.2,93,2,0
122.2,94,2,0
127.8,95,2,0
129,96,2,0
122.4,97,2,0
123,98,2,0
125.2,99,2,0
125.6,100,2,0
NaN,101,2,0
121,102,2,0
116.4,103,2,0
122.2,104,2,0
122.4,105,2,0
125,106,2,0
124,107,2,0
110.6,108,2,0
110.4,109,2,0
109.8,110,2,0
112,111,2,0
NaN,112,2,0
98.6,1,4,0
111.2,2,4,0
105.8,3,4,0
104.2,4,4,0
107.6,5,4,0
101.2,6,4,0
103.4,7,4,0
96,8,4,0
104.6,9,4,0
107.8,10,4,0
108.6,11,4,0
101.4,12,4,0
101,13,4,0
104.2,14,4,0
101.8,15,4,0
102.4,16,4,0
103.6,17,4,0
102.8,18,4,0
97.4,19,4,0
105.4,20,4,0
100.6,21,4,0
103,22,4,0
97.6,23,4,0
99.8,24,4,0
102,25,4,0
111.8,26,4,0
110.2,27,4,0
114.2,28,4,0
112.2,29,4,0
111,30,4,0
111.8,31,4,0
111.8,32,4,0
111.4,33,4,0
111,34,4,0
112.8,35,4,0
113.2,36,4,0
113.2,37,4,0
112,38,4,0
112.8,39,4,0
111.2,40,4,0
109.8,41,4,0
110.8,42,4,0
109.8,43,4,0
112.4,44,4,0
110.8,45,4,0
110.6,46,4,0
112.6,47,4,0
113.4,48,4,0
113.6,49,4,0
110.6,50,4,0
110.6,51,4,0
108.8,52,4,0
109,53,4,0
127.8,54,4,0
126.4,55,4,0
127.4,56,4,0
116.4,57,4,0
118.4,58,4,0
126.4,59,4,0
130.4,60,4,0
132,61,4,0
126.2,62,4,0
130.2,63,4,0
126.4,64,4,0
NaN,65,4,0
118.4,66,4,0
127,67,4,0
119.4,68,4,0
123.8,69,4,0
123.4,70,4,0
120.4,71,4,0
122.6,72,4,0
124.6,73,4,0
122.6,74,4,0
129.2,75,4,0
124.8,76,4,0
109.6,77,4,0
121.8,78,4,0
110.4,79,4,0
127.6,80,4,0
NaN,81,4,0
119.8,82,4,0
122.8,83,4,0
109,84,4,0
125.4,85,4,0
124.8,86,4,0
123.4,87,4,0
113,88,4,0
130.8,89,4,0
125,90,4,0
126.8,91,4,0
120.6,92,4,0
114.2,93,4,0
122.4,94,4,0
128,95,4,0
129.2,96,4,0
122.4,97,4,0
123,98,4,0
125.2,99,4,0
125.8,100,4,0
NaN,101,4,0
121,102,4,0
116.4,103,4,0
122.2,104,4,0
122.4,105,4,0
125,106,4,0
124,107,4,0
110.6,108,4,0
110.2,109,4,0
110,110,4,0
112,111,4,0
NaN,112,4,0
97.4,1,0,2
95,2,0,2
101.2,3,0,2
100.6,4,0,2
100,5,0,2
100.6,6,0,2
100,7,0,2
99.4,8,0,2
100.4,9,0,2
101.8,10,0,2
103.2,11,0,2
101.6,12,0,2
101.6,13,0,2
101.6,14,0,2
100.2,15,0,2
101,16,0,2
101.6,17,0,2
100.8,18,0,2
99.6,19,0,2
102,20,0,2
100.8,21,0,2
100.8,22,0,2
99,23,0,2
97.8,24,0,2
101.6,25,0,2
107.8,26,0,2
109,27,0,2
110.8,28,0,2
109.4,29,0,2
109.6,30,0,2
110.2,31,0,2
110.6,32,0,2
110.8,33,0,2
111,34,0,2
111,35,0,2
111.8,36,0,2
112,37,0,2
111.8,38,0,2
111.6,39,0,2
110.8,40,0,2
110.6,41,0,2
110.6,42,0,2
110.8,43,0,2
111.4,44,0,2
111.2,45,0,2
111,46,0,2
111.6,47,0,2
112,48,0,2
111.4,49,0,2
111,50,0,2
110.6,51,0,2
110,52,0,2
112.2,53,0,2
111.4,54,0,2
117.6,55,0,2
120,56,0,2
122.4,57,0,2
122.4,58,0,2
125,59,0,2
127.2,60,0,2
126.4,61,0,2
126,62,0,2
125.4,63,0,2
124.4,64,0,2
124.8,65,0,2
120.8,66,0,2
122,67,0,2
121.4,68,0,2
123.4,69,0,2
124,70,0,2
123.4,71,0,2
124.2,72,0,2
125.6,73,0,2
124.8,74,0,2
125.6,75,0,2
125.2,76,0,2
124.4,77,0,2
123.4,78,0,2
124.6,79,0,2
125.2,80,0,2
124.6,81,0,2
122.2,82,0,2
122.2,83,0,2
123.4,84,0,2
124.6,85,0,2
123.2,86,0,2
121.4,87,0,2
119.6,88,0,2
120.2,89,0,2
122.8,90,0,2
122.8,91,0,2
121.6,92,0,2
119.2,93,0,2
122.6,94,0,2
124.2,95,0,2
124.4,96,0,2
124.2,97,0,2
124,98,0,2
124.6,99,0,2
125.2,100,0,2
123.4,101,0,2
121.6,102,0,2
119.2,103,0,2
119.6,104,0,2
118.6,105,0,2
118.2,106,0,2
120.4,107,0,2
110.4,108,0,2
108.8,109,0,2
120.4,110,0,2
111,111,0,2
NaN,112,0,2
97.4,1,2,2
95,2,2,2
101.2,3,2,2
100.6,4,2,2
100,5,2,2
100.6,6,2,2
100,7,2,2
99.4,8,2,2
100.4,9,2,2
101.8,10,2,2
103.2,11,2,2
101.6,12,2,2
101.6,13,2,2
101.6,14,2,2
100.2,15,2,2
101,16,2,2
101.6,17,2,2
100.8,18,2,2
99.6,19,2,2
102,20,2,2
100.6,21,2,2
100.8,22,2,2
99,23,2,2
97.8,24,2,2
101.6,25,2,2
107.8,26,2,2
109,27,2,2
110.8,28,2,2
109.4,29,2,2
109.6,30,2,2
110.2,31,2,2
110.6,32,2,2
110.8,33,2,2
111,34,2,2
111,35,2,2
111.8,36,2,2
112,37,2,2
111.8,38,2,2
111.6,39,2,2
110.8,40,2,2
110.6,41,2,2
110.6,42,2,2
110.8,43,2,2
111.4,44,2,2
111.2,45,2,2
111,46,2,2
111.6,47,2,2
112,48,2,2
111.4,49,2,2
111,50,2,2
110.6,51,2,2
110,52,2,2
112.2,53,2,2
111.4,54,2,2
117.6,55,2,2
120,56,2,2
122.4,57,2,2
122.4,58,2,2
125,59,2,2
127.2,60,2,2
126.4,61,2,2
126,62,2,2
125.4,63,2,2
124.4,64,2,2
124.8,65,2,2
120.8,66,2,2
122,67,2,2
121.4,68,2,2
123.4,69,2,2
124,70,2,2
123.4,71,2,2
124.2,72,2,2
125.6,73,2,2
124.8,74,2,2
125.6,75,2,2
125.2,76,2,2
124.4,77,2,2
123.4,78,2,2
124.6,79,2,2
125.2,80,2,2
124.6,81,2,2
122.2,82,2,2
122.2,83,2,2
123.4,84,2,2
124.6,85,2,2
123.2,86,2,2
121.4,87,2,2
119.6,88,2,2
120.2,89,2,2
122.8,90,2,2
122.8,91,2,2
121.6,92,2,2
119.2,93,2,2
122.6,94,2,2
124.2,95,2,2
124.2,96,2,2
124.2,97,2,2
124,98,2,2
124.6,99,2,2
125,100,2,2
123,101,2,2
120.8,102,2,2
118.2,103,2,2
118.2,104,2,2
116.8,105,2,2
115.8,106,2,2
112,107,2,2
110.2,108,2,2
109.6,109,2,2
109.6,110,2,2
111.6,111,2,2
NaN,112,2,2
97.4,1,4,2
95,2,4,2
101.2,3,4,2
100.6,4,4,2
100,5,4,2
100.6,6,4,2
100,7,4,2
99.4,8,4,2
100.4,9,4,2
101.8,10,4,2
103.2,11,4,2
101.6,12,4,2
101.6,13,4,2
101.6,14,4,2
100.2,15,4,2
101,16,4,2
101.6,17,4,2
100.8,18,4,2
99.6,19,4,2
102,20,4,2
100.8,21,4,2
100.8,22,4,2
99,23,4,2
97.8,24,4,2
101.6,25,4,2
107.8,26,4,2
109,27,4,2
110.8,28,4,2
109.4,29,4,2
109.6,30,4,2
110.2,31,4,2
110.6,32,4,2
110.8,33,4,2
111,34,4,2
111,35,4,2
111.8,36,4,2
112,37,4,2
111.8,38,4,2
111.6,39,4,2
110.8,40,4,2
110.6,41,4,2
110.6,42,4,2
111,43,4,2
111.4,44,4,2
111.2,45,4,2
111,46,4,2
111.6,47,4,2
112,48,4,2
111.4,49,4,2
111,50,4,2
110.6,51,4,2
110,52,4,2
112.2,53,4,2
111.4,54,4,2
117.6,55,4,2
120,56,4,2
122.4,57,4,2
122.4,58,4,2
125,59,4,2
127.2,60,4,2
126.4,61,4,2
126,62,4,2
125.4,63,4,2
124.4,64,4,2
124.8,65,4,2
121,66,4,2
122,67,4,2
121.4,68,4,2
123.4,69,4,2
124,70,4,2
123.4,71,4,2
124.2,72,4,2
125.6,73,4,2
124.8,74,4,2
125.6,75,4,2
125.2,76,4,2
124.4,77,4,2
123.6,78,4,2
124.6,79,4,2
125.2,80,4,2
124.6,81,4,2
122.2,82,4,2
122.2,83,4,2
123.4,84,4,2
124.6,85,4,2
123.2,86,4,2
121.4,87,4,2
119.6,88,4,2
120.2,89,4,2
122.8,90,4,2
122.8,91,4,2
121.6,92,4,2
119.2,93,4,2
122.6,94,4,2
124.2,95,4,2
124.2,96,4,2
124.2,97,4,2
123.8,98,4,2
124.4,99,4,2
124.8,100,4,2
122.8,101,4,2
120.8,102,4,2
118,103,4,2
118,104,4,2
116.4,105,4,2
115.4,106,4,2
111.6,107,4,2
110.2,108,4,2
109.6,109,4,2
109.6,110,4,2
111.6,111,4,2
NaN,112,4,2
