Period (h),Organ
30.25,Cotyledon
28.63,Cotyledon
29.09,Cotyledon
29.8,Cotyledon
29.23,Cotyledon
27.26,Cotyledon
29.78,Cotyledon
28.79,Cotyledon
28.08,Cotyledon
29.13,Cotyledon
28.5,Cotyledon
28.11,Cotyledon
29.46,Cotyledon
28.8,Cotyledon
28.04,Cotyledon
31.23,Cotyledon
31.25,Cotyledon
29.23,Cotyledon
29.12,Cotyledon
30.49,Cotyledon
31.24,Cotyledon
28.07,Cotyledon
27.24,Cotyledon
32.46,Hypocotyl
31.56,Hypocotyl
28.2,Hypocotyl
31.44,Hypocotyl
30.06,Hypocotyl
26.54,Hypocotyl
27.33,Hypocotyl
28.66,Hypocotyl
30.95,Hypocotyl
30.33,Hypocotyl
28.86,Hypocotyl
27.93,Hypocotyl
28.33,Hypocotyl
27.39,Hypocotyl
27,Hypocotyl
28.09,Hypocotyl
31.52,Hypocotyl
30.66,Hypocotyl
29.04,Hypocotyl
28.84,Hypocotyl
29.08,Hypocotyl
27.15,Hypocotyl
28.45,Hypocotyl
27.46,Hypocotyl
25.89,Hypocotyl
27.43,Hypocotyl
29.11,Root
29.83,Root
29.04,Root
29.33,Root
29.53,Root
28.67,Root
29.22,Root
27.53,Root
28.98,Root
28.46,Root
30.01,Root
30.06,Root
28.13,Root
28.29,Root
29.2,Root
29.07,Root
28.81,Root
33.39,Root
28.06,Root
27.4,Root
28.17,Root
27.52,Root
29.48,Root
27.06,Root
28.48,Root
28.18,Root
29.48,Root
30,Root tip
30.38,Root tip
28.33,Root tip
27.52,Root tip
30.42,Root tip
28.17,Root tip
27.5,Root tip
27.42,Root tip
