Period (h),Organ
22.925,Cotyledon
25.55,Hypocotyl
28.9666666666667,Root
25.975,Root tip
22.75,Cotyledon
25.55,Hypocotyl
28.6,Root
26.4,Root tip
22.65,Cotyledon
25.45,Hypocotyl
28.5666666666667,Root
24.925,Root tip
22.9,Cotyledon
25.75,Hypocotyl
28.5,Root
26.625,Root tip
22.825,Cotyledon
25.7,Hypocotyl
28.6333333333333,Root
26.675,Root tip
22.75,Cotyledon
25.725,Hypocotyl
28.5666666666667,Root
25.9,Root tip
22.7,Cotyledon
25.45,Hypocotyl
28.4666666666667,Root
25.925,Root tip
22.8,Cotyledon
25.65,Hypocotyl
28.1,Root
26.125,Root tip
22.825,Cotyledon
25.6,Hypocotyl
28.4333333333333,Root
23.4,Root tip
0,
