Frame number,1000000000,1000000001,1000000002,1000000003,
0.000000,535.16,587.936,645.01,644.04,
1.000000,600,676.18,737.015,719.85,
2.000000,821.18,791.428,894.02,879.184,
3.000000,909.16,980.96,974.969,1027.06,
4.000000,869.924,877.516,985.008,1070,
5.000000,930.028,668.987,759.757,1068.4,
6.000000,878.094,743.384,855.18,977.032,
7.000000,909.168,754.055,866.98,1020.13,
8.000000,902.222,812.797,801.904,1054.06,
9.000000,932.52,884.806,778.88,886,
10.000000,785.912,807.163,747.12,885.036,
11.000000,637.056,717.165,735.52,804.009,
12.000000,718.014,688.126,741.032,777.16,
13.000000,640.1,624.952,665.008,731.98,
14.000000,627.968,608.488,643.516,696.052,
15.000000,589.966,592,651.016,660.072,
16.000000,582.05,606.992,663,690.928,
17.000000,644.92,571.032,615.872,651.936,
18.000000,599.11,564.028,662.536,677.08,
19.000000,612.04,602.968,635.956,681.99,
20.000000,628.876,578.976,655.081,693.072,
21.000000,684,630.968,736.432,701.141,
22.000000,660.94,646.458,696.016,752.864,
23.000000,720.061,654.93,725.072,797.12,
24.000000,687.984,694.852,682.052,755.92,
25.000000,678.035,643.09,650.901,751.912,
26.000000,645.02,614.984,648.89,762.96,
27.000000,613.55,611.915,630.984,703.932,
28.000000,627.037,647.99,627.97,679.966,
29.000000,584.947,575.008,622.032,674.968,
30.000000,587.011,566.994,617.944,663.94,
31.000000,573.984,557.926,627.068,633.04,
32.000000,563.91,560.024,607.981,642.92,
33.000000,571.04,543.948,598.032,603.946,
34.000000,544.914,521.04,578.968,614.08,
35.000000,523.998,525.092,570.025,597.98,
36.000000,519.034,539.008,566.064,592.98,
37.000000,553.12,522.034,562.975,568.02,
38.000000,547.034,537.968,588.026,609.028,
39.000000,565.008,566.036,578.93,599.024,
40.000000,576.985,570,621.96,599.012,
41.000000,582.003,582.029,633.067,597.984,
42.000000,595.043,543.026,639.072,609.945,
43.000000,573.987,549.08,645.93,640.994,
44.000000,573.012,527.025,589.934,626.062,
45.000000,555.008,521.98,597.468,614.902,
46.000000,555.016,507.036,587.532,588.042,
47.000000,576.943,516,559.1,607.944,
48.000000,552.989,533.48,544.92,581.978,
49.000000,569.902,519,539.992,576.922,
50.000000,557.965,484.026,547.922,544.01,
51.000000,497.935,507,540.968,560.96,
52.000000,524.984,500,526.966,539.994,
53.000000,490.088,486.012,514.994,536.032,
54.000000,496.001,504.056,538.016,524.936,
55.000000,509.964,502.012,536.946,526.984,
56.000000,505.953,486.96,498.976,523,
57.000000,551.025,510.008,509.99,525.08,
58.000000,537.01,535.04,530.08,534.52,
59.000000,517.904,532.06,510.935,552.042,
60.000000,556.94,511.006,537.992,553.012,
61.000000,531.08,506.997,514.98,519.016,
62.000000,542.025,512.014,488.016,553.068,
63.000000,550.082,502.936,487.008,529.953,
64.000000,516.982,496.97,495.04,529.006,
65.000000,517.052,491,496.99,544.058,
66.000000,500.002,494.93,492.994,522,
67.000000,502.048,494.044,499.026,506.968,
68.000000,517.958,487.992,482.96,509.987,
69.000000,511.062,471.088,477.938,525.008,
70.000000,509.078,477.016,493.011,509.027,
71.000000,483.07,472.992,481.976,507.994,
72.000000,480.984,465.04,480.964,507,
73.000000,493.912,473.98,474.035,498,
74.000000,481.994,482.933,479.992,496.976,
75.000000,480.976,490.984,483.012,516.532,
76.000000,487.03,466.06,475.946,498.991,
77.000000,486.009,484.957,480.022,514.06,
78.000000,476.512,468.98,489.018,509.544,
79.000000,481.994,470.068,521.5,498.024,
80.000000,482.004,460.98,486.008,503.504,
81.000000,474.09,469.005,493.956,497.52,
82.000000,484,468.016,482.481,483.538,
83.000000,478.504,476.978,491.034,490.044,
84.000000,471.986,472.002,478.993,483.976,
85.000000,470.038,464.04,471.008,471.961,
86.000000,464.984,462.025,469.973,479.012,
87.000000,472.001,458.025,455.963,471.972,
88.000000,458.056,438.031,477.05,482.032,
89.000000,460.96,462.992,473.984,468.992,
90.000000,470.02,461,466.972,453.979,
91.000000,479,459.04,469.004,479.012,
92.000000,466.008,476.02,476.029,472.04,
93.000000,470.004,439.023,468.94,494.96,
