Frame number,1000000000,
0.000000,558.048,
1.000000,625.98,
2.000000,619,
3.000000,588.964,
4.000000,585.98,
5.000000,570.064,
6.000000,558.996,
7.000000,530.952,
8.000000,516.968,
9.000000,510.024,
10.000000,480,
11.000000,487.982,
12.000000,490.027,
13.000000,486,
14.000000,496.005,
15.000000,498.5,
16.000000,529.02,
17.000000,574.036,
18.000000,577.034,
19.000000,575.016,
20.000000,561.977,
21.000000,557.48,
22.000000,527.49,
23.000000,523.004,
24.000000,506.528,
25.000000,498,
26.000000,492.044,
27.000000,495.995,
28.000000,491.04,
29.000000,502.97,
30.000000,489.95,
31.000000,521.018,
32.000000,556.992,
33.000000,580.976,
34.000000,579.5,
35.000000,549.94,
36.000000,556.008,
37.000000,531.48,
38.000000,527.985,
39.000000,547.02,
40.000000,530.004,
41.000000,513.032,
42.000000,498.02,
43.000000,497.024,
44.000000,489.016,
45.000000,488.992,
46.000000,494,
47.000000,500.48,
48.000000,530.008,
49.000000,553.029,
50.000000,549.962,
51.000000,555.032,
52.000000,563.5,
53.000000,536.005,
54.000000,537.014,
55.000000,515.514,
56.000000,494.002,
57.000000,503.516,
58.000000,496.009,
59.000000,493.992,
60.000000,487.02,
61.000000,498.976,
62.000000,492.992,
63.000000,509.976,
64.000000,528.967,
65.000000,541.02,
66.000000,535.002,
67.000000,523,
68.000000,542.998,
69.000000,545.026,
70.000000,531.5,
71.000000,514.008,
72.000000,500.996,
73.000000,491.98,
74.000000,497.04,
75.000000,495.505,
76.000000,493.038,
77.000000,499.96,
78.000000,499.991,
79.000000,513.994,
80.000000,538.514,
81.000000,545.014,
82.000000,534.016,
83.000000,538.478,
84.000000,514,
85.000000,516.052,
86.000000,518.032,
87.000000,520.013,
88.000000,500.952,
89.000000,501,
90.000000,497.008,
91.000000,502.5,
92.000000,494.944,
