Time [ms],1000000000,1000000001,1000000002,
0,2402.85,1295.21,1260.1,
1000000000,1926.74,1079.62,1066.12,
2000000000,1869.86,979.232,963.92,
3000000000,1798.68,1054.86,1028.07,
4000000000,1869.54,1132.1,1103.03,
5000000000,1714.39,1168.77,1061.9,
6000000000,1633.3,1036.02,1089.67,
7000000000,1426.92,1106.63,1061.88,
8000000000,1431.53,1037.05,1019.5,
9000000000,1415.98,1065.01,1040.51,
10000000000,1308.65,988.02,1016.99,
11000000000,1334.78,966.984,989.92,
12000000000,1332.56,971,973.92,
13000000000,1404.05,992.168,1012.98,
14000000000,1390.04,1021.04,977.016,
15000000000,1402.95,1125.84,1024.95,
16000000000,1405,1092.14,969.09,
17000000000,1395.17,1136.25,1002,
18000000000,1443.75,1128.08,994.98,
19000000000,1382.82,1196.76,1034.08,
20000000000,1408.94,1260.19,1090,
21000000000,1463.07,1267.86,1071.89,
22000000000,1472.92,1293.22,1053.04,
23000000000,1431.87,1289.1,1061.01,
24000000000,1464,1309.84,993.052,
25000000000,1408.03,1248.84,1001.96,
26000000000,1381.96,1196.16,957,
27000000000,1325.8,1170.08,924.107,
28000000000,1247.11,1102.13,878.97,
29000000000,1215.85,1071.02,860.016,
30000000000,1135,1014.81,842.046,
31000000000,1133.77,1004.13,811.944,
32000000000,1080.97,1022.08,847.09,
33000000000,1078.09,1012.09,810.064,
34000000000,1032.03,1045.07,841.02,
35000000000,1044.92,1004.99,835.122,
36000000000,1027.96,1029.16,833.966,
37000000000,1034.19,1062.91,851.016,
38000000000,1020.9,1071.91,847.094,
39000000000,1008.92,1077,844.981,
40000000000,987.054,1019.14,824.048,
41000000000,1017.96,1038.95,818,
42000000000,969.96,1038.22,774.923,
43000000000,892.94,970.114,772.036,
44000000000,874.956,905.928,735,
45000000000,823,895.048,741.984,
46000000000,786.998,866.092,715.02,
47000000000,766.95,835.08,699,
48000000000,738.96,828.132,692.016,
49000000000,747.076,844,674.996,
50000000000,726.046,822.048,662.059,
51000000000,723.076,812.984,665.992,
52000000000,696,816.076,658.998,
53000000000,695.04,812.9,665.04,
54000000000,715.952,834,674.028,
55000000000,695.04,804,654.984,
56000000000,716.024,830,657.04,
57000000000,710.072,824.942,651.056,
58000000000,731.084,827.068,668.08,
59000000000,727.952,789.472,660.016,
60000000000,702,752.464,634.96,
61000000000,668.954,700.008,635.036,
62000000000,667.94,705.04,624.008,
63000000000,627.046,685,605.004,
64000000000,643.022,674.97,616.95,
65000000000,637,679.067,603.992,
66000000000,626.992,665.448,598.04,
67000000000,616.016,662.084,608.056,
68000000000,630,630,610.048,
69000000000,628.564,660.08,583.972,
70000000000,619.988,679.048,590.016,
71000000000,629.448,663.864,611.004,
72000000000,625,645.042,607.01,
73000000000,623.96,681.01,602.004,
74000000000,617.936,666.9,611.048,
75000000000,617.054,697.952,589.032,
76000000000,625.968,650.944,589.96,
77000000000,585.044,658.1,576.96,
78000000000,602.516,650.96,582.058,
79000000000,581.006,631.984,581.08,
80000000000,585.036,629.98,567.06,
81000000000,585.448,607.112,557.948,
82000000000,583.021,619,561.96,
83000000000,571.916,574.064,560,
84000000000,570.027,566.056,544.944,
85000000000,582.967,601.996,565.044,
86000000000,573.022,590.488,575.932,
87000000000,575,591.992,550.04,
88000000000,581.052,600.044,563.03,
89000000000,578.942,629.032,550.916,
90000000000,574.016,612.053,552.94,
91000000000,556.992,626.012,526.532,
92000000000,577.032,592.006,526,
93000000000,564.024,618.976,531.484,
94000000000,569.024,598.912,507.95,
95000000000,574.04,606.04,539.5,
