Time [ms],1000000000,1000000001,1000000002,1000000003,1000000004,1000000005,
0,1151.02,1620.77,1063.8,1472.96,1026.03,1124.94,
1000000000,904.84,937.664,794.28,1050.04,793.938,857.972,
2000000000,773.256,749.512,703.012,876.08,675.862,747.991,
3000000000,742.208,799.15,687.96,839.12,703.872,723.074,
4000000000,703.08,834.9,665,874.45,659.04,759.15,
5000000000,694.883,802.064,658.032,821.484,659.049,768.08,
6000000000,675.02,831.948,617.988,763.504,620.976,719.94,
7000000000,676.968,831.8,593.036,673.961,600.912,700.476,
8000000000,626.504,753.396,624.512,682.006,616.016,603.97,
9000000000,640.514,896.83,611.92,643.496,627.008,605,
10000000000,618.54,806.856,590.04,633.064,638.984,616.965,
11000000000,638.072,841.88,595.116,641,605.96,593.51,
12000000000,641,792.952,608,621.996,602.952,586.052,
13000000000,646.036,782.168,569.02,615.528,631.014,579.556,
14000000000,630.468,755.022,591.916,600.472,591.504,553.968,
15000000000,625.976,757.97,599.912,624.48,598.06,557.048,
16000000000,624.068,763.048,569.54,625.99,610.052,532.944,
17000000000,665.52,724.089,585.98,635.004,591.028,564.912,
18000000000,669.056,777.918,599.46,669.496,628.926,578.012,
19000000000,640.075,820.001,577.456,690.984,613.022,582.988,
20000000000,655.04,788.92,568.072,709.024,614.094,595.9,
21000000000,645,828.2,560.952,735.956,593.024,578,
22000000000,643.054,823.088,573.088,705.968,580.052,584.9,
23000000000,628.036,826.76,568.08,692.957,576.04,574.098,
24000000000,625.992,827.98,564.942,709.938,566.1,580.98,
25000000000,588.915,820.058,548.992,739.964,564.964,573.94,
26000000000,594.08,818.35,550.038,752.016,581,579.952,
27000000000,557.96,845.1,543,741.038,564,586.96,
28000000000,525.944,819.276,565.062,724.5,565.584,597.016,
29000000000,542.96,794.092,544.022,731.992,559.98,555.978,
30000000000,553.148,815.52,563.006,735.96,558.05,556.48,
31000000000,549.084,783.5,576.951,769,563.952,556.984,
32000000000,571.936,809.18,596.49,775.955,579.913,552.036,
33000000000,548.952,853.92,634.004,791.104,579.022,561.6,
34000000000,579.974,878.956,617.448,841.962,601.973,586.56,
35000000000,572.08,883.944,652.008,868.037,619.112,597.436,
36000000000,601.916,896.92,621.928,862.984,588.053,586.096,
37000000000,607.056,932.768,676.979,929.878,591.032,605.904,
38000000000,597.012,897.04,662.089,914.54,608.925,637.086,
39000000000,586.908,844.024,685.16,921.962,611,661.036,
40000000000,590.044,812.14,666.96,919.902,591.932,663.6,
41000000000,597.146,816.092,674.984,887.9,592,641.024,
42000000000,566.958,764.588,640.024,874.442,597.832,678.18,
43000000000,554.5,738.984,650.372,850.972,566.912,668.072,
44000000000,571.936,758.86,633.538,835.998,588.01,644.052,
45000000000,545.924,728.58,632.01,777.068,571.012,637.488,
46000000000,551.024,712.504,612.48,762.08,583.052,632,
47000000000,565.04,706.984,599.478,772.976,584.984,619.448,
48000000000,568.334,704.032,619.03,736.04,588.924,619.447,
49000000000,569.016,703.93,635.5,768.048,588,599.032,
50000000000,569.15,696.6,634.05,760.125,611.048,611.984,
51000000000,582.036,758,645.486,771.986,607.952,583.992,
52000000000,584.2,765.044,646.56,776.856,624.98,627.024,
53000000000,589.02,742.94,666.544,794.042,620.09,600.432,
54000000000,574.5,770.532,652.536,792.216,638.984,607.946,
55000000000,574.024,735.108,647.004,810.898,630.992,627.964,
56000000000,588.84,786.2,646,818.913,628.977,648.948,
57000000000,573.104,728.468,650.476,830.916,631.92,666.066,
58000000000,568.06,698.15,612.966,842.9,615.932,667.936,
59000000000,545.166,661.98,636.038,828.01,624.996,678.928,
60000000000,559.896,697.9,605.946,817.132,616.032,661.024,
61000000000,558.008,655.052,595.005,771.1,605,652.092,
62000000000,549.024,644.964,571.008,755.12,605.028,637.08,
63000000000,552.056,628.072,582.568,743.1,590.932,599.912,
64000000000,544.968,619.016,574.97,725.925,562.95,591.054,
65000000000,543.952,603.04,560.05,679.992,585.08,567.473,
66000000000,537.078,612.928,558.97,656.072,566.077,582.98,
67000000000,517.96,603.988,558.528,652.08,574.05,562.986,
68000000000,547.072,611.056,551.492,648.992,562.05,549.064,
69000000000,543.076,610.984,552.048,656.08,557.46,546.993,
70000000000,552.052,615.937,554.464,635.08,561.49,549.056,
71000000000,543.024,636.04,559.512,637.04,566.02,538,
72000000000,524.968,615.94,547.504,646,569.965,535.068,
73000000000,540.012,643.04,561.504,653.04,572.029,557,
74000000000,529.975,616.01,551.032,637.04,566.936,560.016,
75000000000,532.006,625.051,552.952,638.935,585.012,562.508,
76000000000,525.064,596.896,535.953,620.996,581.998,559.028,
77000000000,542.95,594,552.033,628.978,567.016,554.975,
78000000000,544.992,603.98,542.987,604.406,572.018,587.04,
79000000000,528.04,597.05,536.952,603.944,570.02,545.044,
80000000000,520.96,570.99,536.944,586.54,534.04,551.045,
81000000000,524.959,560.104,531,595.52,538.952,543.035,
82000000000,505.024,564.1,518.016,576.475,540.02,550.924,
83000000000,494,569.984,522.96,593.516,546.048,532.98,
84000000000,499.956,571.08,509.01,581.972,540.05,530.974,
85000000000,500.988,547.08,507.991,565,536.054,500.942,
86000000000,503.872,546,519.084,570.988,533.999,517.96,
87000000000,509.006,550.944,502.972,556.035,526.984,512.052,
88000000000,509.008,562.955,523.08,561.037,511.05,515.036,
89000000000,487.994,546.943,513.008,553.956,515.02,514.992,
90000000000,497.982,568.1,500,551.002,506.978,510.02,
91000000000,502.988,554.097,496.482,553.96,505.019,502.004,
92000000000,500.98,556.924,488.957,564.018,508.024,501,
93000000000,501.98,553.933,505.017,536.972,505,520.004,
94000000000,476.05,552.99,486.014,552.976,491.02,509.018,
95000000000,485.92,517.056,481.972,546.97,481.036,511.49,
