Time [ms],1000000000,
0,1206.03,
1000000000,609.96,
2000000000,491.976,
3000000000,469.012,
4000000000,439.99,
5000000000,443.997,
6000000000,438.029,
7000000000,439.992,
8000000000,423.944,
9000000000,434,
10000000000,422.05,
11000000000,436.976,
12000000000,421.024,
13000000000,410.968,
14000000000,407,
15000000000,413.987,
16000000000,403.984,
17000000000,409.036,
18000000000,418.004,
19000000000,423.968,
20000000000,415.974,
21000000000,424.025,
22000000000,418.981,
23000000000,429.004,
24000000000,432.003,
25000000000,416.028,
26000000000,422.02,
27000000000,423.976,
28000000000,422,
29000000000,416.04,
30000000000,420.004,
31000000000,417.976,
32000000000,415.986,
33000000000,408.025,
34000000000,417.976,
35000000000,415.972,
36000000000,419.956,
37000000000,423,
38000000000,417.016,
39000000000,413.034,
40000000000,417.004,
41000000000,415.008,
42000000000,411.968,
43000000000,408.016,
44000000000,419.02,
45000000000,409.024,
46000000000,421.014,
47000000000,417.014,
48000000000,416.008,
49000000000,409.976,
50000000000,414.012,
51000000000,418.036,
52000000000,414,
53000000000,416,
54000000000,399.006,
55000000000,420.068,
56000000000,412.998,
57000000000,410.96,
58000000000,415.026,
59000000000,414,
60000000000,404.984,
61000000000,422.973,
62000000000,413.978,
63000000000,413.024,
64000000000,408.972,
65000000000,410.033,
66000000000,408.001,
67000000000,415.018,
68000000000,407.024,
69000000000,412,
70000000000,411.02,
71000000000,416.016,
72000000000,425.024,
73000000000,408.04,
74000000000,404.008,
75000000000,413.028,
76000000000,413.018,
77000000000,413.985,
78000000000,418.02,
79000000000,420.024,
80000000000,409.986,
81000000000,416.976,
82000000000,422.978,
83000000000,407.024,
84000000000,409.032,
85000000000,415.006,
86000000000,415.984,
87000000000,409.062,
88000000000,407.986,
89000000000,409.92,
90000000000,404.044,
91000000000,395.984,
92000000000,405.022,
93000000000,415.016,
94000000000,412.013,
95000000000,416.012,
