Frame number,1000000000,1000000001,1000000002,1000000003,
0.000000,1606.77,857.515,713,1181.26,
1.000000,1100.19,782.172,764.012,984.158,
2.000000,934.496,759.426,778,935.142,
3.000000,1015.92,884.64,857.096,1224.95,
4.000000,1245.64,1120.71,1165.59,1554.14,
5.000000,1406.79,1439.72,1560,2052.5,
6.000000,1370.24,1882.99,1835.21,2630.12,
7.000000,1628.21,1942.1,1936,2861.94,
8.000000,1499.48,2101.58,1864.96,2724,
9.000000,1635.66,1912.96,1644.69,2434.34,
10.000000,1566.92,1442.36,1522.36,2090.63,
11.000000,1386.39,1273.04,1339.92,1750.33,
12.000000,1250.11,1101.18,1059.46,1471.93,
13.000000,1166.93,1009.71,1024.99,1330.62,
14.000000,1034.94,893.459,1086.34,1127.14,
15.000000,950.4,831.045,954.172,1014.03,
16.000000,865.128,786.452,907.832,959.97,
17.000000,860.052,758.15,731.419,914.12,
18.000000,836.128,705.472,748.479,906.632,
19.000000,836.116,718.056,751.602,882.098,
20.000000,832.516,688.16,715.65,874.982,
21.000000,950.44,726.933,723.586,933.102,
22.000000,1023.68,887.25,767,997.145,
23.000000,1094.09,986.876,857.406,1031.99,
24.000000,1122.5,1005.88,911.506,1138.88,
25.000000,1119.99,1026.76,994.892,1215.94,
26.000000,1148.84,1035,994.008,1208.9,
27.000000,1079.77,1037.28,993.96,1246.01,
28.000000,1037.25,958.752,1000.42,1213.07,
29.000000,1058.01,907.528,932.908,1141.9,
30.000000,1003.5,883.128,971.993,1060.93,
31.000000,958.376,850.46,918.488,1045.88,
32.000000,920.208,837.495,853.188,946.001,
33.000000,848.912,827.488,796.112,901.013,
34.000000,846.892,785.4,779.984,909.058,
35.000000,832.96,757.432,765.06,817.01,
36.000000,760.952,735.434,735.572,860.947,
37.000000,780.12,715.536,716.5,838.015,
38.000000,778.912,696.096,701.984,825.938,
39.000000,753.084,708.585,709.48,835.02,
40.000000,779.992,670.089,700.052,842.056,
41.000000,765.08,711.567,679.992,863.05,
42.000000,814.572,744.555,700.008,870.012,
43.000000,808.76,742.116,738.084,868.938,
44.000000,858.48,734.462,720.988,931.034,
45.000000,797.012,739.548,749.036,952.008,
46.000000,790.652,734.96,755.044,932.989,
47.000000,789.992,751.99,766.036,905.048,
48.000000,848.332,730.45,739.04,907.897,
49.000000,835.02,696.037,723.08,886.948,
50.000000,777.976,739.117,744.568,868.016,
51.000000,779.12,732.004,734.056,831.974,
52.000000,731.06,699.528,642.024,816.078,
53.000000,685.968,717.895,667.994,780.997,
54.000000,630.52,747.082,618.512,781.066,
55.000000,655.496,671.884,623,791.949,
56.000000,632.076,689.936,626.09,745.967,
57.000000,659.984,671,598.935,756.93,
58.000000,691.056,681.952,607.5,730,
59.000000,651.04,643,595.055,729.062,
60.000000,692.522,681.056,585.091,766.974,
61.000000,716.064,659.184,607.047,798.552,
62.000000,770.024,636.868,648.984,791.016,
63.000000,725.992,661.06,654.48,838.49,
64.000000,718.992,639.904,663.576,838.06,
65.000000,698.144,664.1,661.506,826.446,
66.000000,735.92,663.052,704.522,842.568,
67.000000,729.084,660.087,668.898,825.512,
68.000000,727.906,677.081,697.576,795.464,
69.000000,671.12,623.99,650.584,791.029,
70.000000,677.988,660.02,659.01,784.544,
71.000000,702,686.044,645.087,788.091,
72.000000,667.486,658,607,782.424,
73.000000,676.02,684.92,606.52,788.048,
74.000000,649.933,714.12,591.476,775.453,
75.000000,638.956,687.092,579.96,764.608,
76.000000,622.96,685.108,594.9,761.5,
77.000000,628.968,678.072,601.944,756.948,
78.000000,609.06,661.08,577.52,763.096,
79.000000,683.02,645.912,608.04,759,
80.000000,635.96,655.08,604.976,752.024,
81.000000,680.96,633.88,607.52,786.9,
82.000000,704.94,648.1,642.048,714.919,
83.000000,679.912,635,653.516,733.004,
84.000000,683.056,646.996,669.428,749.074,
85.000000,661.996,663.024,639.5,779.104,
86.000000,690.556,672.088,643.952,795.06,
87.000000,667.04,668.083,635.968,818,
88.000000,667.02,668.96,632,816.076,
89.000000,669.008,680.036,629.04,754,
90.000000,650.444,649.05,613.06,754.056,
91.000000,662.048,637.912,592,761.076,
92.000000,648.028,639.07,610.536,733.052,
93.000000,641.516,644.951,584.02,718,
94.000000,650.976,650,583.03,695.968,
95.000000,667.056,640.045,570.96,733,
96.000000,664.044,654.024,582.974,742.016,
