Frame number,1000000000,
0.000000,481.974,
1.000000,439.06,
2.000000,429.962,
3.000000,428.02,
4.000000,424.008,
5.000000,423,
6.000000,425.024,
7.000000,430.988,
8.000000,411.014,
9.000000,416.932,
10.000000,415.028,
11.000000,415,
12.000000,406.05,
13.000000,421.022,
14.000000,415.976,
15.000000,415.006,
16.000000,449.009,
17.000000,425,
18.000000,419.038,
19.000000,422.04,
20.000000,426.989,
21.000000,417.985,
22.000000,408.993,
23.000000,416.02,
24.000000,417.984,
25.000000,413.996,
26.000000,414.978,
27.000000,414.994,
28.000000,409.968,
29.000000,409.99,
30.000000,410.968,
31.000000,413.98,
32.000000,420.984,
33.000000,417.974,
34.000000,407.992,
35.000000,408.98,
36.000000,419.038,
37.000000,416.022,
38.000000,413.025,
39.000000,407.036,
40.000000,419.028,
41.000000,416.024,
42.000000,413.976,
43.000000,411.946,
44.000000,409.028,
45.000000,418.016,
46.000000,403.96,
47.000000,408.98,
48.000000,420.008,
49.000000,407,
50.000000,405.98,
51.000000,403.984,
52.000000,404.958,
53.000000,410,
54.000000,408.968,
55.000000,414.034,
56.000000,405,
57.000000,412.993,
58.000000,411.016,
59.000000,424.976,
60.000000,419.992,
61.000000,411.996,
62.000000,410.971,
63.000000,412.996,
64.000000,410.98,
65.000000,405.988,
66.000000,407.01,
67.000000,414.012,
68.000000,405.009,
69.000000,418.984,
70.000000,409,
71.000000,406.96,
72.000000,404.994,
73.000000,413.984,
74.000000,399.03,
75.000000,407.02,
76.000000,405.028,
77.000000,409.04,
78.000000,412.005,
79.000000,404.96,
80.000000,402.991,
81.000000,410,
82.000000,408.988,
83.000000,409.988,
84.000000,414.038,
85.000000,409.034,
86.000000,406.982,
87.000000,408.044,
88.000000,405.98,
89.000000,410.032,
90.000000,398.004,
91.000000,413.996,
92.000000,406.044,
93.000000,402.032,
94.000000,413.018,
95.000000,407.024,
