Frame number,1000000000,1000000001,1000000002,1000000003,1000000004,
0.000000,3030.4,3477.08,5702.84,9650.89,5297.7,
1.000000,3748.26,4279.03,3740.14,10025.3,6690.92,
2.000000,4354.57,4410.59,4119.84,7445.07,7787.36,
3.000000,5161.55,5390.03,5573.57,8860.57,7954.94,
4.000000,5353.42,6262.08,6110.01,7454.12,7568,
5.000000,4254.91,5761.34,6297.57,6443.67,6184.88,
6.000000,3356.19,5119.02,5032.26,4294.42,5216.7,
7.000000,2716.86,4245.28,3578.59,3227.7,4196.5,
8.000000,2081.24,3472.09,3313.38,2234.35,3120.01,
9.000000,1621.92,3050.19,2694.7,1659.94,2600.19,
10.000000,1413.86,2567.89,2307.99,1317.3,2216.86,
11.000000,1205.08,2290.9,2244.13,1164.17,1836.8,
12.000000,1035.85,2018.09,1820.29,1071.18,1557.32,
13.000000,984.976,2110.24,1647.33,1001.74,1372.29,
14.000000,935.92,1884.34,1587.83,1063.53,1248.09,
15.000000,885.064,1677.95,1497.06,1130.09,1229.29,
16.000000,945.092,1606.53,1531.41,1503.86,1189.77,
17.000000,1101.9,1658.83,1584.73,2205.32,1419.18,
18.000000,1599.1,1976.83,1979.04,3575.1,2122.16,
19.000000,2235.37,2598.02,2826.3,4841.2,3046.39,
20.000000,2802.28,3314.94,3757.96,5099.54,3796.81,
21.000000,2853.2,3726,4091.99,4303.75,3863.69,
22.000000,2613.06,3700.42,4007.04,3441.82,3374,
23.000000,2130.78,3266.26,3884.4,2557.07,2704.83,
24.000000,1715,2935.98,3307.65,1697.37,2252.37,
25.000000,1501.34,2543.53,2945.22,1323.64,1863.87,
26.000000,1293,2307.16,2500.8,1112.88,1559.85,
27.000000,1098.03,1969.16,2077.6,1032.24,1296.15,
28.000000,947.916,1660.24,1839.2,953.128,1136.53,
29.000000,875.114,1468,1602.88,923.1,960.074,
30.000000,798.92,1301.86,1460.85,906.46,885.99,
31.000000,756.928,1240.92,1365.01,949.492,904.939,
32.000000,753.982,1118.91,1267.95,1269.91,879.988,
33.000000,777.028,1111.86,1306.16,1866.56,980.959,
34.000000,936.12,1137.85,1472,3088.85,1151.2,
35.000000,1161.06,1301.24,1727.19,4497.1,1547.93,
36.000000,1589.94,1613.65,2111.89,4598.64,2146.96,
37.000000,2050,2046,2368.09,3930.23,2769.11,
38.000000,2395.17,2516.46,2712.57,3345.39,3165.76,
39.000000,2460.19,2883.78,2987.66,2381.58,2990.82,
40.000000,2195.09,2783.58,2873.52,1736.07,2532.7,
41.000000,1783.92,2586.64,2572.34,1373.17,1971.23,
42.000000,1443.92,2302.55,2280.38,1114.06,1530.93,
43.000000,1182.96,1945.23,1985.94,971.006,1292.9,
44.000000,997.998,1728.96,1784.21,892.985,1088.1,
45.000000,889.961,1455.53,1552.07,867.974,950.004,
46.000000,786.888,1204.92,1420.64,860.022,844.978,
47.000000,733.024,1128.81,1316.92,909.085,830.118,
48.000000,715.952,1057.1,1280.89,1235.04,831.974,
49.000000,712.068,965.036,1287.83,1925.9,864.96,
50.000000,779.12,995.89,1341.82,3082.35,994.852,
51.000000,925.04,1092.01,1579.86,3921.85,1219,
52.000000,1076.95,1076.98,1538.08,3979.93,1622.9,
53.000000,1411.06,1210.09,1648.22,3287.29,2120.35,
54.000000,1758.52,1395.01,1904.87,2688.71,2521.36,
55.000000,1981.44,1695.35,2157.52,1996.68,2686.13,
56.000000,2081.23,2062,2331.33,1585.9,2393.4,
57.000000,1870.12,2148.36,2172.33,1293.74,2109.34,
58.000000,1689.85,2147.95,2192.02,1124.94,1795.27,
59.000000,1389.12,1962.13,2163.08,1012,1445.29,
60.000000,1142.98,1853.23,1879.34,900.98,1190.87,
61.000000,961,1613.86,1637.2,901.908,949.111,
62.000000,838.872,1393.1,1460.96,905.92,905.932,
63.000000,756.508,1189,1317.32,1094.16,819.872,
64.000000,716.14,1104.95,1269.88,1568.27,817.095,
65.000000,681.008,1045.12,1327.13,2483.92,823.058,
66.000000,735.6,1003.94,1403.12,4048.91,930.178,
67.000000,788.459,1000,1428.08,4155.42,1105.11,
68.000000,918.852,1010.92,1458.16,3498.2,1362.86,
69.000000,1146.88,1006.03,1338.22,3025.26,1760,
70.000000,1452.87,1015.11,1380.8,2426.05,2405.19,
71.000000,1696.07,1136,1572.35,1880.58,2692.76,
72.000000,1866.73,1311.35,1734.83,1465.85,2641.37,
73.000000,1878.97,1517.5,1931.48,1194,2283.1,
74.000000,1551.14,1654.94,2001.88,1061.9,1820.03,
75.000000,1426.46,1842.57,1975,946.114,1551.82,
76.000000,1220.12,1774.15,1845.73,887.92,1229.02,
77.000000,1032.11,1740.31,1764.06,891.454,1044.89,
78.000000,894.975,1589.2,1676.17,1048.1,948,
79.000000,825.118,1440.3,1532.15,1388.95,890.1,
80.000000,761.512,1303.79,1650.17,2139.78,865,
81.000000,707,1161.3,1494.18,3175.78,896.94,
82.000000,736.016,1125.24,1532.26,3542.46,978.064,
83.000000,777.009,1071.79,1491.92,3390,1099.24,
84.000000,944.024,1076.06,1436.34,2896.94,1451.9,
85.000000,1167.51,989.9,1389.17,2446.5,2011.93,
86.000000,1367.14,930.06,1409.24,1931.5,2255.71,
87.000000,1676.24,1018.18,1433.02,1448,2690.67,
88.000000,1937.62,1006.24,1542.2,1155.94,2714.52,
89.000000,1929.22,1195.29,1706.92,948.524,2370.98,
90.000000,1829.56,1355.14,1963.29,837.564,2081.23,
91.000000,1570.77,1640.73,1990.4,782,1705.06,
92.000000,1379.02,1696.56,2117.54,803.028,1465.66,
93.000000,1230.2,1817.04,2052.33,903.16,1283.21,
94.000000,1079.01,1685.65,2044.46,1170.97,1193.01,
