Time [s],1000000000,
0.000000,448.997,
1.000000,474.059,
2.000000,441.032,
3.000000,431,
4.000000,427.976,
5.000000,420.012,
6.000000,428.016,
7.000000,420,
8.000000,427.024,
9.000000,440,
10.000000,430.024,
11.000000,440.002,
12.000000,454.96,
13.000000,463.028,
14.000000,458.968,
15.000000,461.02,
16.000000,464.984,
17.000000,446.024,
18.000000,433.008,
19.000000,428.993,
20.000000,425.995,
21.000000,424.984,
22.000000,420.988,
23.000000,419.037,
24.000000,426,
25.000000,444.024,
26.000000,439.984,
27.000000,441.984,
28.000000,445.038,
29.000000,450.06,
30.000000,460.02,
31.000000,454.962,
32.000000,450.024,
33.000000,449.028,
34.000000,432.992,
35.000000,416.029,
36.000000,431,
37.000000,413.004,
38.000000,425.982,
39.000000,423.98,
40.000000,423.006,
41.000000,428.022,
42.000000,430.988,
43.000000,426.015,
44.000000,442.026,
45.000000,445.032,
46.000000,459.018,
47.000000,450.01,
48.000000,458.04,
49.000000,436,
50.000000,426,
51.000000,431.022,
52.000000,407.99,
53.000000,417.99,
54.000000,410.042,
55.000000,421.948,
56.000000,419.978,
57.000000,432.475,
58.000000,436.504,
59.000000,431.48,
60.000000,428.012,
61.000000,444.5,
62.000000,443.007,
63.000000,447.518,
64.000000,444.464,
65.000000,432.504,
66.000000,424.992,
67.000000,416.02,
68.000000,416.52,
69.000000,411.048,
70.000000,416.032,
71.000000,418.008,
72.000000,412.004,
73.000000,430.53,
74.000000,430.042,
75.000000,428.496,
76.000000,439,
77.000000,435.464,
78.000000,438.49,
79.000000,453.489,
80.000000,445.011,
81.000000,430.496,
82.000000,421.515,
83.000000,411.01,
84.000000,415.504,
85.000000,412,
86.000000,411.54,
87.000000,417.536,
88.000000,409,
89.000000,418.5,
