Frame number,1000000000,
0.000000,430.004,
1.000000,435.516,
2.000000,434.02,
3.000000,441.995,
4.000000,462.036,
5.000000,456.032,
6.000000,456,
7.000000,450.976,
8.000000,452.971,
9.000000,445.024,
10.000000,450.964,
11.000000,440.496,
12.000000,438.004,
13.000000,424.988,
14.000000,428.976,
15.000000,430.025,
16.000000,436.02,
17.000000,433.52,
18.000000,436.52,
19.000000,437.992,
20.000000,437.008,
21.000000,440.012,
22.000000,435.012,
23.000000,430.992,
24.000000,449.046,
25.000000,445.02,
26.000000,437.05,
27.000000,431.992,
28.000000,433.97,
29.000000,429.024,
30.000000,440.004,
31.000000,435,
32.000000,436.004,
33.000000,439.01,
34.000000,429,
35.000000,440.488,
36.000000,436.974,
37.000000,439.493,
38.000000,433.012,
39.000000,442.972,
40.000000,438.007,
41.000000,440.512,
42.000000,431.01,
43.000000,433.016,
44.000000,437.02,
45.000000,439,
46.000000,423.998,
47.000000,436.52,
48.000000,437.016,
49.000000,433.992,
50.000000,437.494,
51.000000,421.48,
52.000000,429.5,
53.000000,429.496,
54.000000,431.504,
55.000000,432.55,
56.000000,436.501,
57.000000,430.505,
58.000000,435.519,
59.000000,432.012,
60.000000,428.018,
61.000000,432.032,
62.000000,437.48,
63.000000,434.488,
64.000000,437.992,
65.000000,432.04,
66.000000,428.984,
67.000000,429.981,
68.000000,419.975,
69.000000,429.512,
70.000000,425.484,
71.000000,430.025,
72.000000,430.532,
73.000000,428.484,
74.000000,429,
75.000000,428.98,
76.000000,428,
77.000000,429.488,
78.000000,427.498,
79.000000,431.492,
80.000000,433,
81.000000,433.52,
82.000000,426.984,
83.000000,433.024,
84.000000,425.016,
85.000000,433.503,
86.000000,432.524,
87.000000,426.472,
88.000000,425.024,
89.000000,429.988,
90.000000,422.492,
91.000000,418.976,
92.000000,428.5,
93.000000,426.996,
94.000000,426.504,
95.000000,431.04,
