Time [s],1000000000,1000000001,1000000002,1000000003,1000000004,1000000005,1000000006,1000000007,
0.000000,32715.1,17351.3,28879.1,48144.9,28868.4,19066.3,18258.2,16632.6,
1.000000,9043.58,10116.7,6179.65,17073.5,4831.06,11515.1,9343.59,7825.98,
2.000000,5506.24,5390.02,2929.86,7222,2439.6,5774.3,6466.83,5314.62,
3.000000,4130.69,2825.51,2004.71,3764.4,1730.52,2912.58,4406.26,3354.87,
4.000000,2973.81,1614.64,1773.93,2610.96,1406.5,1968.87,3319.19,2271.26,
5.000000,2168.05,1134.59,1421.88,2003.78,1140.49,1472.12,2380.33,1712.86,
6.000000,1773.73,1027.78,1157.94,1462.02,1057.1,1163.93,1779.96,1254.91,
7.000000,1442.09,813.008,1048.96,1155.75,990.07,935.922,1345.62,920.834,
8.000000,1242.56,968.938,1173.91,1182.96,1073.03,1040.01,1342.07,873.072,
9.000000,1516.99,1540.15,1734.98,1631.85,1562.14,2243.11,1339.56,936.951,
10.000000,1360.19,2374.76,1808.85,2005.14,1689.05,3758.64,1718.78,1185.11,
11.000000,1785.94,4218.55,2819.6,2918.14,2578.76,5028.64,2253.02,1618.8,
12.000000,2411.25,4660.06,4405.71,4715.37,4108.88,6689.56,3889.38,2460.15,
13.000000,3282.18,5346.77,6143.35,6318.92,5443.48,6872.5,4693.11,3172.21,
14.000000,3890.98,4920.43,7060.17,6222.13,6039.35,5104.87,4226.16,2881.38,
15.000000,3944.05,3491.29,5951.64,4437.27,4852.88,3853.54,3232.48,2165.53,
16.000000,3979.1,2284.62,5116.74,3810.17,4663.44,2806.88,2868.23,1821.85,
17.000000,2952.08,2080.33,3540.68,2920.58,3127.9,2095.92,2317.78,1420.01,
18.000000,2285.99,1824.92,2576.91,2737.56,2276,1853.55,1973.97,1238.02,
19.000000,1910.52,1604,2184.1,2508.54,1904.18,1687.16,1826.24,1153.9,
20.000000,1927.09,1489.87,2073.18,2527.07,1783.86,1585.26,1754.09,1091.19,
21.000000,1924.97,1276.52,2140.9,2234.06,1730.95,1439.22,1669.21,1039.56,
22.000000,1922.89,1096.94,2111.16,1681.46,1658.91,1215.01,1670.78,1000.04,
23.000000,1953.07,967.44,1794.6,1378.81,1475.94,1036.06,1491.8,869.024,
24.000000,2432.92,1044.83,1738.25,1425.87,1509.88,1094.93,1419.1,865.492,
25.000000,2168.81,1148.58,1588,1338.19,1662.62,1222.12,1326.96,882.038,
26.000000,1870.03,1579.93,1469.15,1794.36,1495.94,1863.63,1289.05,901.93,
27.000000,1996.04,2734.18,1868.31,2426.4,2373.03,3281.27,1742.29,1228.1,
28.000000,2642.86,3895.82,2925.49,4287.2,3821.72,5407.41,2688.12,2019.12,
29.000000,3948.76,3737.6,4595.46,6317.71,5356.89,4664.43,3854.71,2891.45,
30.000000,4690.82,3395.37,5307.5,5966.41,6011.29,3986.96,3985.81,3013.78,
31.000000,4408.68,3228.22,5118.3,4094.3,5104.07,3260.64,3301.74,2316.01,
32.000000,4520.2,2420.17,4756.39,3346.69,4504.31,2181.94,3128.89,1997.12,
33.000000,2945.51,1684.2,3271.65,2638.78,2693.05,1650.77,2640,1692.96,
34.000000,2323.54,1436.07,2329.66,2311.17,1978.2,1444.94,2182.06,1364.08,
35.000000,2031.93,1320.96,2157.75,1996.88,1657,1301.09,1874.02,1173.03,
36.000000,1886.37,1250.07,2290.4,1887.09,1573.85,1240.02,1736.88,1080.56,
37.000000,1848.66,1167.03,2213.88,1788.12,1538.78,1187.05,1605.46,1040.96,
38.000000,1857.86,1059.5,2174.89,1672.02,1438.91,1077.02,1584,1022.49,
39.000000,1893.94,903.04,2061.12,1392.94,1309.98,899.32,1512.98,943.368,
40.000000,1936.92,1054.93,2138.73,1330.79,1312.91,920.96,1463.91,924.456,
41.000000,1714,956.48,1825.99,1405.8,1414.9,1021.9,1370.08,901.991,
42.000000,1630,1072.05,1517.96,1287.91,1253.07,1217.09,1196.94,837.984,
43.000000,1761.04,1506.68,1706.12,1806.89,1662.34,1871.68,1153.99,871.912,
44.000000,2210.97,2257.98,2336.67,3147.53,2551.1,2958.54,1640.97,1254.07,
45.000000,2975.01,3265.84,3454.37,4504.84,3604.35,4586.36,2394.81,1830.04,
46.000000,3606.15,3202.12,4761.28,4774.26,4424.55,4036.61,2803.98,2105.65,
47.000000,3706.03,2600.47,5053.52,3760.17,4446,2948.56,2761.1,1878,
48.000000,3558.06,2195.13,4875.65,3325.94,4044.94,2555.13,2814.05,1717.96,
49.000000,2522.11,1744.9,3292.54,2724.9,2495.36,1907.28,2339.7,1497.19,
50.000000,1959.95,1523.96,2351.28,2169.1,1911.12,1661.86,1979.46,1198.27,
51.000000,1701.02,1389.5,2044.84,1893.37,1591.4,1407.04,1690.96,1054.05,
52.000000,1632.96,1310.58,2096.74,1762.93,1519.12,1299.43,1548.88,947.062,
53.000000,1603.98,1255.63,2154.14,1618.08,1445.03,1229.44,1396.06,914.064,
54.000000,1640.06,1149.96,2100.25,1514.15,1249.99,1156.17,1352.94,876.88,
55.000000,1574.46,1028,1846.98,1310.87,1149.14,1036.55,1303.15,833.978,
56.000000,1694,1054.6,1947.07,1256.56,1207,945.408,1396.08,816.936,
57.000000,1607.89,962,1812.9,1314.81,1313,993.016,1270.2,876.94,
58.000000,1477.1,947.07,1404.93,1183.11,1178.85,924.56,1116.98,783.036,
59.000000,1452.85,1199.93,1772.3,1558.06,1572,1174.17,1132.98,772.986,
60.000000,1909.44,1807.76,2379.46,2500.28,2558.9,1836.1,1380.83,1135.96,
61.000000,2630.22,2523.32,3269.66,3235.22,3686.9,2679.01,1880.42,1544.1,
62.000000,3355.97,2767.12,4432.16,3492,4703.13,2972.83,2352.16,1887.57,
63.000000,3385.29,2531.58,5350.57,3216.21,4373.52,2423.6,2386.54,1599,
64.000000,3535.48,2412.66,4911,3043.84,4009.67,2297.5,2853.2,1657.01,
65.000000,2417.95,1984,3028.14,2389.33,2171.37,1877.46,2213.52,1310.08,
66.000000,1868.89,1668.03,2160.19,1942.84,1721.08,1513.91,1818.94,1094.02,
67.000000,1687.87,1443.2,1931.94,1667.07,1535.99,1288.44,1505.29,928.024,
68.000000,1608.04,1272.89,1917.22,1508.98,1442.25,1167.54,1286.86,847.984,
69.000000,1528.11,1300.93,1951.12,1449.16,1314.45,1165.6,1248.92,824.456,
70.000000,1531.91,1318,1767.94,1393.82,1191.62,1105.02,1189.85,766.974,
71.000000,1508.07,1176.05,1511.9,1199.03,1068.04,1038.18,1140.14,756.044,
72.000000,1652.07,1182.02,1633.1,1193.96,1151.6,1033.04,1199.1,769.528,
73.000000,1681.89,1002.05,1615.96,1180.13,1251.64,935.976,1090.02,799.02,
74.000000,1457.03,921.94,1385,1141.05,1041.98,870,1024.22,710.504,
75.000000,1495.07,1104.92,1737.29,1477.26,1479.78,976.96,994.6,752.44,
76.000000,1823.86,1619.64,2559.34,2265.88,2445.31,1484.15,1210.41,1008,
77.000000,2436.2,2168,3633.31,3159.79,3577.55,2076.4,1641.34,1333.49,
78.000000,3158.4,2596.25,4748.8,3405.5,4434.94,2495.69,2036.81,1504.02,
79.000000,3345.33,2447.94,4936.11,3045.1,4041.12,2494.94,2276.73,1397.9,
80.000000,3351,2384.77,4578.44,2724.75,3483.65,2537.33,2449.69,1443.91,
81.000000,2245.94,2020.29,2912.98,2236.78,2088.84,2301.89,2003.7,1218.08,
82.000000,1746.51,1666.51,2095.86,1736.75,1629.1,1754.52,1666.39,1001,
83.000000,1630.84,1442,1944.84,1459.15,1434.25,1315.18,1372,881.023,
84.000000,1564.95,1316.14,1980.2,1343.01,1386.21,1212.16,1204.89,794.124,
85.000000,1469.04,1254.94,1925.9,1234.99,1275,1190.3,1116.95,742.938,
86.000000,1438.05,1236.98,1664.9,1186.93,1122.69,1174.18,1096.02,743.007,
87.000000,1351,1170.45,1401.99,1097.98,1005,1093.11,1044.1,726.936,
