Time [s],1000000000,1000000001,1000000002,1000000003,1000000004,1000000005,1000000006,1000000007,
0.000000,9502.12,2761.37,2698.84,4020.96,6904.57,2278.72,3172.95,3246.56,
1.000000,1701.02,1103.47,874.482,923.896,2090.11,734.562,980.741,900.429,
2.000000,999.508,759.82,609.603,614.646,1378.98,494.833,657.776,796.942,
3.000000,866.754,634.984,565.685,611.661,1274.19,524.775,589.04,805.952,
4.000000,709.94,563.392,543.276,547.485,1092.95,519.447,550.31,588.034,
5.000000,624.94,534.604,529.325,577.322,885.62,482.532,518.82,577.806,
6.000000,591.909,531.992,513.665,520.254,870.4,473.348,508.837,532.984,
7.000000,562.048,521.432,504.683,522.816,700.774,463.128,499.813,513.956,
8.000000,558.016,535.542,531.076,569.05,684.78,524.22,496.114,524.94,
9.000000,688.632,633.49,646.256,684.06,854.992,568.653,589.023,628.827,
10.000000,730.662,789.91,765.12,866.025,1066.1,669.972,608.965,784.8,
11.000000,995.01,1059.75,954.06,1223.59,1321.16,935.591,847.695,1053.97,
12.000000,1344.4,1504.96,1331.87,1642.22,1972.49,1129.65,1168.98,1538.36,
13.000000,1621.04,1503.83,1621.19,1925.19,2451.17,1287.68,1369.2,1775.25,
14.000000,1483.23,1568.4,1557.49,1714.76,2362.98,1427.68,1221.88,1488.95,
15.000000,1303.48,1613.4,1385.74,1557.6,2086.99,1360.24,1181.99,1276.75,
16.000000,1145.91,1004.6,1169.71,1301.05,1533.89,1216.54,855.25,1054.4,
17.000000,797.869,773.657,842.708,845.274,1062.15,901.855,783.174,756.934,
18.000000,637.071,648.915,659.708,654.199,814.89,666.588,611.828,631.109,
19.000000,595.99,570.75,630.676,580.193,708.128,592.97,530.92,579.036,
20.000000,551.1,531.075,564.184,538.923,611.194,564.2,533.91,526.972,
21.000000,519.976,493.076,556.5,547.02,633.888,534.92,504.938,494.968,
22.000000,482.55,504.478,509.396,523.145,579.962,537.441,526.882,482.91,
23.000000,480.502,514.568,505.122,503.1,539.929,526.924,474.941,465.973,
24.000000,505.528,514.52,528.992,543.18,610.952,539.859,492.08,501.973,
25.000000,810.4,608.496,849.344,658.988,1200.57,652.912,632.343,629.092,
26.000000,877.6,768.338,870.98,847.392,1238.02,812.581,794.658,737.84,
27.000000,939.982,1083.4,1082.47,1255.02,1436.29,1146.52,1000.8,942.562,
28.000000,1184.21,2124.85,1501.17,1804.44,1397.84,1915.82,1249.67,1209.93,
29.000000,1419.29,1516.85,1814.95,1948.81,1660.73,1615.41,1422.25,1432.72,
30.000000,1299.05,1440.22,1999.9,1664.83,2020.16,1636,1315,1413.08,
31.000000,1200.89,1377.07,1745.31,1170.09,1881,1488.4,1210.75,1236.21,
32.000000,940.822,1240.14,1118.34,1047.51,1633.79,1124.1,978.238,1005.43,
33.000000,719.92,826.135,763.51,772.765,1017.15,825.321,689.144,675.897,
34.000000,587.035,681.94,649.828,631.745,675.37,658.164,568.979,571.512,
35.000000,534.992,610.06,582.012,554.903,639.704,568.128,497.958,499.976,
36.000000,499.981,542.854,557.072,531.038,570.83,536.92,490.076,482.464,
37.000000,483.988,512.976,528.074,526.003,549.886,518.065,491.997,477.04,
38.000000,452.98,502.969,524.974,520.92,484.977,504.12,470.017,461.074,
39.000000,463,479.94,510.12,487.824,460.013,478.98,445.96,462.48,
40.000000,477,520.892,543.982,519.014,517.02,506.844,475.945,484.516,
41.000000,745.144,624.07,1107.75,640.164,975.01,589.112,672.958,671.462,
42.000000,713.172,762.961,939.551,795.831,840.6,670.84,837.73,817.03,
43.000000,718.38,1015.46,976.585,1026.97,1008.17,845.066,857.035,823.02,
44.000000,896.56,1365.66,1134.25,1396.47,1178.81,1014.08,1055.52,961.968,
45.000000,930.704,1492.04,1286.85,1576.33,1390.56,1220.65,1103.9,1038.88,
46.000000,957.526,1263.03,1258.83,1495.06,1283.67,1137.95,1101.71,1069.76,
47.000000,875.322,1158.68,1313.81,1267.74,1158.04,1038.37,1171.26,995.608,
48.000000,755.184,923.938,1089.61,1085.29,802.36,756.5,908.6,829.122,
49.000000,575.137,662.12,715.213,688.312,648.224,627.728,659.956,616.544,
50.000000,525.048,577.07,613.132,573.48,539.032,561.82,543.07,534.08,
51.000000,482.96,532.01,524,510.36,496.48,514.035,495.007,498.988,
52.000000,469.96,480.992,517.99,493.08,475.974,486.994,493.993,465.996,
53.000000,461.996,485.092,495.044,484.88,462.067,463.041,469.528,450.512,
54.000000,455,471.88,485.954,503.862,479.6,490.976,477.5,453.956,
55.000000,448.992,470.98,473.993,476.552,466.5,471.017,456.993,444.528,
56.000000,453.008,508.002,483.998,493.48,477.04,480.968,493.902,483.045,
57.000000,619.998,588.82,816.173,666.676,633.35,618.92,619.228,627.444,
58.000000,690.054,693.376,802.341,807.62,672.84,773.995,751.466,732.956,
59.000000,737.808,842.216,897.162,937.578,746.772,909.616,809.574,805.178,
60.000000,836,950.422,1018.74,1081.04,895.288,1066.18,1000.78,837.86,
61.000000,897.096,1248.88,1154.82,1206.03,1005.2,1161.41,1071.94,969.95,
62.000000,953,1259.87,1143.47,1177.81,962.144,1117.43,1090.21,947.672,
63.000000,940.533,1149.35,1144.36,1156.57,889.3,1108.15,995.066,847.26,
64.000000,718.156,884.38,1005.3,1016.44,802.544,906.617,820.596,757.505,
65.000000,603,704.272,746.691,706.223,603.815,667.729,639.936,608.6,
66.000000,493.024,615.09,618.247,581.167,515.127,574.927,573.224,519.001,
67.000000,486.975,509.848,538.917,518.072,477.623,509.909,502.068,483.008,
68.000000,463.998,498.97,497.072,488.1,466.933,482.023,480.99,466,
69.000000,455.998,490.936,511.446,461.022,456.928,473.957,460,459.021,
70.000000,446.993,469.112,467.988,473.013,442.962,467.007,458.952,447.484,
71.000000,440.016,469.976,462.014,472.043,445.96,443.959,466.972,453.012,
72.000000,465.494,481,497.52,499.011,473.978,514.056,496.96,473.066,
73.000000,560.9,603.068,818.716,608.052,624.992,639.821,586.985,563.469,
74.000000,618.412,680.88,854.38,778.83,608.965,727.173,734.7,670.944,
75.000000,691.01,825.412,946.415,906.729,709.268,820.69,858.396,704.034,
76.000000,815.232,904.984,1004.57,1017.07,766.426,926.689,997.203,832.593,
77.000000,848,1045.87,1162.7,1141.44,763.692,907.036,1070.41,919.672,
78.000000,811.095,1048.91,1119.1,1138.43,764.547,912.588,1084.66,848.064,
79.000000,813.116,1026.16,1044.94,1063.98,814.217,823.008,931.825,797.756,
80.000000,708.863,860.92,866.036,896.45,670.781,761.294,859.323,705.14,
81.000000,578.01,664.552,679.528,682.912,556.059,622.801,660.2,559.96,
82.000000,499.96,577.246,582.396,591.26,497.123,527.796,533.124,490.495,
83.000000,470.944,538.15,534.9,531.075,478.019,496.039,510.921,474.032,
84.000000,453.968,488.984,487.076,491.928,454.989,484.96,509.548,445.024,
85.000000,452.023,500.959,486.52,468.95,443.032,474.028,483.07,437.035,
86.000000,445.972,477.005,471.52,468,431.939,466.014,461.044,436.012,
87.000000,441.002,459.1,458.576,459.064,433.977,445.936,455.973,439.99,
