Time [ms],1000000000,1000000001,1000000002,
0,3739.56,4567.3,2801.19,
1000000000,1894.38,1313.19,1657.97,
2000000000,1237.2,1616.16,1273.09,
3000000000,1713.36,1176.41,2033.27,
4000000000,1907,1212.19,1041.76,
5000000000,1157.36,1254.44,1183.46,
6000000000,1555.72,1255.27,1041.97,
7000000000,953.34,839.144,1132.84,
8000000000,1087.42,914.256,1124.83,
9000000000,826.76,849.8,873.313,
10000000000,797.716,923.224,872.03,
11000000000,810.448,853.238,817.988,
12000000000,584.008,707.988,805.063,
13000000000,870.856,752,750.128,
14000000000,773.248,732.02,786.26,
15000000000,790.816,775,691.895,
16000000000,1044.08,776.074,652.265,
17000000000,1122.5,875.245,702.05,
18000000000,1042.34,768.924,761.997,
19000000000,657.12,755.73,667.778,
20000000000,734.445,739.088,929.706,
21000000000,1125.29,676.16,799.824,
22000000000,916.406,680.116,675.992,
23000000000,758.452,663.938,705.003,
24000000000,713.823,699.888,691.077,
25000000000,659.938,682.24,637.784,
26000000000,649.928,597.534,617.042,
27000000000,590.497,550.925,641.453,
28000000000,557.6,579.882,596.988,
29000000000,545.456,596.008,590.538,
30000000000,573.58,608.092,578,
31000000000,550.488,596.968,640.865,
32000000000,599.924,665.844,600.984,
33000000000,667.912,752.528,603.948,
34000000000,758.404,856.24,642.036,
35000000000,1029.8,917.62,891.263,
36000000000,930.465,1000.78,1113.72,
37000000000,819.735,954.784,1073.92,
38000000000,705.25,915.036,1061.45,
39000000000,786.892,836.859,821.133,
40000000000,678.14,708,671.025,
41000000000,634.841,710.98,621.2,
42000000000,634.864,641.082,576.12,
43000000000,585.951,608.968,565.152,
44000000000,533.064,546.963,553.095,
45000000000,563.028,543.98,547.955,
46000000000,572.016,527.468,526.979,
47000000000,587.968,569.068,585.04,
48000000000,567.023,627.038,546.057,
49000000000,596.34,690.066,535.909,
50000000000,645.55,699.944,605.901,
51000000000,702.279,830.62,673.79,
52000000000,747.523,890.776,804.175,
53000000000,722.76,872.976,749.908,
54000000000,666.04,878.72,744.935,
55000000000,659.12,855.812,759.156,
56000000000,640.913,717.304,796.927,
57000000000,654.06,659.036,716.948,
58000000000,586.88,635.89,626.2,
59000000000,547.028,565.948,609.995,
60000000000,567.135,563.968,549.987,
61000000000,566.103,554.056,572.008,
62000000000,585.978,506.44,578,
63000000000,574.926,525.064,528.122,
64000000000,663.164,559.82,529.022,
65000000000,646.89,581.064,571.052,
66000000000,641.048,631.91,568.183,
67000000000,758.054,675.016,652.376,
68000000000,786.988,759.079,731.899,
69000000000,783.686,798.78,827.22,
70000000000,792.943,779.193,806.945,
71000000000,710.924,710.495,829.16,
72000000000,704.964,659.996,828.732,
73000000000,713.015,666.219,736.082,
74000000000,679.075,582.074,682.096,
75000000000,644.804,579.894,655.25,
76000000000,602.13,534.093,583.9,
77000000000,654.164,515.992,587.9,
78000000000,614.973,472.946,608.504,
79000000000,691.041,516.955,575.788,
80000000000,749.99,554.92,559.07,
81000000000,771.904,542.965,619.941,
82000000000,840.348,563.984,619.086,
83000000000,815.22,614.032,624.1,
84000000000,787.992,572.06,640.092,
85000000000,719.943,603.966,690.515,
86000000000,732.064,605.82,684.469,
87000000000,711.991,689.476,628.135,
88000000000,725.98,629.53,640.1,
89000000000,698.996,621.21,686.8,
90000000000,623.892,599.058,637.925,
91000000000,646.885,599.476,624.963,
92000000000,530.99,531.976,549.943,
93000000000,572.912,544.94,579.474,
94000000000,613.032,532.018,608.4,
95000000000,720.144,512.104,603.492,
