Frame number,1000000000,1000000001,1000000002,
0.000000,692.086,645.91,657.102,
1.000000,593.027,563.059,581.046,
2.000000,642.082,608.901,584.042,
3.000000,648,649.161,580,
4.000000,639.2,750.991,621.936,
5.000000,682.142,709.029,604,
6.000000,634.947,657.02,577.074,
7.000000,645.948,624.034,552.008,
8.000000,577.86,596.037,559.096,
9.000000,582.08,616.01,531,
10.000000,572.096,612.981,537.972,
11.000000,543.016,561.002,531.058,
12.000000,554.968,560.977,523.016,
13.000000,530.104,531.025,508.031,
14.000000,535.017,533.988,502.026,
15.000000,526.036,511.027,488.056,
16.000000,548.06,538.94,509.934,
17.000000,599.946,554.516,520.018,
18.000000,612,565.506,521.009,
19.000000,691.072,581.03,599.065,
20.000000,717.026,640.01,613.931,
21.000000,712.068,603.988,604.1,
22.000000,724.959,627.083,609.082,
23.000000,726.002,575.9,620.084,
24.000000,666.923,603.102,607.968,
25.000000,637.025,630.032,595.955,
26.000000,607.035,622.965,552.02,
27.000000,570.092,595.475,543.968,
28.000000,560.985,568.063,523.992,
29.000000,553.981,523.965,507.52,
30.000000,497.99,489.014,502.007,
31.000000,533.072,508.05,488.524,
32.000000,504.992,490.978,497.978,
33.000000,507.004,486.05,475.007,
34.000000,508.995,477.024,468.98,
35.000000,544,474,476.479,
36.000000,572.051,487.008,498.985,
37.000000,604.018,524.008,518.963,
38.000000,642.992,519.018,517.975,
39.000000,638.02,518.021,525.516,
40.000000,661.928,547.935,526.073,
41.000000,660.99,533.994,560.008,
42.000000,630.902,543.015,530.501,
43.000000,619.976,545.977,550.019,
44.000000,609.055,523.95,540.033,
45.000000,589.056,524.992,528.522,
46.000000,575.03,530.95,521.465,
47.000000,566.984,529.979,507.965,
48.000000,523.992,506.063,491.996,
49.000000,513.056,516.078,481.016,
50.000000,508.53,499.029,491.046,
51.000000,513.04,479.96,489.015,
52.000000,496.973,513.012,476.504,
53.000000,501.976,477.963,474.508,
54.000000,488.536,470.022,476,
55.000000,518.48,487.02,475.496,
56.000000,548.96,491.965,478.508,
57.000000,545.938,498.013,479.013,
58.000000,568.01,505.955,489.025,
59.000000,560.532,495.024,489.994,
60.000000,551.534,492.032,477,
61.000000,553.552,506.96,485.992,
62.000000,553.036,516.005,488.99,
63.000000,541,485.004,489.992,
64.000000,534.5,492.018,489.981,
65.000000,535.03,504.989,503.92,
66.000000,528.035,502,496.036,
67.000000,531.5,499.995,477.996,
68.000000,535.509,482.007,469.975,
69.000000,501.972,504.007,480.96,
70.000000,515.946,480.979,476.019,
71.000000,491.471,466.991,468.972,
72.000000,500.972,487.526,464.02,
73.000000,495.02,489.012,457.021,
74.000000,486.964,468.981,469.995,
75.000000,496.479,472.019,471.976,
76.000000,510.06,471.05,460,
77.000000,514.516,500.033,483.979,
78.000000,504.522,514.06,482.034,
79.000000,514.04,519.958,475.972,
80.000000,515.01,547.05,471.022,
81.000000,506.976,535.951,475.01,
82.000000,503.467,530.042,453.958,
83.000000,515.045,514.956,452.024,
84.000000,498.502,521.024,467.026,
85.000000,505.512,494.963,464.008,
86.000000,497.02,513.979,451.98,
87.000000,488.978,521.057,447.992,
88.000000,489.029,507.031,471.04,
89.000000,477.008,510.035,468.038,
90.000000,495.53,486.008,452.976,
91.000000,479.015,493.971,465.986,
92.000000,476.008,455.016,465.986,
93.000000,480,463.96,463.018,
94.000000,474.005,469.969,459.017,
95.000000,478.96,457.975,465.03,
