Frame number,1000000000,
0.000000,869.99,
1.000000,650.5,
2.000000,529.008,
3.000000,477.496,
4.000000,456.988,
5.000000,455.012,
6.000000,425.006,
7.000000,431.008,
8.000000,438.986,
9.000000,435.974,
10.000000,427,
11.000000,438,
12.000000,438.984,
13.000000,438.982,
14.000000,433.02,
15.000000,444.984,
16.000000,462.978,
17.000000,475.97,
18.000000,470.028,
19.000000,478.028,
20.000000,463,
21.000000,451.004,
22.000000,457.51,
23.000000,440.98,
24.000000,443.52,
25.000000,442.012,
26.000000,426.996,
27.000000,433.516,
28.000000,437.988,
29.000000,438.53,
30.000000,436.504,
31.000000,438.472,
32.000000,453.968,
33.000000,459.002,
34.000000,451.965,
35.000000,442.506,
36.000000,457.016,
37.000000,439.032,
38.000000,455.008,
39.000000,445.999,
40.000000,432.005,
41.000000,438.025,
42.000000,438,
43.000000,429.97,
44.000000,439.52,
45.000000,435.96,
46.000000,435.485,
47.000000,441.476,
48.000000,440.52,
49.000000,455.025,
50.000000,459.024,
51.000000,447.009,
52.000000,444.996,
53.000000,451.022,
54.000000,445.014,
55.000000,434.978,
56.000000,447.981,
57.000000,434.996,
58.000000,438.021,
59.000000,440,
60.000000,433.984,
61.000000,432.004,
62.000000,424.024,
63.000000,436.984,
64.000000,444.976,
65.000000,439,
66.000000,450.97,
67.000000,441.005,
68.000000,444.02,
69.000000,443.997,
70.000000,440.996,
71.000000,435.95,
72.000000,435.992,
73.000000,436.05,
74.000000,435.025,
75.000000,462.976,
76.000000,430.01,
77.000000,443.008,
78.000000,430.016,
79.000000,429.004,
80.000000,436.993,
81.000000,450.007,
82.000000,441.016,
83.000000,446,
84.000000,445.029,
85.000000,436.952,
86.000000,443.005,
87.000000,438.936,
88.000000,435.988,
89.000000,440.035,
90.000000,430.984,
91.000000,431.998,
92.000000,440.008,
