Time [ms],1000000000,1000000001,1000000002,1000000003,1000000004,1000000005,1000000006,1000000007,
0,526.544,628.046,511.99,628.202,604.972,559.977,479.984,621.102,
1000000000,509.962,482.073,518.944,596.92,578.957,510.92,492.528,521.989,
2000000000,536.015,465.058,548.4,550.088,578.092,511.1,508.646,517.18,
3000000000,561.864,509.06,549.108,597.906,632.787,579.96,533.952,513.072,
4000000000,643.02,572.58,564.113,693.104,671.856,633.087,550.928,574.942,
5000000000,742.2,569.492,700.062,820.012,742.048,659.846,740.98,672.084,
6000000000,849.176,595.896,641.152,834.045,912.264,764.019,733.97,563.45,
7000000000,1105.66,665.611,694.95,807.804,1076.79,774.765,809.98,623.069,
8000000000,1021.44,732.71,740.12,817.768,879.06,826.059,713.14,668.504,
9000000000,942.879,768.586,641.881,751.886,605.096,862.901,709.952,610.48,
10000000000,961.756,696.682,711.03,766.412,616.05,924.099,675.876,567.84,
11000000000,881.668,696.824,701.065,734.125,824.96,805,611.142,586.524,
12000000000,875.146,699.016,659.112,705.007,716.828,858.728,552.832,600.998,
13000000000,783.108,715.947,583.07,716.72,664.44,785.19,532.152,570.944,
14000000000,727.158,694.072,571.082,624.116,644.144,767.048,529.006,530.16,
15000000000,660.592,683.99,612.007,614.9,673.39,695.293,550.98,570.092,
16000000000,643.815,591.954,596.908,616,612.888,688.545,532.098,548.408,
17000000000,611.84,633.108,568,598.016,626.38,651.047,562.956,528.497,
18000000000,580.09,586.913,582.072,557.001,588.5,594.969,572.136,513.92,
19000000000,595.026,649.978,583.04,579.995,602,631.904,590.037,502.993,
20000000000,579.032,565.08,591.031,550,609.56,642.035,598.891,493.05,
21000000000,630.048,629.9,589.96,548.004,622.008,615.716,586.938,532.187,
22000000000,643.82,552.096,613.24,552.139,604.135,594.12,624.939,503.907,
23000000000,622.021,618.142,602.015,577.954,627.2,649.036,577.994,528.858,
24000000000,662.96,677,617.094,582.062,639.122,656.2,593.48,521.172,
25000000000,646.576,644.515,646.984,568.52,653.052,679.964,588.147,535.932,
26000000000,627.52,679.132,705.092,558.12,680.929,699.224,601.841,539.033,
27000000000,619.038,669.06,643.052,531.936,635.128,734.092,627.182,543.44,
28000000000,638.952,646.152,652.568,519.062,630.84,712.88,626.125,515.48,
29000000000,619.144,642.14,677.905,538.424,576.024,603.088,584.091,525.96,
30000000000,589.06,641.942,654.026,557.944,620.944,621.17,593.922,518.888,
31000000000,574.892,572.096,625.96,523.912,591.012,557.078,569.03,519.444,
32000000000,558.012,617.84,621.999,501.132,619.085,597.902,579.056,530.512,
33000000000,546.872,541.856,620.127,504.61,573.053,547.935,555.906,494.986,
34000000000,523.992,532.014,620.15,517.452,571.568,518.065,587.132,492.99,
35000000000,567.968,528.175,551.236,535.125,547.472,567.043,592.836,495.063,
36000000000,537.032,532.054,555.203,513.037,547.079,589.875,561.004,496.465,
37000000000,535.93,561.092,574.104,535.093,504.894,551.033,583.182,478.46,
38000000000,548.52,561.848,570.05,488.974,521.112,564.038,583.086,478,
39000000000,533.154,583.92,603.986,523.969,530.004,612.053,572.047,478.08,
40000000000,552.06,592.738,569.32,512.134,538.95,603.901,583.063,488.1,
41000000000,551.832,570.09,588.205,536.948,523.08,596.051,599.12,462.96,
42000000000,605.156,541.026,637.12,490.992,533.98,629.076,561.93,462.008,
43000000000,598.06,543.002,624.164,509.92,549.05,626.053,547.006,487.026,
44000000000,595.563,559.016,603,520.018,529.1,617.164,557.019,467.078,
45000000000,590.4,553.008,628.988,530.949,555.099,600.953,594.961,467.98,
46000000000,624.84,520.103,624,480.529,559.927,635.96,613.921,473.17,
47000000000,626.934,541.08,619.024,485.44,544.865,541.939,596.96,483.986,
48000000000,639.94,530.96,588.116,493.05,544.925,621.078,600.036,455.927,
49000000000,606.96,574.975,591.517,513.99,531.836,629.906,603.139,497.002,
50000000000,633,526.967,620.525,531.93,524.01,607.102,565.05,461.064,
51000000000,648.192,530.065,616.016,514.017,516.006,622.886,576.905,464.998,
52000000000,621.124,532.927,574.528,515.983,523.029,584.97,580.07,498.989,
53000000000,585.904,540.087,575.388,480.52,533.1,594.9,570.961,494.112,
54000000000,601,531.877,579.541,486.033,554.91,586.062,533.995,474.912,
55000000000,575,549.063,557.02,489.018,556.925,532.057,567.013,473.042,
56000000000,565.476,516.827,564.595,476.408,558.115,544.006,527.956,472.077,
57000000000,579.134,553.888,564.62,465.016,533.964,554.024,532.932,501.939,
58000000000,541.516,515.874,583.654,470.4,552.029,562.048,579.045,479.015,
59000000000,556.064,527.937,579.024,514.04,563.098,550.844,542.098,484.492,
60000000000,520.164,539.104,603.466,529.038,538.872,568.083,536.064,468.07,
61000000000,581.536,542.031,601.88,495.032,508.849,531.907,550.886,470.954,
62000000000,575.968,548.208,586.914,500.04,547.076,614.009,563.89,478.062,
63000000000,590,562.128,604.94,489.034,545.146,529.995,581.988,462.53,
64000000000,578.944,553.927,556.12,467.05,539.136,548.928,555.503,452.985,
65000000000,561.992,524.996,552.532,463.983,533.019,530.002,537.091,450.57,
66000000000,567.576,539.072,577.572,470.952,547.052,531.906,537.108,466.05,
67000000000,543.117,523.042,548.915,473.054,492.932,544.025,532.846,448.952,
68000000000,565.6,522.456,549.134,467.933,507.124,523.82,529.115,463.019,
69000000000,535.088,507.005,558.392,459.95,531.888,536.047,502.993,450.46,
70000000000,521.145,507.075,551.547,477.036,509.078,496.94,507.095,453,
71000000000,526.071,485.999,556.002,474.48,499.997,531.938,509.848,457.549,
72000000000,509.999,515.1,543.43,459.007,514.932,508.835,525.116,451.492,
73000000000,530.965,514.079,566.026,468.487,552.005,534.953,516.023,455.023,
74000000000,533.005,525.018,523.998,463.496,524.936,520.144,529.097,447.476,
75000000000,521.003,498.918,562.005,464.015,516.029,547.07,528.103,462.992,
76000000000,536.074,536.057,555.056,467.51,552.055,535.946,519.92,464.99,
77000000000,516.975,518.988,571.562,488.528,554.937,557.914,539.094,464.972,
78000000000,553.061,492.942,569.488,489.444,538.046,568.885,525.995,476.043,
79000000000,533.001,503.49,578.5,490.48,573.896,583.924,539.875,464.01,
80000000000,521.573,491.944,546.58,485.992,579.068,558.77,535.041,477.008,
81000000000,533.904,481.444,541.472,464.075,556.051,555.085,526.965,462.056,
82000000000,558.99,476.063,525.391,467.042,523.125,573.976,489.96,454.018,
83000000000,550.462,487.134,514.432,482.067,543.932,560.106,491.983,450.977,
84000000000,512.968,475.099,503.6,480.985,514.086,531.943,499.032,450.071,
85000000000,508.93,474.083,546.048,458.015,513.915,539.942,503.114,439.951,
86000000000,486.444,470.548,517.032,464.944,519.074,522.969,508.991,447.047,
87000000000,520.07,472.075,506.461,466.959,500.899,525.1,495.938,458.055,
88000000000,494.162,477.178,511.438,460.998,507.932,529.88,488.008,441.047,
89000000000,489.125,477.978,518.477,463.054,513.959,519.925,473.872,432.048,
90000000000,486.024,503.069,510.008,474.02,520.023,537.019,490.016,447.02,
91000000000,480.049,490.05,510.85,487.508,516.062,535,466.036,450.106,
92000000000,479.96,495.974,517.005,473.08,542.989,523.138,505.972,450.033,
93000000000,508.109,488.884,504.46,472.973,527.961,545.088,510.036,449.963,
94000000000,491.021,483.08,522.54,465.56,534.969,526.904,477.107,447.963,
95000000000,499.972,498.048,514.022,463.528,540.935,536.971,486.025,458.936,
