Frame number,1000000000,
0.000000,448.484,
1.000000,461.02,
2.000000,488.02,
3.000000,464.012,
4.000000,453.025,
5.000000,466.032,
6.000000,445,
7.000000,442.956,
8.000000,445.02,
9.000000,444.02,
10.000000,436.505,
11.000000,432.496,
12.000000,434,
13.000000,429.991,
14.000000,434.025,
15.000000,433.994,
16.000000,433.505,
17.000000,450.476,
18.000000,441.531,
19.000000,446.496,
20.000000,439.96,
21.000000,445,
22.000000,440.03,
23.000000,445.516,
24.000000,438.97,
25.000000,440.476,
26.000000,441.008,
27.000000,431.997,
28.000000,445.004,
29.000000,432.014,
30.000000,434.017,
31.000000,432.02,
32.000000,430.024,
33.000000,444.507,
34.000000,450.512,
35.000000,456.984,
36.000000,456.976,
37.000000,450.012,
38.000000,446.496,
39.000000,441.992,
40.000000,450,
41.000000,441.02,
42.000000,443.965,
43.000000,443.977,
44.000000,435.996,
45.000000,439.96,
46.000000,433.504,
47.000000,441.463,
48.000000,438.012,
49.000000,436.008,
50.000000,441.034,
51.000000,438.05,
52.000000,444.002,
53.000000,456.034,
54.000000,448.488,
55.000000,447.984,
56.000000,445.52,
57.000000,441.49,
58.000000,435.5,
59.000000,431.024,
60.000000,447.018,
61.000000,448.015,
62.000000,439.968,
63.000000,444.008,
64.000000,437.01,
65.000000,441.51,
66.000000,443.524,
67.000000,438.02,
68.000000,443.476,
69.000000,436.014,
70.000000,439.008,
71.000000,442.996,
72.000000,448.52,
73.000000,441.008,
74.000000,438.03,
75.000000,439.528,
76.000000,440.5,
77.000000,433.52,
78.000000,438.5,
79.000000,437.5,
80.000000,451.468,
81.000000,436.996,
82.000000,442.024,
83.000000,448.994,
84.000000,439.96,
85.000000,447.472,
86.000000,438.994,
87.000000,448.976,
88.000000,441.484,
89.000000,445.48,
90.000000,430.024,
91.000000,445.508,
92.000000,441.992,
93.000000,448.018,
