Frame number,1000000000,1000000001,
0.000000,725.44,554.877,
1.000000,696.056,603.948,
2.000000,747,661.914,
3.000000,800.16,783.082,
4.000000,857.904,915.16,
5.000000,879.032,1050.09,
6.000000,860.44,931.208,
7.000000,842.237,848.104,
8.000000,824.037,797.976,
9.000000,783.165,847.856,
10.000000,788.975,733,
11.000000,708.094,646.004,
12.000000,664.145,658.12,
13.000000,663.026,609.083,
14.000000,634.852,587.095,
15.000000,609.878,623.05,
16.000000,620.076,575.068,
17.000000,559.123,564.556,
18.000000,570.988,540.4,
19.000000,585.935,556.512,
20.000000,570.92,558.492,
21.000000,581.908,567,
22.000000,594.059,587.552,
23.000000,612.025,588.899,
24.000000,631.916,628.496,
25.000000,698.136,643.952,
26.000000,677.1,628.04,
27.000000,675.62,607.907,
28.000000,624.959,605.44,
29.000000,638.917,598.01,
30.000000,616.991,560.092,
31.000000,605.141,565.625,
32.000000,565.083,538.995,
33.000000,584.082,550.004,
34.000000,575.056,542,
35.000000,562.035,558.974,
36.000000,544.926,525.552,
37.000000,551.959,504.932,
38.000000,540.026,494,
39.000000,517.987,498.5,
40.000000,516.052,504.018,
41.000000,518.04,502.088,
42.000000,532.968,512.015,
43.000000,540.955,526.444,
44.000000,536.058,527.912,
45.000000,563.934,598.548,
46.000000,569.003,552.61,
47.000000,565.552,544.124,
48.000000,575.048,564.009,
49.000000,547.966,531.013,
50.000000,543.048,545.538,
51.000000,553,541.57,
52.000000,529.088,532.998,
53.000000,513.958,516.514,
54.000000,514.983,515.99,
55.000000,499.03,505.036,
56.000000,500.035,501.975,
57.000000,501.999,482.96,
58.000000,473.996,482.019,
59.000000,488.976,469.477,
60.000000,480.968,482.5,
61.000000,494.974,482.01,
62.000000,503.004,492.523,
63.000000,483.064,479.56,
64.000000,496,498.536,
65.000000,498.514,489.998,
66.000000,504.95,506.555,
67.000000,502.008,524.514,
68.000000,500.055,492.011,
69.000000,499.52,496.56,
70.000000,490.558,496.432,
71.000000,497.04,495.552,
72.000000,486,487.507,
73.000000,482.094,494.52,
74.000000,482.019,483.488,
75.000000,488.944,486.482,
76.000000,471.96,463.976,
77.000000,485.028,477.49,
78.000000,471.94,473.46,
79.000000,472.992,470.52,
80.000000,485.05,457.977,
81.000000,470.064,463.04,
82.000000,460.98,471.49,
83.000000,470.013,471.988,
84.000000,486.047,481.072,
85.000000,484.013,491.516,
86.000000,468.96,485.474,
87.000000,483.989,492.005,
88.000000,468,475.076,
89.000000,479.02,470.99,
90.000000,487.952,472.08,
91.000000,470.969,484.986,
92.000000,469.975,472.964,
93.000000,472,469.042,
94.000000,461.953,472.059,
95.000000,459.03,465.96,
