Time [ms],1000000000,
0,425.996,
1000000000,432.998,
2000000000,427.49,
3000000000,434.984,
4000000000,448.004,
5000000000,440.528,
6000000000,434.992,
7000000000,440.024,
8000000000,438.012,
9000000000,437.015,
10000000000,438,
11000000000,433.996,
12000000000,424.925,
13000000000,434.018,
14000000000,433.05,
15000000000,428.016,
16000000000,426.516,
17000000000,423.97,
18000000000,416.506,
19000000000,422.496,
20000000000,426.465,
21000000000,425.492,
22000000000,428.004,
23000000000,428.52,
24000000000,433.988,
25000000000,431.512,
26000000000,437.544,
27000000000,443.478,
28000000000,424.99,
29000000000,433.02,
30000000000,418.006,
31000000000,421.985,
32000000000,417.979,
33000000000,430.004,
34000000000,430.016,
35000000000,430.019,
36000000000,425.025,
37000000000,434.992,
38000000000,426.016,
39000000000,422.99,
40000000000,428,
41000000000,429.008,
42000000000,429.504,
43000000000,431.48,
44000000000,437.536,
45000000000,422.98,
46000000000,424.96,
47000000000,429.494,
48000000000,422.988,
49000000000,422.492,
50000000000,421,
51000000000,431.008,
52000000000,426.012,
53000000000,431.56,
54000000000,430.004,
55000000000,428.995,
56000000000,422.996,
57000000000,426.98,
58000000000,420.984,
59000000000,424.028,
60000000000,420.488,
61000000000,423,
62000000000,411.977,
63000000000,419.002,
64000000000,423.512,
65000000000,418.007,
66000000000,403.536,
67000000000,421.504,
68000000000,422.496,
69000000000,424.532,
70000000000,417.01,
71000000000,428.011,
72000000000,428.024,
73000000000,434.984,
74000000000,426.988,
75000000000,430.04,
76000000000,422.988,
77000000000,424.036,
78000000000,421.018,
79000000000,425.48,
80000000000,436.543,
81000000000,422.492,
82000000000,424.984,
83000000000,417.007,
84000000000,422.52,
85000000000,427.026,
86000000000,417.04,
87000000000,436,
88000000000,425.015,
89000000000,420.977,
90000000000,424.968,
91000000000,423.964,
92000000000,415.992,
93000000000,416.982,
94000000000,422.016,
95000000000,419.02,
