Time [ms],1000000000,1000000001,1000000002,
0,6379.28,5745.62,5059.42,
1000000000,3915.94,4041.12,4522,
2000000000,3221.41,4157.19,3675.17,
3000000000,3129.32,4666.3,3791.58,
4000000000,3037.7,5957.1,4042.61,
5000000000,3267.55,6623.36,4417.72,
6000000000,3721.4,6973.29,4936.35,
7000000000,3443.48,6532.27,4839.66,
8000000000,3226.42,6092.16,4418.8,
9000000000,3255.47,5756.21,4322.5,
10000000000,3372.63,5289.61,4242.3,
11000000000,3039.32,5126.87,4000.41,
12000000000,3365.26,5273.53,3609.34,
13000000000,3111.49,4909.33,3249.35,
14000000000,3043.77,4728.95,3141.74,
15000000000,3399.46,4384.48,2896.75,
16000000000,3245,4256.76,2802.24,
17000000000,3119.52,4085.25,2628.75,
18000000000,2970.53,4033.74,2340,
19000000000,2642.39,3938.67,2260.54,
20000000000,2775.66,3794.77,2136.19,
21000000000,2868.98,3948.96,2183.59,
22000000000,3099.41,4035.44,2301.38,
23000000000,3239.36,4050.57,2214,
24000000000,3244.41,4263.23,2441,
25000000000,3168.64,4048.36,2380.14,
26000000000,3091.56,3967.57,2487.99,
27000000000,3089.27,3790.52,2284.85,
28000000000,2917.51,3643.62,2120.44,
29000000000,2857.04,3549.17,2050.73,
30000000000,2714.26,3229.14,2043.14,
31000000000,2579.51,3090.59,2013.8,
32000000000,2419.71,2931.76,1941.12,
33000000000,2246.71,2955.54,1896.62,
34000000000,2272.9,2901.58,1790.96,
35000000000,2284.8,2889.74,1683.73,
36000000000,2040.93,3148.27,1608.92,
37000000000,2099.45,2917.22,1601,
38000000000,2466.4,2818,1504.44,
39000000000,2430.93,2893.54,1457.58,
40000000000,2386.02,2790,1599.4,
41000000000,2366.72,3077.34,1533,
42000000000,2400.51,3031.06,1824.02,
43000000000,2342.51,3059.41,2120.69,
44000000000,2384.34,2947.44,1841,
45000000000,2268.74,2772.28,1836.99,
46000000000,2216.7,2729.5,1772.32,
47000000000,2193.71,2622.8,1983.09,
48000000000,2012.52,2450,2110.24,
49000000000,1880.93,2299.08,1820.26,
50000000000,1799.29,2232,1754.43,
51000000000,1746.02,2011.5,1754.65,
52000000000,1677.66,1951.78,1620,
53000000000,1617.49,1819.8,1495.24,
54000000000,1640.87,1814.48,1577.93,
55000000000,1609.73,1732.95,1407.25,
56000000000,1572.5,1603.85,1309.86,
57000000000,1578.47,1661.4,1354.93,
58000000000,1643.4,1632.5,1290.11,
59000000000,1631.7,1757.15,1295.2,
60000000000,1746.4,1841.14,1473.14,
61000000000,1677.78,1905.1,1580.28,
62000000000,1708.74,1749.98,1689.46,
63000000000,1651.73,1876.94,1814.38,
64000000000,1580.67,1788.48,1685.4,
65000000000,1478.44,1812,1492.5,
66000000000,1482.75,1722.24,1491.32,
67000000000,1420.16,1705.92,1474.05,
68000000000,1434.47,1612.72,1414.78,
69000000000,1358.71,1543.38,1421.79,
70000000000,1369.07,1575.95,1460.27,
71000000000,1391.71,1512.16,1456.04,
72000000000,1271.89,1450.81,1428.27,
73000000000,1367.2,1426.86,1395.03,
74000000000,1409.86,1403,1363.91,
75000000000,1314.85,1458.09,1370.42,
76000000000,1398.1,1411,1284.24,
77000000000,1414.77,1474.57,1168.82,
78000000000,1480.18,1451.82,1155.72,
79000000000,1352,1430.04,1268.14,
80000000000,1304.11,1391.73,1341.87,
81000000000,1242.49,1368.39,1389.74,
82000000000,1297.22,1305.14,1236.01,
83000000000,1261.52,1339.14,1316.06,
84000000000,1229.84,1362.09,1404.73,
85000000000,1175.21,1328.76,1316.48,
86000000000,1243.16,1232.32,1215.26,
87000000000,1210.92,1336.75,1206.26,
88000000000,1206.78,1270.22,1226.21,
89000000000,1202.86,1216.65,1190,
90000000000,1202.5,1209.45,1180.24,
91000000000,1249.23,1213.83,1138.16,
92000000000,1273.74,1141,1224.08,
93000000000,1258,1138.68,1047.66,
94000000000,1238.31,1084.42,1136.74,
95000000000,1270.85,1136.2,1093.93,
