Time [ms],1000000000,1000000001,
0,574.048,605.026,
1000000000,690,599.96,
2000000000,672.984,660.048,
3000000000,753.072,710.963,
4000000000,937.056,789.077,
5000000000,836.938,802.888,
6000000000,829.895,789.894,
7000000000,777.084,764.931,
8000000000,756.992,726.918,
9000000000,668.056,696.097,
10000000000,612.992,647.07,
11000000000,575.868,609.958,
12000000000,563,597.954,
13000000000,543.96,561.022,
14000000000,510.05,547.046,
15000000000,509.988,514.07,
16000000000,495.95,516.94,
17000000000,499.956,524.966,
18000000000,487.992,500.992,
19000000000,478.984,503.92,
20000000000,494.01,519.023,
21000000000,509.972,485.986,
22000000000,550,521.046,
23000000000,580.08,520.985,
24000000000,602.052,545.038,
25000000000,658.96,563.947,
26000000000,657.016,545,
27000000000,590.072,560.512,
28000000000,592.996,532.494,
29000000000,569.924,522.988,
30000000000,562.013,502.949,
31000000000,544,520.984,
32000000000,515.932,507.908,
33000000000,523.992,514.999,
34000000000,500.02,524,
35000000000,505.04,505.975,
36000000000,480,501.968,
37000000000,483.964,503.964,
38000000000,471.988,496.936,
39000000000,495.976,484.008,
40000000000,481.052,484.96,
41000000000,500.96,507.022,
42000000000,512.94,497.552,
43000000000,529.991,516.44,
44000000000,528.052,523.04,
45000000000,558.003,531.046,
46000000000,566.028,494.988,
47000000000,545.084,503.994,
48000000000,537.984,503.038,
49000000000,549.94,489.971,
50000000000,512.496,491.044,
51000000000,517.028,482.96,
52000000000,518.954,497.904,
53000000000,488.02,485.992,
54000000000,496.995,467.016,
55000000000,488,472.958,
56000000000,473,478.1,
57000000000,475,496.05,
58000000000,484.008,475.042,
59000000000,494,492,
60000000000,483,489.034,
61000000000,497.52,493.013,
62000000000,499.04,497.986,
63000000000,486.544,493.528,
64000000000,505.04,498.035,
65000000000,506,490.012,
66000000000,514.522,479.52,
67000000000,501.012,485.976,
68000000000,483.52,472.5,
69000000000,495,479.966,
70000000000,488,479.48,
71000000000,479.496,475.99,
72000000000,487.021,486.483,
73000000000,485,464.444,
74000000000,469.998,482.521,
75000000000,454.488,472,
76000000000,485.04,467.968,
77000000000,478.509,485.04,
78000000000,472.5,473.038,
79000000000,472.535,491.98,
80000000000,462.518,463.972,
81000000000,464.008,475.984,
82000000000,464.974,468.044,
83000000000,470.951,472.031,
84000000000,463.484,484.98,
85000000000,480.531,469.984,
86000000000,455.952,465.036,
87000000000,456.032,461.024,
88000000000,465.972,448.97,
89000000000,465.008,463.01,
90000000000,466.52,467.046,
91000000000,449.517,462,
92000000000,466.52,451.018,
93000000000,463.52,472.992,
94000000000,451,466.52,
95000000000,465.03,455.52,
