Frame number,1000000000,1000000001,1000000002,1000000003,
0.000000,1190.05,1040.94,1034.06,935.222,
1.000000,1357.87,1220.07,1224,1206.9,
2.000000,1671.03,1570.73,1578.33,1394.9,
3.000000,1866.72,1840.11,1786.93,1580.77,
4.000000,1851.7,1694.11,1631.48,1518.33,
5.000000,1880.81,1809,1741.63,1517.82,
6.000000,1875.98,1750.66,1900.66,1399.73,
7.000000,1908.98,1706.1,1763.45,1407.26,
8.000000,1899.3,1697.75,1591.94,1191.14,
9.000000,1870.94,1458.86,1622.34,1133.02,
10.000000,1835,1508.01,1478.7,1003.02,
11.000000,1799.93,1416.25,1436.34,969.808,
12.000000,1706.06,1337,1427.9,973.878,
13.000000,1669.14,1307.94,1425.5,963.78,
14.000000,1600.12,1202.77,1354.04,945.198,
15.000000,1502,1237.05,1305,979.876,
16.000000,1467.3,1141.08,1284,990.07,
17.000000,1449.14,1140.93,1311.53,987.102,
18.000000,1443.99,1201.84,1321.61,1006.79,
19.000000,1532.19,1212.98,1325.98,965.92,
20.000000,1527.74,1244.94,1237.4,971.954,
21.000000,1525.98,1270.83,1405,1048.83,
22.000000,1540.79,1278.23,1457.91,1169.1,
23.000000,1561.02,1350.93,1628.99,1336.18,
24.000000,1603.03,1369.22,1548.32,1191.02,
25.000000,1624.89,1406.11,1604.98,1132.72,
26.000000,1686.11,1396.73,1495.46,1164.51,
27.000000,1765.97,1383.15,1407.35,1092.98,
28.000000,1718.05,1271.95,1330.24,1012.12,
29.000000,1751.78,1165.06,1263.12,969.772,
30.000000,1718.12,1174.11,1249.35,907.019,
31.000000,1695.94,1125.13,1135.08,924.094,
32.000000,1504.21,1044.98,1077.89,889.066,
33.000000,1455.84,1026,1057.5,928.864,
34.000000,1413.15,1043.94,1052.07,878.084,
35.000000,1378,1074.04,1036.98,871.194,
36.000000,1409.32,1103.01,1053.93,873.075,
37.000000,1372.14,1086.98,992.016,933.26,
38.000000,1429.47,1057.22,1009.97,985.9,
39.000000,1337.03,1062.12,1043.33,1020.06,
40.000000,1320.56,1043.12,1068.46,1006.25,
41.000000,1244,1069.84,1068.93,942.894,
42.000000,1237.06,1062.95,1099.52,913.087,
43.000000,1217.1,1067.96,1076.09,876.047,
44.000000,1187.09,1031.1,1107.08,836.956,
45.000000,1151.14,1030.92,1052.12,838.955,
46.000000,1136.18,956.2,1043.1,819.07,
47.000000,1080.87,905.92,954.996,801.069,
48.000000,1018.92,886.008,944.96,790.952,
49.000000,956.042,856.972,911.912,839.88,
50.000000,908.064,821.027,834.976,809.932,
51.000000,890.16,781.96,837.477,844.464,
52.000000,846.888,795.968,820.964,798.476,
53.000000,811.997,801.556,821.93,816.492,
54.000000,853.952,770.5,791.952,781.914,
55.000000,832.056,769.986,761.01,797.004,
56.000000,812.076,745.944,741.065,798.924,
57.000000,746.93,740.999,753.984,824.48,
58.000000,750.798,709.95,720.51,816.968,
59.000000,741.05,708.04,711.016,766,
60.000000,733.08,696.004,713.04,756.98,
61.000000,721.978,684.456,710.079,717.516,
62.000000,747.872,648.992,675,705.944,
63.000000,721.032,633.035,620.026,675.056,
64.000000,722.084,618.488,619.896,678.076,
65.000000,701.968,579.496,596.952,681,
66.000000,708.094,595.02,598.016,679.956,
67.000000,713.09,573.536,598.05,687.52,
68.000000,688.972,567.032,587.984,655.472,
69.000000,676.976,560,582.956,634.512,
70.000000,654.008,542.988,599.046,595.496,
71.000000,646.92,543.96,567.045,625.532,
72.000000,649.064,544.504,569.984,612.444,
73.000000,644.053,555.982,564.02,613.976,
74.000000,637.022,530.016,554,601.03,
75.000000,643.016,529.536,556.02,593.06,
76.000000,632.96,522,558.029,620.04,
77.000000,628.032,547.491,567.023,612.956,
78.000000,646.028,524.96,541.05,602.016,
79.000000,626.96,522.04,543,589.01,
80.000000,598.044,533.01,534.976,577.966,
81.000000,590.936,521.944,531.96,562.464,
82.000000,602,523.484,517.958,573.512,
83.000000,580.046,517.48,536.972,577.024,
84.000000,575.982,517,515.992,562.516,
85.000000,544.972,503.028,515.032,562.486,
86.000000,541.02,524.008,513.977,571.51,
87.000000,522.005,507.5,504.49,536.528,
88.000000,516.976,516.004,502.032,556.976,
89.000000,516.04,510.995,504.5,562.02,
90.000000,491.092,506.96,493.476,578.964,
91.000000,511.964,498.527,491.554,583.516,
92.000000,504.024,484.552,483.503,579.024,
93.000000,508.025,509.476,487.034,572.492,
