Frame number,1000000000,1000000001,1000000002,1000000003,
0.000000,23008.1,28574.6,6228.63,29624.7,
1.000000,13968.2,15089.8,7654.6,19754.8,
2.000000,12031.6,14441.6,8179.7,10672.1,
3.000000,14612,15356.2,7492.46,7181.26,
4.000000,14934.9,15410,10290.3,12093.3,
5.000000,16249.2,11847.4,8454.22,16055.4,
6.000000,16184.1,9982.28,7114.71,18731.9,
7.000000,13770,9204.28,6786.82,16220.6,
8.000000,11803.8,7400.64,7731.22,14655.6,
9.000000,9099.08,6070.56,7110.1,11924.8,
10.000000,7241.44,5303.07,5993.18,9547.03,
11.000000,5715.07,4653.68,5471.41,8290.12,
12.000000,5061.9,4037.72,5748.88,8142.94,
13.000000,4703.8,3810.68,4916.35,7799.25,
14.000000,4614.36,3827.09,4543.58,7240.13,
15.000000,4662.7,3687.74,4563.56,7963.07,
16.000000,5095.26,4101.52,4732.72,9759.06,
17.000000,6091.8,5355.78,5543.7,9471.39,
18.000000,7069.18,6748.44,5701.33,9696.94,
19.000000,7122.37,7286.54,6489.58,8820.71,
20.000000,6360.59,6512.63,6248.51,8015.11,
21.000000,5540.62,5682.33,5913.16,6943.53,
22.000000,4483.41,4541.51,5311.59,5711.33,
23.000000,3559.41,3629.65,4963.51,5124.75,
24.000000,2943,2960.72,4417.66,4619.96,
25.000000,2639.64,2397.39,3919,4157.82,
26.000000,2503.14,2280.9,3657.96,4322.02,
27.000000,2448.1,2182.25,3336.49,4663.45,
28.000000,2773.64,2199.9,3056.33,4921.91,
29.000000,3068.44,2465.27,3330,5109.96,
30.000000,4034.98,2750.14,3449.15,6022.6,
31.000000,5431.73,3484.49,4018.71,7006.73,
32.000000,6498.13,4569.83,4338.75,7030.16,
33.000000,6015.99,5352.18,4962.18,6733.74,
34.000000,5280.96,5198.28,4598.19,5802,
35.000000,4481.85,4525.69,4691.14,4963.17,
36.000000,3701.33,3877.6,4358.72,4179.17,
37.000000,3140.1,3157.92,4436.09,3734.44,
38.000000,2663.8,2630.05,3918.42,3433.52,
39.000000,2291.29,2183.03,4072.75,3306.57,
40.000000,2127.01,1861.9,3422.46,3365.7,
41.000000,2018.26,1720.99,3454,3513.5,
42.000000,2078.19,1672.1,3162.62,3886.41,
43.000000,2228.63,1806.14,3205.38,4591.11,
44.000000,2921.62,1972.73,3220.81,5093.58,
45.000000,3844.88,2326,3982.96,5456.44,
46.000000,4601.92,2807.32,4018.98,5481.91,
47.000000,4601.66,3389.94,4899.1,5308.08,
48.000000,4316.56,3682.22,4768.16,5012.64,
49.000000,3894.32,3743.84,5182.28,4376.03,
50.000000,3466.7,3474.75,4843.23,3956.5,
51.000000,3114.18,3092.5,4905.3,3755.55,
52.000000,2696.71,2638,4092.1,3387.92,
53.000000,2344.19,2295.17,4283.6,3201.42,
54.000000,2230.17,1943,3845.52,3148.17,
55.000000,2146.53,1727.41,3925.8,3239.21,
56.000000,2202.84,1663.12,3719.39,3525.4,
57.000000,2312.82,1684.88,3663.6,3940.38,
58.000000,2547.3,1763.12,3672.08,4387.9,
59.000000,2978.4,1942.01,4022.86,4727.85,
60.000000,3401.86,2292.05,4492.32,4872.3,
61.000000,3883.65,2713.98,4757.51,4451.89,
62.000000,3895.72,3013.88,4806.07,4328.22,
63.000000,3952.76,3234.98,5399,4013.96,
64.000000,3677.08,3141.08,5172.66,3615.93,
65.000000,3289.55,2843.95,4970.6,3262,
66.000000,3092.8,2489.02,4621.91,3087.12,
67.000000,2817.68,2276.23,4518.68,2979,
68.000000,2541.4,2005.74,4075.6,2996.7,
69.000000,2401.1,1823.8,4119.09,2984,
70.000000,2401.14,1692.83,3909.13,3153.4,
71.000000,2405.85,1597,4016.08,3544,
72.000000,2487.42,1634.26,3990,3927.1,
73.000000,2700.64,1776,4232.15,4304.68,
74.000000,3239.92,1967.83,4494.74,4274.09,
75.000000,3670.55,2277.92,4949.06,4324.57,
76.000000,3751.22,2539.95,5083.85,4055.8,
77.000000,3819.14,2764,5403.36,3719.15,
78.000000,3406.24,2848.04,5033.2,3470.64,
79.000000,3338.73,2799.88,5105.82,3477.13,
80.000000,3139.03,2579.14,4665.98,3231.01,
81.000000,2920.56,2337.01,4712.13,2940.31,
82.000000,2695.47,2074.5,4492.99,2984.2,
83.000000,2523.88,1825.57,4398.02,3124.27,
84.000000,2550.98,1662.07,4247.13,3242.94,
85.000000,2369.11,1561.15,4212.98,3509.12,
86.000000,2472.1,1479.9,4241.85,3740.72,
87.000000,2564.13,1527.94,4383.93,4032.51,
88.000000,2809.34,1563.86,4641.96,4130.94,
89.000000,3027.56,1694,4971.91,4059.42,
90.000000,3094.66,1973.07,5124.77,3872.14,
91.000000,3261.71,2323.38,5266.92,3652.29,
92.000000,3092.98,2466.71,5010.33,3480.93,
93.000000,2886.26,2692.03,4903.93,3255.46,
94.000000,2833.57,2724.05,4598.89,3153.5,
