Frame number,1000000000,1000000001,1000000002,1000000003,
0.000000,1047.5,1037.89,1302.63,698.824,
1.000000,912.202,942.119,996.403,734.015,
2.000000,889.1,871.858,907.88,776.278,
3.000000,985.24,1028.37,974.4,757.447,
4.000000,1118.96,1079.49,1106.21,894.934,
5.000000,1175.5,1128.38,1138.39,976.03,
6.000000,1167.67,1136.26,1137.99,903.77,
7.000000,995.614,1101.68,1117.55,882.575,
8.000000,906.466,969.726,997.758,806.547,
9.000000,1031.8,884.295,781.25,685.15,
10.000000,877.68,782.848,726.21,642.882,
11.000000,799,721.2,741.828,564.95,
12.000000,718.004,649.124,632.208,556.105,
13.000000,644,657.002,588.2,523.054,
14.000000,616.116,591.948,588.86,517.992,
15.000000,602.08,552.072,552.938,498.992,
16.000000,563.04,538.932,552.966,498.014,
17.000000,568.964,572.946,545.089,470.063,
18.000000,583.048,552.986,566.905,492.016,
19.000000,608,559.026,552.925,498.07,
20.000000,690.924,617.14,638.217,510.029,
21.000000,706.96,666.966,649.229,551.946,
22.000000,765.91,702.032,691.019,561.246,
23.000000,867.148,759.985,749.896,600.016,
24.000000,924.06,763.198,750.095,615.987,
25.000000,887.988,770.833,752.22,599.344,
26.000000,867.824,768.844,725.178,587.138,
27.000000,834.164,742.794,698.867,589.9,
28.000000,737.984,658.972,662.008,568.2,
29.000000,669.029,648.12,632.87,547.914,
30.000000,655.959,583.12,594.2,532.077,
31.000000,616,547.932,538.81,499.913,
32.000000,571.086,540.947,530.107,491.886,
33.000000,554.11,528.072,501.029,483.937,
34.000000,555.96,510.06,529.042,476.05,
35.000000,535.132,534.98,494.966,478.01,
36.000000,536,512.08,498.1,481.986,
37.000000,537.055,511.966,519.92,467.063,
38.000000,544.992,511.996,528.973,481.029,
39.000000,573.975,556.08,559.998,491.999,
40.000000,615.078,584.968,570.064,496.113,
41.000000,640,658.97,607.977,525.974,
42.000000,691.988,668.002,619.035,548.092,
43.000000,700.96,698.158,616.099,559.182,
44.000000,758.112,714.84,603.786,585.965,
45.000000,725.752,690.832,635.105,569.115,
46.000000,707,683.93,639.95,541.901,
47.000000,667.932,650.926,606.995,542.922,
48.000000,622.18,621.11,580.872,527.214,
49.000000,615.048,580.097,557.937,500.93,
50.000000,585.854,571.03,533,518,
51.000000,566.088,532.99,523.04,490.996,
52.000000,539.056,528.936,524.44,506.083,
53.000000,553.002,509.928,521.017,476.016,
54.000000,512.04,495.042,507.504,469.91,
55.000000,529.976,506.024,504.908,469.023,
56.000000,518.984,511.076,510.987,461.02,
57.000000,531.963,515.92,523.935,460.088,
58.000000,544.02,521.92,520.108,474.969,
59.000000,578.042,538.056,557.037,477.033,
60.000000,575.942,573.088,561.063,490.944,
61.000000,616.03,621.108,594.93,504.98,
62.000000,623.995,611.06,610.034,502.146,
63.000000,654.96,636.16,601.86,493.993,
64.000000,631.03,605.26,630.15,519.83,
65.000000,602.92,626.971,592.09,516.077,
66.000000,612.976,616.158,609.456,514.034,
67.000000,588,568.896,564.063,510.018,
68.000000,585.981,590.1,547.924,507.094,
69.000000,542.924,542.116,539.98,484.97,
70.000000,531.044,528.972,533.928,487.941,
71.000000,522.98,521.084,516.041,465.942,
72.000000,519.064,512.032,510.04,462.954,
73.000000,519.954,509.93,502.56,452.95,
74.000000,510.994,508.97,496.424,476.063,
75.000000,521.98,506.984,508.002,454.51,
76.000000,524.952,507.055,514.974,461.512,
77.000000,533.024,527.995,512.955,463.04,
78.000000,536.011,525.029,545.052,467.476,
79.000000,550.004,540.008,551.973,475.52,
80.000000,557.003,593.918,549.061,484.486,
81.000000,572.04,570.114,606,478.6,
82.000000,594.028,607.074,573.03,485.522,
83.000000,577.024,612.96,599.948,525.031,
84.000000,576.089,587.017,559.48,491.992,
85.000000,571.056,581.952,573.923,500.044,
86.000000,557.004,574,560.44,504.158,
87.000000,528.97,553.964,561.926,492.956,
88.000000,544.008,539.918,545.058,500.005,
89.000000,529.998,544.925,532.09,494.044,
90.000000,516.04,530.922,533.96,491,
91.000000,502.022,510.03,525.518,468.97,
92.000000,500.058,513.919,502.956,459.985,
93.000000,498.018,508.948,504.625,457.078,
94.000000,499.05,521.954,513.008,449.472,
95.000000,503.982,513.041,492.92,458.968,
