Frame number,1000000000,
0.000000,436,
1.000000,452.494,
2.000000,462.002,
3.000000,486,
4.000000,500.056,
5.000000,491.002,
6.000000,471.016,
7.000000,468.975,
8.000000,445.02,
9.000000,447.02,
10.000000,445.992,
11.000000,447.96,
12.000000,443.992,
13.000000,447.01,
14.000000,436,
15.000000,443.98,
16.000000,442.038,
17.000000,456.02,
18.000000,461.996,
19.000000,468.008,
20.000000,481.012,
21.000000,490.488,
22.000000,468.52,
23.000000,468.054,
24.000000,468,
25.000000,447.536,
26.000000,441.982,
27.000000,449.012,
28.000000,447.962,
29.000000,443.016,
30.000000,435.032,
31.000000,442.042,
32.000000,457.952,
33.000000,446.985,
34.000000,442.003,
35.000000,448.016,
36.000000,465.016,
37.000000,464.992,
38.000000,455.03,
39.000000,450.02,
40.000000,461.038,
41.000000,441.995,
42.000000,453.03,
43.000000,437.026,
44.000000,444.971,
45.000000,438.03,
46.000000,449.048,
47.000000,451.983,
48.000000,437.943,
49.000000,435.944,
50.000000,447,
51.000000,452.974,
52.000000,451.96,
53.000000,464.983,
54.000000,478.048,
55.000000,472,
56.000000,467.962,
57.000000,467.045,
58.000000,456.035,
59.000000,445.966,
60.000000,439.994,
61.000000,447.023,
62.000000,455.032,
63.000000,455.982,
64.000000,463.968,
65.000000,442.025,
66.000000,448.984,
67.000000,443.983,
68.000000,445.042,
69.000000,471.008,
70.000000,461.036,
71.000000,463.03,
72.000000,467.976,
73.000000,446.984,
74.000000,450.986,
75.000000,450.962,
76.000000,442.004,
77.000000,438.027,
78.000000,454.032,
79.000000,441.996,
80.000000,444.978,
81.000000,442.002,
82.000000,448.984,
83.000000,445.99,
84.000000,446.012,
85.000000,450.016,
86.000000,458.992,
87.000000,462.013,
88.000000,454.968,
89.000000,457.004,
90.000000,468.056,
91.000000,445.96,
92.000000,441.012,
93.000000,445.968,
94.000000,447.018,
95.000000,440.025,
