Time [ms],1000000000,
0,428.55,
1000000000,425.492,
2000000000,424,
3000000000,421.038,
4000000000,442.01,
5000000000,432.986,
6000000000,433.97,
7000000000,438.008,
8000000000,427.04,
9000000000,433.972,
10000000000,432.948,
11000000000,426.008,
12000000000,420.496,
13000000000,411.544,
14000000000,422.508,
15000000000,408.502,
16000000000,422,
17000000000,421.986,
18000000000,416.98,
19000000000,427.506,
20000000000,441.018,
21000000000,421.007,
22000000000,419,
23000000000,429.52,
24000000000,425,
25000000000,419.996,
26000000000,428,
27000000000,426.99,
28000000000,423.02,
29000000000,420.5,
30000000000,420.006,
31000000000,410.96,
32000000000,418.994,
33000000000,418.944,
34000000000,418.032,
35000000000,423,
36000000000,422,
37000000000,411.986,
38000000000,420.016,
39000000000,417.987,
40000000000,420.01,
41000000000,430,
42000000000,411.98,
43000000000,420.984,
44000000000,413.98,
45000000000,418.011,
46000000000,413.982,
47000000000,418.95,
48000000000,413.98,
49000000000,417.046,
50000000000,412.98,
51000000000,410.963,
52000000000,412.038,
53000000000,425.964,
54000000000,408.992,
55000000000,416.994,
56000000000,416.002,
57000000000,424.015,
58000000000,407.96,
59000000000,411.978,
60000000000,418.01,
61000000000,414,
62000000000,416.048,
63000000000,418.952,
64000000000,410.98,
65000000000,411,
66000000000,414.015,
67000000000,416,
68000000000,410.96,
69000000000,423.027,
70000000000,405,
71000000000,412.034,
72000000000,418.024,
73000000000,417.96,
74000000000,416.04,
75000000000,413.974,
76000000000,412.022,
77000000000,408.97,
78000000000,415.029,
79000000000,411.01,
80000000000,416.994,
81000000000,406.032,
82000000000,407.997,
83000000000,412,
84000000000,411.024,
85000000000,408.002,
86000000000,413.496,
87000000000,408.008,
88000000000,409.504,
89000000000,413,
90000000000,417.504,
91000000000,409.983,
92000000000,423.047,
93000000000,407.998,
94000000000,413.019,
