Time [ms],1000000000,1000000001,
0,1441.6,1141.02,
1000000000,1594.78,1132.24,
2000000000,1886.44,1208.84,
3000000000,2643.4,1447.16,
4000000000,3141.81,1727,
5000000000,3332.91,1850.87,
6000000000,3160,1733.95,
7000000000,2882.04,1639.27,
8000000000,2617.3,1550.18,
9000000000,2330.7,1428.8,
10000000000,2166.22,1353,
11000000000,2075.81,1267,
12000000000,1871.36,1174.09,
13000000000,1769.92,1131.02,
14000000000,1616.24,1088.87,
15000000000,1520.26,1077.34,
16000000000,1476.82,1017.97,
17000000000,1375,980.938,
18000000000,1509.12,980.904,
19000000000,1748.64,971.387,
20000000000,1829.44,1067.1,
21000000000,1907.69,1056.44,
22000000000,1855.84,1101.94,
23000000000,1772.9,1083.51,
24000000000,1792.12,1014.94,
25000000000,1691.95,995.801,
26000000000,1672.11,1002.01,
27000000000,1500.12,969.925,
28000000000,1470.28,915.888,
29000000000,1346.2,947.121,
30000000000,1270.18,872.062,
31000000000,1273.88,864.99,
32000000000,1269.51,845.9,
33000000000,1166.06,892.06,
34000000000,1209.99,820.08,
35000000000,1189.39,868.026,
36000000000,1239.3,895.892,
37000000000,1302.35,892.899,
38000000000,1385.67,940.326,
39000000000,1334.28,932.125,
40000000000,1388.22,952.576,
41000000000,1314.75,982.92,
42000000000,1298.75,910.549,
43000000000,1226.94,875.008,
44000000000,1154.5,854.107,
45000000000,1166.94,796.154,
46000000000,1108.96,800.031,
47000000000,1051.04,806,
48000000000,1038.87,796.133,
49000000000,959.164,777.912,
50000000000,980.44,755.886,
51000000000,1000.03,752.922,
52000000000,979.982,753.064,
53000000000,981.908,767.042,
54000000000,1057.46,723.095,
55000000000,1087.51,723.99,
56000000000,1044.97,694.108,
57000000000,1086.12,784,
58000000000,943.565,725.92,
59000000000,978.396,706.922,
60000000000,958.038,731.049,
61000000000,926.128,711.041,
62000000000,904.964,716.088,
63000000000,890.178,695.144,
64000000000,876.76,698.99,
65000000000,856.2,665.912,
66000000000,842.114,669.944,
67000000000,848.925,652.001,
68000000000,809.988,665.156,
69000000000,837.07,615,
70000000000,868.884,654.096,
71000000000,883.105,653.912,
72000000000,889.942,677.048,
73000000000,887,663.976,
74000000000,856.05,667.988,
75000000000,840.032,642.532,
76000000000,842.18,644.416,
77000000000,809.841,624.464,
78000000000,822.84,611.512,
79000000000,785.856,603.456,
80000000000,756.015,617.516,
81000000000,774.92,588.96,
82000000000,730.956,578.1,
83000000000,804.908,565.48,
84000000000,764.89,592.948,
85000000000,752.96,589.14,
86000000000,760.016,584.921,
87000000000,739.932,589.053,
88000000000,738.048,593.005,
89000000000,765.112,624.024,
90000000000,753.144,611.096,
91000000000,764.9,584.02,
92000000000,719,600,
93000000000,753.048,602.463,
94000000000,712.091,588.52,
95000000000,726.064,584.952,
