Time [ms],1000000000,1000000001,1000000002,1000000003,
0,1875.65,1840.97,1636.35,932.84,
1000000000,1763.89,1375.19,1459.15,886.956,
2000000000,1385.95,1192.01,1531.3,866,
3000000000,1455.1,1308.08,1719.66,975.176,
4000000000,1638.94,1370.85,1809.16,1091,
5000000000,1668.47,1334.03,1728.27,1087.91,
6000000000,1428.44,1342.88,1635.2,1077.03,
7000000000,1396.6,1211.47,1523.94,1046.05,
8000000000,1330,1115.17,1339.96,980.056,
9000000000,1200.05,1110.02,1293.2,986.104,
10000000000,1168.09,1105.25,1229.24,909.506,
11000000000,1145.08,1030.12,1140.18,854.516,
12000000000,1056.04,1023.14,1044,832.522,
13000000000,1002.03,952.044,1009.51,795.996,
14000000000,1033.82,939.04,1000.99,781.896,
15000000000,1020.04,903.18,960.268,811.904,
16000000000,969.044,887.979,985.036,751.025,
17000000000,1005.06,934.027,1001.04,774.928,
18000000000,1069.93,943.962,987.388,789.16,
19000000000,1003.8,955.82,1098,816.048,
20000000000,1108.76,963.068,1136.93,871,
21000000000,1146.08,993.162,1077.19,889,
22000000000,1083.91,949.952,1147.18,874.067,
23000000000,1158.06,954.182,1144.86,861.052,
24000000000,1088.87,974.951,1145.46,851.944,
25000000000,1136.98,959.128,1173.94,854.108,
26000000000,1100.15,943.97,1099.17,847.07,
27000000000,1108.04,955.062,1156.83,820,
28000000000,1055.94,904.864,1036.93,787.034,
29000000000,1048.01,899.056,1026.53,807,
30000000000,979.768,900.081,1011.89,789.498,
31000000000,973.924,875.808,961.166,762.96,
32000000000,994.076,875.84,987.863,746.6,
33000000000,930.12,862.882,959.848,739.516,
34000000000,972.064,854.122,1016,713.6,
35000000000,925.908,837.105,1026.91,715.98,
36000000000,965.2,838.508,1017.28,727.536,
37000000000,899.47,872.55,949.993,754.016,
38000000000,1014.99,866.1,968.04,771.098,
39000000000,964.028,871.5,990.968,767.892,
40000000000,949.088,867.024,960.916,752.94,
41000000000,969.974,850.998,965.04,765.92,
42000000000,1002.51,868.57,977,732.024,
43000000000,1007.05,879.048,992.757,749.918,
44000000000,1005.94,832.146,977.075,716.088,
45000000000,941.894,836.003,944.015,694.507,
46000000000,952.104,813.934,909.877,677.944,
47000000000,906.046,788.003,859.969,667.98,
48000000000,875.903,790.994,871.889,663.488,
49000000000,832.11,782.952,854.08,665.984,
50000000000,921.925,722.944,834.981,663.994,
51000000000,903.088,738.028,883.09,650.042,
52000000000,929.936,748.898,850.954,645.496,
53000000000,903.292,779.162,841.198,660.02,
54000000000,906.946,792.18,873.039,654.504,
55000000000,855.94,775.058,875.001,672.971,
56000000000,875.088,718.024,852.55,676.496,
57000000000,832,772.04,857.015,673.436,
58000000000,833.536,772.842,846.608,675.96,
59000000000,840.208,772.858,858.936,660.062,
60000000000,806.974,788.968,835.374,645.989,
61000000000,835.852,741.886,810.522,631.937,
62000000000,829.08,703.06,777.977,631.044,
63000000000,788.986,749.062,790.439,596.998,
64000000000,765.944,693.972,726.56,602.036,
65000000000,738.04,741.064,725.034,590,
66000000000,762.088,720.04,733.116,622.948,
67000000000,759.864,705.976,722.062,601.01,
68000000000,741.106,666.512,724.075,604.94,
69000000000,744.032,688.83,741.96,599.995,
70000000000,752.9,679.059,720.095,596.524,
71000000000,750.04,656.534,732.936,588.5,
72000000000,753.452,673.552,723.01,585.984,
73000000000,733.062,669.946,711,597.48,
74000000000,742.888,684.984,733.009,596.984,
75000000000,773.939,653.56,726.024,606.962,
76000000000,747.998,675.984,724.9,599.02,
77000000000,736.903,672.392,708.092,577.951,
78000000000,709.072,656,727.004,585.965,
79000000000,725.968,677.117,710.096,563.96,
80000000000,719.968,672.044,669,565.974,
81000000000,682.136,666.054,687.984,557.922,
82000000000,663.912,653.986,664.976,570.952,
83000000000,645.022,657.06,665.092,569.024,
84000000000,661.96,648.975,656.904,557.973,
85000000000,676.508,621.032,658.02,553.11,
86000000000,680.99,637.912,637.928,531.024,
87000000000,644,618.028,637.116,553.03,
88000000000,646.088,606.05,657.878,540,
89000000000,650.916,608.85,638.008,550.044,
90000000000,646.011,614.52,632.972,544.062,
91000000000,652.93,615,658,558.025,
92000000000,652.96,610.52,672.948,568.976,
93000000000,633.001,614.052,658.06,554.947,
94000000000,610,609.059,665.912,547,
95000000000,589.912,623.964,626.468,534.984,
