Time [s],1000000000,1000000001,1000000002,1000000003,
0.000000,1187.98,874.271,831.972,1202.24,
1.000000,1176.66,1009.05,935.267,1598.65,
2.000000,1070.26,956.676,713.283,1708.86,
3.000000,934.18,725.784,699.806,1508.8,
4.000000,924.908,617.177,713.85,1113.7,
5.000000,776.143,559.89,720.319,1076.59,
6.000000,639.982,568.548,586.1,868.09,
7.000000,648.536,615.398,585.764,732.37,
8.000000,524.25,582.918,572.757,687.5,
9.000000,554.802,592.112,591.911,713.156,
10.000000,648.787,764.995,699.834,989.228,
11.000000,743.601,906.539,886.225,1255.18,
12.000000,1014.38,1573.92,1252.72,1830.26,
13.000000,1106.86,2473.95,2557.45,2378.98,
14.000000,1428.71,2469.35,3053.63,2530.96,
15.000000,1593.9,2043.48,3273.66,2400.74,
16.000000,1454.6,2074.6,2287.92,1610.7,
17.000000,1120.98,1900.07,1544.31,1454.8,
18.000000,917.626,1076.46,1162.98,1042.14,
19.000000,712.956,899.485,914.467,900.008,
20.000000,641.15,822.25,777,751.563,
21.000000,582.58,673.255,745.102,655.217,
22.000000,553.07,598.912,643.921,586.874,
23.000000,515.644,531.05,579.52,546.98,
24.000000,499.468,535.034,550.036,514.104,
25.000000,503.052,528.983,550.928,542.944,
26.000000,599.315,582.739,669.295,653.64,
27.000000,650.088,687.553,755.271,871.016,
28.000000,905.952,854.618,966.855,1287.72,
29.000000,1296.44,1299.57,1456.39,1922.2,
30.000000,1624.8,1531.14,1924.82,2360.43,
31.000000,1751,1723.14,2069.56,2174.58,
32.000000,1524.3,1222.3,1720.3,2108.83,
33.000000,1315.1,1049.13,1456.75,1684.32,
34.000000,926.416,845.284,983.326,1202.67,
35.000000,730.448,745.568,817.831,904.255,
36.000000,606.294,643.006,775.374,720.93,
37.000000,538.163,580.006,653.046,650.045,
38.000000,520.174,554.075,570.134,606.904,
39.000000,481.038,511.152,570.992,540.017,
40.000000,484.518,512.148,527.963,543.1,
41.000000,504.08,508.929,594.108,575.899,
42.000000,625.564,681.01,777.304,696.065,
43.000000,706.952,819.48,927.61,836.884,
44.000000,1017.03,1227.3,1339.28,1331.26,
45.000000,1527.76,1473.37,1715.53,2054.1,
46.000000,1832.18,1885.67,2353.71,2532.5,
47.000000,1684.7,1807.33,2137.01,2591.05,
48.000000,1497.08,1531.68,1992.53,2175.02,
49.000000,974.294,1078.34,1600.06,1694.85,
50.000000,728.804,730.776,1030.19,1093.36,
51.000000,640.236,633.7,841.694,817.268,
52.000000,586.216,529.04,720.517,698.957,
53.000000,538.152,537.009,702.628,606.959,
54.000000,486.952,496.964,545.841,572.959,
55.000000,472.116,484.03,511.48,546.019,
56.000000,468.994,467.948,508.008,520.987,
57.000000,484.027,501.104,535.067,549.043,
58.000000,553.864,582.138,721.638,668.984,
59.000000,588.184,657.536,804.464,859.196,
60.000000,772.44,846.748,1082.09,1260.35,
61.000000,1025.06,1185.96,1599.53,1832.71,
62.000000,1373.16,1479.99,1952.56,2152.05,
63.000000,1503.38,1465.18,2240.95,2257.82,
64.000000,1046.07,1307.11,1951.11,1957.04,
65.000000,867.874,1004.58,1344.82,1410.73,
66.000000,618.219,752.232,960.94,941.808,
67.000000,548.6,617.646,776.45,754.996,
68.000000,500.44,552.508,662.6,643.176,
69.000000,465.404,528.088,622.616,552.95,
70.000000,476.104,485,564.49,526.095,
71.000000,458.576,500.068,528.058,530.488,
72.000000,457.016,458.548,530.484,488.49,
73.000000,477.408,481.044,531.572,525.968,
74.000000,499.094,596.6,699.984,644.104,
75.000000,577.671,716.348,849.56,751.108,
76.000000,665.341,934.588,944.7,1156.87,
77.000000,773.572,1113.01,1139.14,1583.24,
78.000000,881.298,1469.36,1448.71,1788.29,
79.000000,853.758,1463.49,1392.69,1713.53,
80.000000,709.02,1291.82,1294.51,1628.76,
81.000000,728.589,952.192,906.64,1187.65,
82.000000,570.977,671.52,712.184,761.528,
83.000000,502.064,585.076,610.092,634.434,
84.000000,476.094,510.508,537.82,569.108,
85.000000,455.94,511,537.982,548.94,
86.000000,451.461,467.52,498.985,509.968,
87.000000,434.016,459.44,469.924,504.479,
88.000000,441.502,452.1,468,481,
89.000000,470.392,496.888,488.001,491.99,
