Time [ms],1000000000,
0,431.999,
1000000000,420.982,
2000000000,419.98,
3000000000,413.05,
4000000000,411.025,
5000000000,410.025,
6000000000,416.998,
7000000000,410.05,
8000000000,407.524,
9000000000,418.004,
10000000000,411.024,
11000000000,403.98,
12000000000,405.998,
13000000000,409.004,
14000000000,400.98,
15000000000,410.001,
16000000000,413.018,
17000000000,407.975,
18000000000,412.002,
19000000000,415.983,
20000000000,417.005,
21000000000,415.996,
22000000000,408.014,
23000000000,406.997,
24000000000,409,
25000000000,406.022,
26000000000,410.018,
27000000000,408.97,
28000000000,405.004,
29000000000,409,
30000000000,404.992,
31000000000,414.011,
32000000000,415.004,
33000000000,415.009,
34000000000,410.013,
35000000000,411.016,
36000000000,411.015,
37000000000,422.016,
38000000000,412.03,
39000000000,411.032,
40000000000,407,
41000000000,408.016,
42000000000,407.987,
43000000000,411,
44000000000,409.01,
45000000000,403.994,
46000000000,408.992,
47000000000,414.016,
48000000000,408.02,
49000000000,414.99,
50000000000,409.99,
51000000000,417.024,
52000000000,409.992,
53000000000,404,
54000000000,404.01,
55000000000,407.984,
56000000000,411.003,
57000000000,418.006,
58000000000,413.004,
59000000000,405.992,
60000000000,419.032,
61000000000,406.96,
62000000000,411.02,
63000000000,405.006,
64000000000,401.009,
65000000000,408.99,
66000000000,410.975,
67000000000,406.988,
68000000000,407.008,
69000000000,407.016,
70000000000,411,
71000000000,411.04,
72000000000,405.027,
73000000000,411.976,
74000000000,408.056,
75000000000,403.024,
76000000000,405.004,
77000000000,410.98,
78000000000,409.004,
79000000000,407,
80000000000,405.986,
81000000000,411,
82000000000,411.008,
83000000000,414.004,
84000000000,421.984,
85000000000,412.98,
86000000000,407,
87000000000,404.992,
88000000000,407.014,
89000000000,408.013,
90000000000,409.021,
91000000000,409.002,
92000000000,405.99,
93000000000,403.504,
