Time [ms],1000000000,1000000001,1000000002,1000000003,
0,542.94,540.003,552.984,578.072,
1000000000,581.964,615.9,614.995,599.946,
2000000000,646,689.941,700.945,685.036,
3000000000,757.93,747.966,780.977,834.019,
4000000000,773.987,834.122,927.073,925.785,
5000000000,792.944,817.095,994.084,998.036,
6000000000,767.93,887.146,956.994,906.937,
7000000000,734.082,840,869,875.084,
8000000000,718.068,736.136,828.126,767.081,
9000000000,646.98,667.014,754.76,692.934,
10000000000,611.968,662.068,712.894,678,
11000000000,570.54,628.987,645.944,617.93,
12000000000,532.028,564.006,607.1,592.992,
13000000000,513.988,560.992,583.075,595.98,
14000000000,506.032,529.03,555.072,560.984,
15000000000,503.976,531,540.008,542,
16000000000,489.997,511.06,518.044,531.969,
17000000000,488.031,520.084,520.044,534.034,
18000000000,476.952,512.066,528.98,521.982,
19000000000,484.05,507.052,527.96,522.495,
20000000000,495.03,496.016,542.966,545.486,
21000000000,517.96,486.02,572.056,545.05,
22000000000,524.5,552.985,604.976,589.109,
23000000000,559.536,562.971,675,659.558,
24000000000,610.028,604,747.22,670.468,
25000000000,659.008,661.124,725.954,705.485,
26000000000,616.96,665.025,723.952,720.9,
27000000000,595.08,654.788,675.032,668.97,
28000000000,604.474,649.081,626.054,633.084,
29000000000,583.997,582.051,613.926,624.484,
30000000000,554.976,601.998,580.04,599.536,
31000000000,526.018,568.972,594.936,601.061,
32000000000,519.995,568.002,556.024,552.544,
33000000000,519.932,560.968,517.976,557,
34000000000,506.97,550.03,528.052,539.988,
35000000000,495.036,506.989,532.048,520.484,
36000000000,490.924,505.068,515.04,517.056,
37000000000,498.008,493.024,506.024,504.981,
38000000000,479,502.93,514,500.005,
39000000000,469.977,492.044,502.001,523.02,
40000000000,473.96,486.968,503.012,498.048,
41000000000,495.986,514.941,526.962,519.04,
42000000000,489.975,505.968,535.96,522.023,
43000000000,525.016,544.985,574.94,551.005,
44000000000,529.015,534.04,596.996,564.05,
45000000000,560.999,584.048,578.036,599.052,
46000000000,551.97,600,606,575.023,
47000000000,539.902,572.048,593,568.92,
48000000000,534.976,551.048,533.048,569.016,
49000000000,516.968,544.888,571.08,548,
50000000000,505.036,552.02,551.954,551.94,
51000000000,504.998,526.12,524.96,537.93,
52000000000,504.937,506.008,528.92,514.024,
53000000000,483.016,516.944,521.944,520.92,
54000000000,468.052,507.968,488.977,506.056,
55000000000,461.02,486.956,493.033,499.956,
56000000000,476.048,501.965,504.044,500.98,
57000000000,462.037,489.983,491.966,494,
58000000000,463.068,481.008,516,487.99,
59000000000,466.96,474.992,513.97,496.536,
60000000000,469,476.012,511.528,494.05,
61000000000,467,504.032,504.48,508.042,
62000000000,486.028,486.052,515.048,520.1,
63000000000,481.942,503.026,527.96,512.969,
64000000000,489,504.994,526.984,537.95,
65000000000,501.031,492.032,529.988,545.09,
66000000000,511.984,509.096,538.5,529.05,
67000000000,494.965,506.044,534.014,522.91,
68000000000,503,493.016,498.09,506.05,
69000000000,470.02,501,510.04,499.055,
70000000000,479.031,495,500,511.025,
71000000000,480.96,477.024,502.016,500.05,
72000000000,470.944,478.984,491.04,513.07,
73000000000,469.94,474,480,490.96,
74000000000,465.98,484.044,500.032,499.962,
75000000000,462.024,476.976,508.054,486.986,
76000000000,475.038,476,486.918,497.04,
77000000000,456.976,481.056,487.992,484.956,
78000000000,458.98,474.004,494.024,484.997,
79000000000,464.036,478.956,487.976,491.005,
80000000000,459.995,482.984,487.998,487.96,
81000000000,475,473.952,496.032,485.022,
82000000000,466.986,476.978,480,493.996,
83000000000,474.001,489.032,491,492.92,
84000000000,451.017,469.96,487.08,488.052,
85000000000,476.006,488.516,507.957,500.975,
86000000000,473.504,479.504,484.029,486.049,
87000000000,469.021,475.498,488.036,490.999,
88000000000,459.55,464.482,477.48,485.998,
89000000000,477.48,472.456,485.048,475,
90000000000,462.496,482.976,492,478.942,
91000000000,457.009,466.016,491.48,474.04,
92000000000,451.48,475,476.988,471.964,
93000000000,455.981,469.968,480.954,471.008,
94000000000,457.507,463.984,478.98,475.054,
95000000000,448.984,467.008,478.976,487.04,
