Time [ms],1000000000,1000000001,1000000002,1000000003,
0,563.122,624,592.07,644.078,
1000000000,596.004,591.973,600.013,658.992,
2000000000,831.079,762.784,720.268,929.907,
3000000000,1244.71,1203.75,970.184,1350.2,
4000000000,1484.62,1356.71,1137.8,1910.56,
5000000000,1626.21,1389.73,1147.72,2139.43,
6000000000,1505.8,1464.82,1180.04,2246,
7000000000,1374,1337,1057.76,2170.3,
8000000000,1215.15,1270.62,1067.94,1998.87,
9000000000,1076.15,1184,1011.3,1770.28,
10000000000,979.997,1075.45,891.095,1591.26,
11000000000,838.125,994,886.948,1377.94,
12000000000,813.927,918,842.236,1264.47,
13000000000,699.926,902.688,767.112,1164,
14000000000,676.962,806.856,827.256,1073,
15000000000,643.047,740.076,634.978,938.038,
16000000000,617.965,751.904,679.045,871.716,
17000000000,599.08,707.166,633.04,883.696,
18000000000,582.98,701.904,625.936,902.24,
19000000000,703.01,756.81,649.912,957.748,
20000000000,792.13,857.786,693.992,1144.78,
21000000000,958.023,1003.7,749.9,1155.04,
22000000000,1031.86,1104.73,729.12,1160.51,
23000000000,1026.2,1104.32,770.09,1217,
24000000000,916.138,1112.8,724.928,1218.86,
25000000000,856.161,1021.31,716.008,1052.49,
26000000000,809.119,963.498,667.156,1086.98,
27000000000,721.921,866.006,698.014,948,
28000000000,667.959,814.938,684.008,868.248,
29000000000,636.03,759.98,632.889,808,
30000000000,608.992,712.999,606.995,754.032,
31000000000,583.005,680.002,586.066,767,
32000000000,566.94,694.056,556.904,675.928,
33000000000,531,622.1,550.056,656.904,
34000000000,538.03,613.091,563.087,660.176,
35000000000,540.937,640.932,536.072,660.924,
36000000000,551.935,642.112,548.064,711.12,
37000000000,595.967,656.991,577.938,715.152,
38000000000,631.091,721.15,586.068,792.008,
39000000000,663.043,701.054,627.111,870.696,
40000000000,726.024,825.15,616.97,915.788,
41000000000,706.065,783.887,631.07,919.044,
42000000000,703.916,752.963,649.947,819.98,
43000000000,710.902,696.058,611.953,824.877,
44000000000,624.04,677.932,547.508,795.86,
45000000000,641.06,653.098,539.512,775.896,
46000000000,618.978,651.222,529.025,729.908,
47000000000,599.04,621.164,506.052,709.086,
48000000000,578,600.128,510.86,675.929,
49000000000,543.032,590.014,518.96,621.986,
50000000000,531.998,593.915,500.98,626.024,
51000000000,523.98,579.014,497.524,570.504,
52000000000,531.04,546.07,495.416,603.984,
53000000000,522.946,573.92,514.984,600.068,
54000000000,531.068,574.135,516.548,603.894,
55000000000,544.016,594.934,510.02,603.093,
56000000000,544.033,578.032,529.528,666.152,
57000000000,582.412,622.138,501,675.938,
58000000000,601,655.066,516.996,704.022,
59000000000,598.008,685.892,511.912,647.926,
60000000000,596.96,663.006,517.032,685.06,
61000000000,566.976,592.1,523.59,657.979,
62000000000,575.016,617.984,509.55,583.974,
63000000000,578.088,593.984,514.488,641.989,
64000000000,553.038,564.977,512,618.078,
65000000000,535.032,565.982,506.028,606.939,
66000000000,537.064,560.068,492.528,586.976,
67000000000,515.496,568.982,483.013,551.052,
68000000000,521.992,577.96,492.508,581.02,
69000000000,528.042,529.048,477.456,572.958,
70000000000,500.036,542.968,485.984,542.012,
71000000000,493.036,545.032,477.96,593.073,
72000000000,526.51,533.932,475.5,585.066,
73000000000,525,554,472.512,584.14,
74000000000,533.048,565,487.972,603.96,
75000000000,519.004,585.964,477.48,581.044,
76000000000,542.05,573.976,478.04,586.483,
77000000000,534.044,574.03,496.55,598.978,
78000000000,549.074,559.963,487.018,571.028,
79000000000,555.046,580.976,469.04,573.084,
80000000000,525.032,525.98,486.008,539.92,
81000000000,513.008,510.992,488.984,602.528,
82000000000,512.952,538.932,495.516,542.06,
83000000000,498.034,515.864,475.024,547.055,
84000000000,501.025,503.948,476.005,520.556,
85000000000,517.044,513.048,483.02,528.96,
86000000000,495.96,520.992,463.99,513.48,
87000000000,494.992,515.991,474,519.992,
88000000000,521.03,527,457.5,526.936,
89000000000,489.058,495.968,474.05,530.03,
90000000000,503.064,526.968,473.018,507.003,
91000000000,501.996,524.985,470.04,535.933,
92000000000,509.054,528.05,479.015,546.944,
93000000000,529.02,527.024,486.008,531.448,
94000000000,538.032,540.04,484.992,529.991,
95000000000,512.02,533.98,484.974,553.03,
