Frame number,1000000000,1000000001,1000000002,1000000003,1000000004,1000000005,1000000006,
0.000000,511.971,526.032,522.484,881.048,533.932,654.112,457.984,
1.000000,473.028,510.952,479.008,676.914,472.08,586.482,433,
2.000000,473.042,475.08,465.5,640.2,492.952,618.881,451.005,
3.000000,471.99,521,463.976,607.6,490.928,633.956,442.99,
4.000000,469.02,496.944,463.984,582.85,497.98,542.906,440.006,
5.000000,460.528,478,475.5,630.087,482,527.048,446,
6.000000,465.016,472.005,467.528,609.1,480.042,494.998,444.028,
7.000000,457.984,467.026,465.04,623.048,459.056,511.972,455.48,
8.000000,450.972,444.512,459,625.944,474.94,501.977,455.501,
9.000000,448.036,443.984,482.052,614.881,457.016,490.045,434.532,
10.000000,442,450.02,469.98,630.01,478.008,497.948,434.003,
11.000000,458.002,439.5,470.496,599.895,463.964,493.979,435.013,
12.000000,446.98,448,478.5,598,459.024,477.552,438.008,
13.000000,456.998,444.016,474.046,632.148,461.976,487.04,453.003,
14.000000,475.036,450.03,481.496,765.29,482.027,499,438,
15.000000,468.98,465.04,474.922,742.16,543.02,503.07,475.026,
16.000000,498.99,475.028,510.99,954.789,539.54,565.084,495.072,
17.000000,538.02,494.944,530.964,1059.91,546.456,637.184,518.01,
18.000000,541.07,533,543,1063.93,566.62,672.4,505.032,
19.000000,541.07,544.028,586.125,1076.39,583.05,746.216,503.972,
20.000000,551.004,591.972,580.156,904.476,605.354,750.552,497.062,
21.000000,606.9,541.904,579.486,870.24,557.064,753.33,499.088,
22.000000,577.104,537.92,580.972,948.176,495.024,699.38,498.95,
23.000000,564.1,512.02,555.56,820.054,513.556,708.092,511.033,
24.000000,542.066,525.566,580.068,753.328,515.396,636.08,466.036,
25.000000,543.944,516.002,516.008,716.88,477.96,599.52,457.996,
26.000000,516.06,500.528,499.964,689.854,486.996,572.104,462.02,
27.000000,490.072,480,482.942,678.85,472.936,535.552,461.997,
28.000000,477,490.986,494.04,611.872,458.448,571.548,448.01,
29.000000,476.468,479.88,471.048,616.204,544.473,547.464,436.012,
30.000000,476.476,490.928,472.07,618.816,474.984,561.098,434,
31.000000,519.912,491.016,469.936,647.128,490.998,527.104,452.98,
32.000000,519.044,493.09,495.104,675.836,477.95,543.816,451.984,
33.000000,531.096,481.96,480,855.928,501.484,570.576,465.928,
34.000000,539.04,488,510.986,884.125,510.97,627.576,468.096,
35.000000,548.504,475.068,519.072,873.16,535.904,663.02,487.08,
36.000000,504.5,470.852,487.004,816.96,533.04,732.192,492.96,
37.000000,538.06,494.1,484.944,781.78,516.072,747.06,470.964,
38.000000,517.5,509.936,518.48,614.448,493.952,744.6,464.968,
39.000000,507.08,517.008,513.016,764.16,464.912,628.98,459.96,
40.000000,487.952,487.964,482.972,662.934,497.956,657.86,442.03,
41.000000,482.072,472.08,485.976,651.448,469.048,623.14,443.02,
42.000000,459.01,454.064,484.504,694.133,519.988,591.136,431,
43.000000,524.083,452.98,469.484,677.136,544.4,540.812,428,
44.000000,487.972,434.02,461.924,662.048,536.962,549.072,452.024,
45.000000,471.988,456.072,470.976,645.91,516.86,656.076,447.032,
46.000000,482.04,455.054,472.508,620.884,554.988,613.036,450.026,
47.000000,482.084,457.968,472.944,643.6,619.11,625.012,442.04,
48.000000,505.96,479.06,503.88,647.856,579.008,565.164,471.92,
49.000000,527.938,473.524,507.13,701,507.884,628.98,489.97,
50.000000,568.94,509.116,524,764.628,571.58,695.836,518.56,
51.000000,591.01,524.984,635.96,748.076,600.857,745.132,509.552,
52.000000,594.104,532.897,626.827,764.016,601.102,875.76,511.036,
53.000000,616.032,527.87,650.96,863.99,569.136,767.64,515.476,
54.000000,528.084,543.044,589.03,767.344,552.108,726.736,474.502,
55.000000,537.068,551.012,641.104,764.984,597.19,813,552.89,
56.000000,535.914,539.032,617.076,738.819,550,785.4,535.008,
57.000000,525.032,533,575.106,713.185,564.44,682.24,531,
58.000000,537.972,522.088,549.6,644.881,582.53,801.71,520,
59.000000,515.98,526.932,536.956,682.176,538,730.96,494.02,
60.000000,511.016,509.932,540.008,684.955,541.1,759.776,493,
61.000000,513.944,498.928,557.084,673.56,514.96,720.316,491,
62.000000,531.912,480.104,521.54,690.532,533.944,846.96,473.896,
63.000000,531.02,506.96,522.112,627.144,508.074,908.006,531.952,
64.000000,524,491,505,654.934,507.55,859.606,532.075,
65.000000,569.948,514,526.533,679.784,519.02,870.88,543,
66.000000,561.502,521,550.055,646.24,531.08,718.98,573.516,
67.000000,581.512,540.872,529.966,649.776,518,694.032,626,
68.000000,584.97,542.092,576.115,794.12,545.93,659.168,667.512,
69.000000,570.16,600,567.071,818.042,521.116,630.16,605.044,
70.000000,601.884,604.944,603.109,781.913,523.954,621.12,556.46,
71.000000,591.45,593.06,606.109,713.2,539,697.464,624.016,
72.000000,567.888,553.44,598.037,848.181,565,691.85,589.056,
73.000000,546.9,618.848,580.012,839.812,575.095,726.54,524.144,
74.000000,578.072,596.552,575.893,631.864,533.124,710.056,518.076,
75.000000,558,567.104,568.93,634.014,527,683.064,511.912,
76.000000,537.508,530.472,551.933,617.868,534.08,669.98,510.968,
77.000000,506.5,564.492,577.109,735.98,541.944,641.404,508.008,
78.000000,510.972,550.472,494.966,714.062,548.1,603.46,496.024,
79.000000,496.012,525.576,507.948,758.04,498.044,625.192,500.008,
80.000000,512.99,563.54,507.505,696.92,471.952,606.09,515.9,
81.000000,523.404,606.456,491.058,662.968,463,595.908,547.982,
82.000000,547.928,614.1,486.09,721.088,470.56,583.576,649.098,
83.000000,558.512,609.412,502.058,719.02,511.512,559.536,627.14,
84.000000,592.924,621,515.07,819.888,494,564.956,678.145,
85.000000,580.04,663.064,490.504,856.92,516.028,588.42,699.9,
86.000000,577.6,634.9,516.057,920.98,511.536,547.5,652.016,
87.000000,573.11,659.568,495.505,923.872,514.032,547.032,671.26,
88.000000,574.168,633.448,499.513,930.448,490.964,533.1,648.108,
89.000000,539.5,648.044,509.96,847.904,523,513.204,628.88,
90.000000,535.52,623.02,516.96,865.988,527.016,543.956,572.152,
91.000000,511,568.976,502.992,801.05,520.928,539.504,577.248,
92.000000,535.056,561.09,471.004,659.976,556.102,583.47,578.09,
93.000000,510.968,523.928,478.008,686.476,511.08,601.954,569.512,
94.000000,508.984,567.136,489.542,684.016,512.944,584.486,577.044,
