
Intensity Median
 ==================== 
Time [s],1000000000,1000000001,1000000002,1000000003,1000000004,1000000005,1000000006,
0.000000,457.993,535.08,589.872,470.492,533.021,482.036,480.05,
1.000000,450.011,540.032,557.6,479.02,509.5,477.025,448.056,
2.000000,462,502.952,534.072,476.52,535.059,496.504,482,
3.000000,472.024,562.508,566.992,484.984,593.912,515.474,521,
4.000000,517.548,628.856,666.084,536.013,693.016,564.988,570,
5.000000,557.014,712.236,839.117,625.944,875.08,683.045,695.027,
6.000000,623,776.182,949.061,710.96,1016.42,747.11,778.98,
7.000000,619.06,869,935.92,772.008,1122.79,760.08,771.162,
8.000000,603.076,809.923,934.155,749.08,1117.06,719.028,775.025,
9.000000,602.972,831.007,937.094,701.96,1048.09,724,766,
10.000000,592.928,855.929,872.08,693.992,912.1,722.964,741.986,
11.000000,539.024,828.049,903.92,680.508,917.78,644,720.087,
12.000000,558.904,849.102,789.064,630.082,883.158,661.504,675.872,
13.000000,539.058,806.156,765.96,604.016,873.864,624.957,651.936,
14.000000,535.008,804.998,694.928,566.062,822.043,608.9,642.956,
15.000000,513.896,769.004,632.908,569.98,720.14,581.02,614.926,
16.000000,499.04,639.232,637.92,540.984,684.101,543.04,580,
17.000000,473,595.013,583.024,534.04,669.542,521.015,539.025,
18.000000,483.476,539.02,570.024,500.029,654.492,494.02,514.008,
19.000000,465.988,558.05,562.524,480,594.52,504.996,546.568,
20.000000,464,521.977,565.458,479.004,594.04,498,501.973,
21.000000,475,529.056,566.05,487.504,576.992,490,530.028,
22.000000,476.029,547.032,598.94,503.964,612.96,515.064,548.97,
23.000000,517.968,628.128,660.952,529.04,671.628,560.05,593.068,
24.000000,527.031,745.156,756.1,565.104,854.972,615.956,658.01,
25.000000,557.076,886.137,817.832,624.952,878.08,660.96,729.06,
26.000000,564.074,1013.82,829.08,673.048,957.24,684,785.93,
27.000000,576.05,1033.83,799.965,654,945.988,691.064,831.799,
28.000000,572.936,1078.1,759.94,644.06,912.048,686.088,789,
29.000000,538.946,1053.37,754.088,646.872,886.08,664.068,750.954,
30.000000,551.98,940.536,725.092,629.972,844.032,625.116,736.092,
31.000000,541.008,942.048,711.096,577.032,782.816,599.974,699.152,
32.000000,528.484,796.14,685.504,562.985,739.92,595.08,651.044,
33.000000,518.52,747.968,655.956,578.048,718.146,598,619.932,
34.000000,506.077,776.96,656.048,549.952,697.96,558.964,652.914,
35.000000,514.902,678.056,606.986,538.04,676.976,548.972,613.993,
36.000000,494,614.982,573.04,519.03,629.936,516.016,570.032,
37.000000,494.99,567.091,550.008,519,618.042,530.002,550.986,
38.000000,495.912,538.984,525.956,486.04,561.025,515.997,555.985,
39.000000,475.96,545.992,543.996,493.99,539.467,507.964,525.5,
40.000000,477.027,549.044,559.508,478.004,534.992,508.031,521.122,
41.000000,481.01,548.485,582.554,487.001,561.984,525.028,555.05,
42.000000,507.016,571.006,611.948,506.038,633,558.96,586.944,
43.000000,537.124,657.973,630.164,514.966,651.96,576.024,692.09,
44.000000,538.024,691.894,631.932,549.024,750.08,581,762.108,
45.000000,563,870,669,555.08,834.952,636.084,796.12,
46.000000,553,764.134,632.068,577.042,882.984,614.872,791.088,
47.000000,548.028,820.056,632.08,581.044,794.99,579.997,754.048,
48.000000,542.04,832.955,611.11,567.012,823.912,588.067,735.12,
49.000000,534.016,792.976,624.968,543,758.994,573.049,716.902,
50.000000,542.956,742.088,610.058,547.984,738.98,574.946,705,
51.000000,531.932,783.996,601.064,551.025,709.096,556.028,693,
52.000000,529,770.94,585.024,536.08,693.072,542.501,636.88,
53.000000,520.038,763.086,580.036,511,648.008,536.48,636.882,
54.000000,516.48,675.97,557.064,519.006,633.984,515.54,657,
55.000000,485.479,663.006,560.976,499.959,592.04,515.964,609.084,
56.000000,493.948,650.092,539.032,491.038,587.968,505.98,556.983,
57.000000,495.04,682.537,542.964,479.016,576.028,503.992,557.984,
58.000000,492.025,590.99,527.04,478.982,569.072,515.96,551.966,
59.000000,487.016,636.02,528.965,482.052,579.036,513.976,580.056,
60.000000,481.002,618.032,549.027,488.992,576.05,525.948,568.018,
61.000000,480,621.072,545.031,491.992,566.04,511,612.882,
62.000000,502.016,662.164,561.023,487,601.997,523.96,601.998,
63.000000,494.992,710.116,550.971,503.996,636,522.024,653.972,
64.000000,521.09,697.012,547.08,509.976,654.84,519,663.889,
65.000000,512.934,724.138,568.036,523.964,667.076,518.048,680.032,
66.000000,496.02,733.04,566.989,517.96,690.004,509.948,657.003,
67.000000,500.984,743.916,560.042,518.96,692.896,539.992,672.922,
68.000000,515.976,732,551.042,526.016,690.54,539.01,651.952,
69.000000,496.06,765.18,548.042,542.992,673.063,522.02,664.084,
70.000000,500.004,735.04,549.018,510.02,652.06,522.018,638.904,
71.000000,489.98,772.02,534.005,508.995,612.012,513.008,664.08,
72.000000,504.936,696.896,525.912,498,597.019,516,594,
73.000000,501.984,726.09,538.044,490.962,603.484,513.104,543.056,
74.000000,486.997,715.125,523.005,497.972,591,488.966,618.056,
75.000000,481.068,717.844,522.944,485.986,574,513.028,571.05,
76.000000,478.006,608.56,503.975,480.5,568.049,497.036,569.984,
77.000000,464.012,657.016,504.95,480.036,582.88,492.958,588.846,
78.000000,480.016,645.932,493.02,482.994,576.992,491.997,576.01,
79.000000,478.008,675.884,517.006,493.976,600.984,507,612.966,
80.000000,479.052,616.012,509,487.015,567.96,503.014,614.096,
81.000000,474.956,636.168,545,479.988,617.896,509.004,585.018,
82.000000,477.019,663.036,536.048,495.46,613.9,516.02,632.904,
83.000000,492.026,659.91,524.032,488.015,601.063,512.98,649,
84.000000,485.044,667.1,518.04,487.52,631.97,501.066,625.1,
85.000000,491.03,707.804,517.986,484.505,597.944,517,613.912,
86.000000,483.951,698.178,519,501.51,638.852,508,631.984,
87.000000,479.025,895.142,503.968,498.52,612.978,509.04,641.028,
88.000000,482.989,836,522.974,497.501,624.952,500.957,650.05,
89.000000,475.025,841.202,508.048,478.986,627.036,488.024,629.09,
90.000000,483.992,800,510.04,476.503,606.938,497.988,603.484,
91.000000,476.008,794.772,503.032,483.016,613.896,479.976,596.068,
92.000000,479.96,743.016,504.932,471.012,590.968,488,574.488,
93.000000,475.996,744.048,498.987,470.486,569.992,482.025,583.948,
94.000000,472.027,735,512.02,476.52,603.06,467.979,588.928,
95.000000,451.046,740.032,488.014,469.976,599.956,479.521,604.08,
