Time [ms],1000000000,1000000001,1000000002,
0,728.832,663.971,723.04,
1000000000,780.97,711,718.084,
2000000000,806.828,834.036,797.985,
3000000000,1001.01,890.876,869.888,
4000000000,1051.17,911.808,1003.16,
5000000000,1075.23,964,997.12,
6000000000,1166.03,939,992.957,
7000000000,1102.82,907.976,954,
8000000000,938.196,849.88,896.112,
9000000000,943.868,786.104,870.22,
10000000000,834.118,748.968,834.976,
11000000000,787.264,719.029,786.955,
12000000000,751.884,638.816,647.92,
13000000000,716.075,618.868,670.94,
14000000000,667.05,601.952,628.061,
15000000000,634.07,580.989,589.068,
16000000000,620.075,544.028,591.052,
17000000000,658.06,557.933,588.098,
18000000000,635.076,551.104,572,
19000000000,631.966,541.16,541.962,
20000000000,606.928,559.079,558.952,
21000000000,615.052,539.926,569.966,
22000000000,671.9,559.979,626.998,
23000000000,646.923,581.2,640.024,
24000000000,695.084,601.052,665.96,
25000000000,691.052,641.996,679.05,
26000000000,754.928,616.945,668.949,
27000000000,731.916,623.859,674.987,
28000000000,699.996,604.2,636,
29000000000,656.932,584.084,600.096,
30000000000,647.868,571.104,594.1,
31000000000,652.868,591.936,587.052,
32000000000,590.096,563.939,594.044,
33000000000,600.905,565.976,551.933,
34000000000,558.145,550,568.952,
35000000000,570,542.958,546,
36000000000,556.978,535.075,534,
37000000000,540.994,506,515.025,
38000000000,549.99,510.96,496.016,
39000000000,539.13,511.08,500.995,
40000000000,533.057,506.936,499.05,
41000000000,550.895,498.1,504.924,
42000000000,561.01,503.984,508.969,
43000000000,602.055,527.945,545.884,
44000000000,614.967,515.08,559.002,
45000000000,609.076,532.034,559.92,
46000000000,607.924,550.134,565.064,
47000000000,625.154,546.012,552.02,
48000000000,577.945,541.916,569.936,
49000000000,607.025,534.08,532.08,
50000000000,591.495,514.907,538.996,
51000000000,574.098,504.931,523.028,
52000000000,563.938,498.98,525.01,
53000000000,580.066,493.035,527.07,
54000000000,533.921,517.006,506.982,
55000000000,545.896,508.08,492.042,
56000000000,529.038,493,477.044,
57000000000,498.922,493.992,498,
58000000000,512.96,483.952,479.965,
59000000000,506.034,486.053,490.96,
60000000000,497.05,481.035,490.034,
61000000000,530.022,488.009,476.96,
62000000000,521.912,489.008,475.078,
63000000000,544.075,491.06,495.984,
64000000000,523.93,492.056,497.076,
65000000000,536.12,492.925,498.028,
66000000000,509.104,488.048,482.032,
67000000000,517.061,482.985,485.96,
68000000000,541.03,482.017,515.98,
69000000000,514.035,489.028,493,
70000000000,524.916,484.98,473.038,
71000000000,534.068,487.976,494.08,
72000000000,511.044,492.05,488.99,
73000000000,517.073,485.948,483,
74000000000,505.058,488.022,481.048,
75000000000,513.05,475.017,474.956,
76000000000,517.128,468.088,467.96,
77000000000,502.11,474.02,478.106,
78000000000,472.03,477.048,483.068,
79000000000,511.997,476.048,472.004,
80000000000,512.053,458.05,468.032,
81000000000,514.058,469.993,485.975,
82000000000,492.936,477.025,479.981,
83000000000,507.057,469.073,467.064,
84000000000,521.014,484,474.022,
85000000000,525.92,465.909,472.938,
86000000000,513.076,486.072,477.03,
87000000000,515.9,470.039,469.086,
88000000000,496.039,477.984,483.048,
89000000000,502.024,478.965,474.018,
90000000000,476.024,480.975,476,
91000000000,496.955,472.022,484.918,
92000000000,482.992,469.032,469.034,
93000000000,480.996,459.044,471.024,
94000000000,480.02,457.987,471.07,
95000000000,494.924,461.96,464.944,
