Time [ms],1000000000,1000000001,
0,661.016,723,
1000000000,675,716.992,
2000000000,799.11,695,
3000000000,970.872,806.496,
4000000000,1421.25,956.874,
5000000000,1692.29,1014.93,
6000000000,1766.25,1049.94,
7000000000,1682.15,1017.92,
8000000000,1282.76,1021.06,
9000000000,1126.4,971.914,
10000000000,871.944,911.088,
11000000000,789.012,798.072,
12000000000,732.904,765.077,
13000000000,670.11,756.076,
14000000000,638.918,714.496,
15000000000,609.984,658,
16000000000,608.04,635.48,
17000000000,552.96,629.046,
18000000000,538,571.928,
19000000000,555.064,594.95,
20000000000,568.95,613.944,
21000000000,581.112,602.025,
22000000000,667.922,694.03,
23000000000,775.128,706.993,
24000000000,860.008,765.1,
25000000000,995.02,824.856,
26000000000,976.176,798.916,
27000000000,1020.83,832.953,
28000000000,989.148,729.105,
29000000000,873.03,722.1,
30000000000,762.064,730.056,
31000000000,686.912,689,
32000000000,679.078,629.92,
33000000000,620.976,606.064,
34000000000,592.024,578.088,
35000000000,566.992,580.864,
36000000000,546,533.052,
37000000000,521.948,542.96,
38000000000,516.026,537.957,
39000000000,517.01,523.036,
40000000000,533.955,533.966,
41000000000,533.012,564.97,
42000000000,571.988,606.1,
43000000000,610.942,613.928,
44000000000,728.018,691.94,
45000000000,780.932,679,
46000000000,831.933,713.932,
47000000000,867.153,662.956,
48000000000,801.012,656.021,
49000000000,749.093,669.984,
50000000000,711.92,612.962,
51000000000,673.104,600.084,
52000000000,616,590,
53000000000,576.008,559.072,
54000000000,575.952,545,
55000000000,536.036,540.05,
56000000000,536.08,509.05,
57000000000,534.01,519.992,
58000000000,533.996,518.992,
59000000000,517.924,505,
60000000000,509.514,514.038,
61000000000,489.032,537.041,
62000000000,515.02,554.005,
63000000000,552.52,575.04,
64000000000,604.973,591.05,
65000000000,639.996,604.005,
66000000000,710.524,614.02,
67000000000,714.015,632.094,
68000000000,723.95,600.02,
69000000000,697.032,587.5,
70000000000,676,574.06,
71000000000,627.064,562.008,
72000000000,597.523,548.04,
73000000000,581.936,547.908,
74000000000,545.942,524.008,
75000000000,546,517.014,
76000000000,535.016,521.975,
77000000000,502.038,481.504,
78000000000,536.016,502.55,
79000000000,503.02,506.04,
80000000000,496,508.04,
81000000000,487.976,522.942,
82000000000,507.028,543.962,
83000000000,544,547,
84000000000,555,583,
85000000000,569.982,572.998,
86000000000,610.962,589,
87000000000,668.084,593.944,
88000000000,649.984,565.06,
89000000000,680.044,576.968,
90000000000,634.03,552.003,
91000000000,648.926,559.92,
92000000000,601.072,530.06,
93000000000,585.08,513.951,
94000000000,582.976,521.992,
95000000000,528.96,514.96,
