Time [ms],1000000000,1000000001,1000000002,
0,640.915,646.472,602.994,
1000000000,677.112,745.54,674.96,
2000000000,755.072,846.08,806.092,
3000000000,844.852,944.706,1085.83,
4000000000,1066.21,1018.35,1107.05,
5000000000,992.907,1015,1213.23,
6000000000,1002,1015.25,963.04,
7000000000,881.942,807.208,936.587,
8000000000,763.935,772.488,790.479,
9000000000,707,704.024,715.547,
10000000000,684.12,639.56,676.956,
11000000000,624.904,597.92,603.01,
12000000000,578.058,566.068,572.944,
13000000000,571.076,580.102,587.072,
14000000000,558.976,531.926,530,
15000000000,535.054,517.016,519.004,
16000000000,510.08,532.034,523.04,
17000000000,514.52,519.968,510.986,
18000000000,523.56,503.046,527.05,
19000000000,541.488,539.939,561.06,
20000000000,564.079,579,601.072,
21000000000,623.041,600,624.977,
22000000000,671.053,670.816,726.102,
23000000000,759.095,698.15,667.11,
24000000000,714.097,702.266,670.973,
25000000000,692.001,633,652.563,
26000000000,647.226,611.979,623.986,
27000000000,645.921,630.944,584.915,
28000000000,614.924,592.019,589.098,
29000000000,576.005,576.07,563.058,
30000000000,557.034,536.935,564.488,
31000000000,535.049,535.961,536.497,
32000000000,528.969,509.005,524.982,
33000000000,529.05,504.06,527.104,
34000000000,515.992,502.022,487.898,
35000000000,522.898,503.997,508.992,
36000000000,518.99,504.996,493.05,
37000000000,495.044,498.984,530.018,
38000000000,524.014,495.976,529.995,
39000000000,526.98,536.046,536.988,
40000000000,555,567.994,586.054,
41000000000,582.176,568.964,595.95,
42000000000,565.606,590.071,622.052,
43000000000,581.526,567.152,603.106,
44000000000,577.087,579.882,579.986,
45000000000,565.977,584.04,570.073,
46000000000,578.538,586.164,559.992,
47000000000,553.032,562,533.973,
48000000000,562.525,538.93,514,
49000000000,537.02,530.958,497.936,
50000000000,532.98,536.87,502.045,
51000000000,521.972,514.984,490.02,
52000000000,508.92,497,500.997,
53000000000,511.003,491.06,474.037,
54000000000,490.996,491.022,480.949,
55000000000,485.05,502.936,465.022,
56000000000,502.055,498.986,486.019,
57000000000,484.923,509.967,487.944,
58000000000,487.964,517.001,497.98,
59000000000,485.04,519.078,485.968,
60000000000,520.995,514.082,491.519,
61000000000,534.049,548.886,515.532,
62000000000,515.989,545.906,515.536,
63000000000,523.1,564.038,526.036,
64000000000,541.091,522.954,545,
65000000000,517.987,549.926,516.98,
66000000000,526.492,530.894,488.938,
67000000000,496.46,525.956,505.005,
68000000000,493.972,539.972,512.54,
69000000000,497.1,504.02,492.977,
70000000000,490.48,492.984,477.923,
71000000000,478.032,498.996,463.021,
72000000000,478.996,488.035,478.012,
73000000000,466.018,474.005,468.054,
74000000000,482.976,489.014,488.014,
75000000000,480.036,485.974,474.022,
76000000000,486.028,488.042,461.96,
77000000000,487.015,497.027,471.933,
78000000000,469.024,479,492.946,
79000000000,479.022,498.012,487.039,
80000000000,497.042,500.024,488.95,
81000000000,512.963,515.036,521.986,
82000000000,516.979,514.035,521.979,
83000000000,518.952,549.892,503.05,
84000000000,526,542.948,509.02,
85000000000,499.024,538.1,495.965,
86000000000,498.986,512.045,498.977,
87000000000,499.04,509.969,497.995,
88000000000,488.99,496.021,497.98,
89000000000,488,488.04,462.007,
90000000000,499.069,499.04,481.984,
91000000000,477.012,499.02,481.963,
92000000000,482.01,491.999,471.05,
93000000000,483.062,487.979,461.968,
94000000000,480.928,471.92,472.036,
