Frame number,1000000000,
0.000000,534.967,
1.000000,517.016,
2.000000,511.987,
3.000000,514.064,
4.000000,499.058,
5.000000,482.978,
6.000000,469.014,
7.000000,453.98,
8.000000,450.992,
9.000000,444.96,
10.000000,447.991,
11.000000,441,
12.000000,436.036,
13.000000,434.012,
14.000000,433.993,
15.000000,437.968,
16.000000,434.976,
17.000000,448,
18.000000,457.001,
19.000000,469.035,
20.000000,455,
21.000000,451.026,
22.000000,455.014,
23.000000,448.988,
24.000000,447.05,
25.000000,439.003,
26.000000,437.029,
27.000000,439,
28.000000,432.012,
29.000000,436.02,
30.000000,431.04,
31.000000,436.976,
32.000000,446.979,
33.000000,439.008,
34.000000,449.968,
35.000000,448.003,
36.000000,447.98,
37.000000,450.992,
38.000000,445.007,
39.000000,448.516,
40.000000,438.98,
41.000000,443.512,
42.000000,434.995,
43.000000,434.528,
44.000000,435.004,
45.000000,449.504,
46.000000,434.496,
47.000000,437.998,
48.000000,447,
49.000000,456.97,
50.000000,438.998,
51.000000,445.05,
52.000000,440.987,
53.000000,440.99,
54.000000,438.015,
55.000000,431.008,
56.000000,438.025,
57.000000,432.006,
58.000000,436.005,
59.000000,440.992,
60.000000,436.982,
61.000000,430.012,
62.000000,440.5,
63.000000,456.034,
64.000000,444,
65.000000,439,
66.000000,442.985,
67.000000,435.019,
68.000000,436.956,
69.000000,434.988,
70.000000,432.988,
71.000000,435.05,
72.000000,430.972,
73.000000,437.019,
74.000000,437.004,
75.000000,434.018,
76.000000,439.99,
77.000000,437.99,
78.000000,442.02,
79.000000,443.029,
80.000000,443.007,
81.000000,437.99,
82.000000,444.956,
83.000000,441.977,
84.000000,432.036,
85.000000,429.98,
86.000000,434.022,
87.000000,435.996,
88.000000,432.986,
89.000000,437.523,
90.000000,433.012,
91.000000,441.025,
92.000000,444.01,
93.000000,438.972,
94.000000,434.007,
95.000000,447.957,
