Time [ms],1000000000,1000000001,
0,1629.19,1677.87,
1000000000,1609.8,1317.9,
2000000000,1722.17,1009.89,
3000000000,1992.1,1146.12,
4000000000,2004.38,1216.23,
5000000000,1999.12,1134.38,
6000000000,1809.75,1163.24,
7000000000,1650.62,1152.25,
8000000000,1674,1098.22,
9000000000,1681.99,1052.5,
10000000000,1555.28,1023.15,
11000000000,1492.38,948.088,
12000000000,1423.07,981.604,
13000000000,1320.82,968.128,
14000000000,1290.12,911.94,
15000000000,1315.8,941.9,
16000000000,1306.78,924.844,
17000000000,1354.94,959.036,
18000000000,1402.59,957.988,
19000000000,1343.26,941.22,
20000000000,1385.06,946.124,
21000000000,1520.43,1006.74,
22000000000,1519.09,1000.02,
23000000000,1406.18,966.348,
24000000000,1355.08,949.312,
25000000000,1243.12,926.2,
26000000000,1212.98,906.9,
27000000000,1195.99,890.992,
28000000000,1134.84,844.928,
29000000000,1068.04,891.2,
30000000000,1041.1,885.088,
31000000000,983.92,889.04,
32000000000,956.83,847.908,
33000000000,1021.87,820.084,
34000000000,1045.13,829.84,
35000000000,1038.9,828.896,
36000000000,1004.2,805,
37000000000,1047.14,836.048,
38000000000,1052.37,789.984,
39000000000,1070.1,838.074,
40000000000,1059.81,799.948,
41000000000,995.16,814.872,
42000000000,1005.09,777.044,
43000000000,929.04,799.916,
44000000000,949.049,749.864,
45000000000,862.484,742.968,
46000000000,873.984,730.916,
47000000000,829.196,724.022,
48000000000,803.024,754.205,
49000000000,808.01,736.184,
50000000000,822.052,716.96,
51000000000,762.034,720.143,
52000000000,754.994,686.44,
53000000000,747.084,722.408,
54000000000,798.072,682.094,
55000000000,795.052,624.94,
56000000000,816.045,643.07,
57000000000,761.984,667.05,
58000000000,773.938,658.096,
59000000000,782.89,662.08,
60000000000,790.896,654.06,
61000000000,715.05,625.044,
62000000000,717.104,644.104,
63000000000,726.04,616.98,
64000000000,719.029,645.072,
65000000000,717.048,636.96,
66000000000,711.944,623,
67000000000,683.992,614.008,
68000000000,681.036,609,
69000000000,653.99,608.904,
70000000000,671.03,603.056,
71000000000,679.935,591.056,
72000000000,672.966,596.026,
73000000000,650.008,592.956,
74000000000,641.084,622.086,
75000000000,646,572,
76000000000,637.012,596.022,
77000000000,673.068,617.008,
78000000000,659.048,612,
79000000000,634.94,602.08,
80000000000,639.056,583.04,
81000000000,634.05,583.94,
82000000000,654.024,590.072,
83000000000,610.95,587.084,
84000000000,594.016,577.972,
85000000000,594.015,560.06,
86000000000,596.973,562.952,
87000000000,569.99,549.046,
88000000000,573.006,559.056,
89000000000,596.01,555.96,
90000000000,579.504,556.98,
91000000000,583.484,528.04,
92000000000,589.508,561.056,
93000000000,579.056,566.98,
94000000000,606,548.954,
95000000000,589.984,548.862,
