Time [ms],1000000000,1000000001,
0,843.14,667.974,
1000000000,906.995,711.058,
2000000000,1080.2,771.94,
3000000000,1350.62,957.056,
4000000000,1305.96,1143.1,
5000000000,1354.82,1303.81,
6000000000,1177.21,1345.13,
7000000000,1173.68,1259.14,
8000000000,1038,1136.85,
9000000000,1006.52,1088.14,
10000000000,947.016,1006.03,
11000000000,895.024,973.02,
12000000000,843.88,901.066,
13000000000,786.14,873.062,
14000000000,803.93,843.966,
15000000000,764.26,801.11,
16000000000,751.986,758.047,
17000000000,730.99,770.008,
18000000000,728.05,733.016,
19000000000,704.504,800.988,
20000000000,753.04,846,
21000000000,795.104,894.016,
22000000000,839.928,1017.99,
23000000000,813.2,1005.04,
24000000000,826.062,935.092,
25000000000,791.036,949.971,
26000000000,760.834,969.946,
27000000000,789,959.048,
28000000000,762.904,910.262,
29000000000,730.45,845.02,
30000000000,704.88,814.008,
31000000000,668.098,768.484,
32000000000,668.02,749.024,
33000000000,679.039,734.93,
34000000000,667.08,697.998,
35000000000,638.056,693.97,
36000000000,678.883,689.912,
37000000000,644.08,715.988,
38000000000,727.076,801.016,
39000000000,708.476,813.52,
40000000000,737.961,829.956,
41000000000,704.995,824.944,
42000000000,742.96,778,
43000000000,713.556,783.06,
44000000000,717.02,787.112,
45000000000,704.52,735.081,
46000000000,706.12,730.188,
47000000000,636.532,661.024,
48000000000,657.36,672.026,
49000000000,632.91,659.962,
50000000000,617.955,611.97,
51000000000,609.064,630.054,
52000000000,614.47,591.018,
53000000000,584.95,590,
54000000000,598.096,637.928,
55000000000,603,657.039,
56000000000,625,698.044,
57000000000,672.459,669.928,
58000000000,640.88,668.944,
59000000000,625.056,684.944,
60000000000,632.528,658.95,
61000000000,624.016,633.986,
62000000000,612.095,624.983,
63000000000,592.928,601.442,
64000000000,583.08,589.939,
65000000000,598.976,569.044,
66000000000,582.028,567.004,
67000000000,571.504,567,
68000000000,558.022,549.074,
69000000000,555.99,554.024,
70000000000,574.52,559.55,
71000000000,557.992,573,
72000000000,588.96,609.036,
73000000000,583.016,599.94,
74000000000,590.956,601.091,
75000000000,586.1,583.928,
76000000000,612.92,613.962,
77000000000,605.972,588.967,
78000000000,569.046,575.05,
79000000000,583.98,556.962,
80000000000,579.042,543.972,
81000000000,562.045,545.078,
82000000000,550.942,544.024,
83000000000,561.056,532.978,
84000000000,554.548,533.924,
85000000000,536.5,527.99,
86000000000,553.984,504.073,
87000000000,552.949,517.028,
88000000000,545.958,519.024,
89000000000,536.08,518.022,
90000000000,536.96,542.987,
91000000000,545.972,532.496,
92000000000,535.982,557.96,
93000000000,558.982,537.972,
94000000000,558,530.986,
95000000000,561.974,514.472,
