Frame number,1000000000,1000000001,1000000002,1000000003,1000000004,1000000005,1000000006,
0.000000,652.112,789.397,988.416,837.628,783.972,638.858,546.9,
1.000000,665.355,855.532,966.38,704.798,728.36,603.972,535.013,
2.000000,678.08,781.564,983.98,693.276,636.634,586.05,471.452,
3.000000,685.56,797.108,934.899,684.108,708.14,561.58,531.91,
4.000000,607.052,745.224,819.02,635.832,619.91,507.72,528.168,
5.000000,585.4,683.827,770.005,573.976,565.97,518.376,481.551,
6.000000,537.99,602.98,733.878,551.006,525.62,471.476,467.974,
7.000000,509.14,587.152,710,504.584,522,448.023,467.08,
8.000000,508.943,556.034,688.136,531.384,517.512,474.977,467.086,
9.000000,521.904,549.158,645.844,518.168,489.96,468.035,467.97,
10.000000,519.118,516.824,632.96,496.08,496.464,459,485.952,
11.000000,505.11,505.006,606.06,493.088,478.03,457.039,455.958,
12.000000,496.104,491.916,556.882,507.192,491.03,460.07,453.59,
13.000000,512.896,504.104,545.844,503.144,503.065,471.025,458.55,
14.000000,570.128,517.025,578.08,592.8,546.89,473.948,473.119,
15.000000,699.32,556.983,601.922,629.608,615.768,510.976,522.069,
16.000000,811.834,660.007,675.8,659.05,719.88,536.8,542.05,
17.000000,827.822,738.489,774.824,812.008,744.348,604.944,565.168,
18.000000,832.843,871.538,776.24,789.772,788.728,602.047,590.857,
19.000000,763.424,851.4,760.96,862,786.18,601.978,596.025,
20.000000,708.288,813.106,777.018,779.852,700.484,568.209,514.111,
21.000000,670.016,709.93,790.12,769.892,717.016,549.918,516.188,
22.000000,632.832,629.149,721.24,678.958,583.968,556.807,529.134,
23.000000,582.92,608.006,709.89,623.892,564.88,535.976,512.06,
24.000000,559.96,587.015,654.916,573.964,573.024,522.944,495.972,
25.000000,520.064,526.12,594.41,527.062,528.18,500.984,479.984,
26.000000,504.976,501.978,594.04,519.988,500.1,489.962,470.004,
27.000000,493.912,485.056,561.1,527,487,489.982,468.5,
28.000000,512.444,483.465,528.16,497.081,492.978,469.504,454,
29.000000,507.57,496.956,525.092,505.996,496.054,465.552,459.524,
30.000000,525.412,492.968,516.498,522.052,517.056,454.999,469.041,
31.000000,584.444,480.043,517.006,547.996,552.108,459.928,512.168,
32.000000,666.9,513.516,523.09,630.912,601.935,525.08,527.168,
33.000000,720.369,603.125,599.976,706.238,681.035,536.02,599.945,
34.000000,749.4,731.238,652.922,739.072,728.986,600.394,583.226,
35.000000,831.13,806.854,726.8,742.336,700.811,665.313,561.9,
36.000000,744.952,826.638,709.152,723.024,649.969,649.071,540.048,
37.000000,702.21,838.762,668.083,662.766,672.24,611.953,510.999,
38.000000,671.032,738.924,646.94,645.93,597.88,599.76,531.917,
39.000000,574.152,651.966,667.14,635,540.936,549.115,547.455,
40.000000,572.99,591.898,628,585.94,548.904,516.115,520.462,
41.000000,555.094,565.036,583.048,560.032,509.972,493.018,492.968,
42.000000,523.992,519.112,564.85,511.98,504.964,498.003,491.508,
43.000000,480.991,485.944,557.046,506.004,495.014,459.921,472.028,
44.000000,487.064,469.029,508.112,471.9,482.968,471.92,470.082,
45.000000,483.992,487.942,502.09,466.504,451.059,467.049,469.05,
46.000000,471,464.951,490.1,474.489,466,466.04,451.05,
47.000000,481.148,488.086,505.005,451.46,455.978,471.006,460.1,
48.000000,492.148,469.1,502.12,466.528,492.1,473.016,459.134,
49.000000,568,484.04,521.982,483.538,509.166,475.962,497.007,
50.000000,561.9,530.996,540.834,488.892,543.972,495.944,515.931,
51.000000,588.969,575.414,596.156,546.964,593.168,516.956,488.2,
52.000000,579.096,642.632,608,550.012,589.336,533.176,478.95,
53.000000,594.17,690.564,625.976,564.5,618.72,552.124,482.063,
54.000000,575.808,681.72,620.925,573.048,591.42,534.144,470.98,
55.000000,548.942,635.06,598.9,532.52,560.91,509.808,446.006,
56.000000,542.076,587.575,577.836,515.496,535.993,502.982,444.022,
57.000000,533.928,562.416,547.032,499.52,496.746,490.103,456.008,
58.000000,476.054,540.532,535.02,507.52,515.912,481.021,437.057,
59.000000,485.122,497.512,515.592,486.032,478.015,465.967,439.973,
60.000000,472.998,499.056,518.024,476.5,481.988,464,438.04,
61.000000,453.456,469.484,498.944,457.496,461.967,449.532,444,
62.000000,454.043,464.992,489.96,451.502,463.05,452.996,436.018,
63.000000,464.04,445.52,484.96,450.004,452.933,451.02,440.008,
64.000000,459.128,454.993,478.028,455,440.018,428.968,431.985,
65.000000,483.108,461.5,476,452.008,444.99,450.03,438.98,
66.000000,481.121,467.08,483.08,449.977,462.086,451.017,437.957,
67.000000,490.011,491.008,500.12,439.984,452.896,461.1,451.008,
68.000000,504.1,488.888,525.91,451.536,483.009,497.12,469.022,
69.000000,543.248,545.548,550,456.008,484.935,501.164,478.072,
70.000000,500.948,553.088,631.066,460.48,497.004,511.896,476.99,
71.000000,509.252,585.672,623.024,480.436,481.125,514.12,484.992,
72.000000,506.887,581.928,579.9,481.064,505.881,481.992,489.016,
73.000000,488.101,574.476,589.962,486.1,505.1,479.002,468.928,
74.000000,481.065,547.064,556.772,489.029,465.048,456.019,460.035,
75.000000,480.088,509.06,507.122,473.06,482.498,470.02,444.032,
76.000000,453.06,497.02,511.047,474.973,457.022,439.046,445.518,
77.000000,444.084,472.032,488.93,461.97,456.983,451,437.508,
78.000000,451,468.955,497.914,440.008,462.976,439.989,432.482,
79.000000,440.961,456.501,484.008,454.928,453,441.928,428.02,
80.000000,450.017,440.062,478.018,454.98,446.007,442.944,433.007,
81.000000,457.013,433.5,473.05,443.596,423.484,436.97,423.963,
82.000000,469.006,430.986,481.94,431.5,424.983,433.988,432.025,
83.000000,480.503,442.01,465.056,448.976,438.008,438.018,424.961,
84.000000,495.538,459.992,500.1,449.98,444.016,445.04,430.032,
85.000000,490.066,466.552,508.084,440.496,431.04,452.04,424.029,
86.000000,531.148,488,540.07,440.98,435.056,455.928,429.008,
87.000000,542.52,492.02,539.2,441.024,460.066,453.872,439.032,
88.000000,503.552,498.62,540.158,450.552,456.992,472.824,452.969,
89.000000,520.132,501.096,522.015,457.448,469.52,474.96,469.44,
90.000000,502.019,520.008,523.116,483.032,488.063,462.124,462.956,
91.000000,481.003,507.518,518.938,476.936,486.007,449.956,459.548,
92.000000,479.46,522.374,487.822,494.892,479.52,458.948,463.036,
93.000000,465.514,476.528,487.006,479.644,459.995,440.07,450.6,
