Frame number,1000000000,1000000001,1000000002,
0.000000,1006.56,769.41,614.641,
1.000000,1134.43,831.408,685.8,
2.000000,1360.07,1074.24,763.286,
3.000000,1739.67,1755.52,1058.21,
4.000000,2629.44,2223.42,1378.7,
5.000000,1926.27,1971.3,1358.67,
6.000000,1818.04,1784.39,1150.19,
7.000000,1887.23,1515.92,925.841,
8.000000,1196.2,1326.53,732.832,
9.000000,1093.65,1062.11,646.756,
10.000000,1197.65,1037.72,611.897,
11.000000,995.11,930.038,565.83,
12.000000,875.085,844.4,550.1,
13.000000,654.446,705.052,523.682,
14.000000,793.812,663.11,567.216,
15.000000,652.988,603.903,541.24,
16.000000,726.237,642.504,532.77,
17.000000,656.087,581.881,525.017,
18.000000,709.144,637.87,587,
19.000000,822.61,688.985,595.953,
20.000000,1018.54,828.51,673.937,
21.000000,1094.05,989.352,823.51,
22.000000,1263.96,1122.49,846.112,
23.000000,1339.2,1202.26,917.046,
24.000000,1324.26,1172.22,925.375,
25.000000,1222.7,1228.85,825.723,
26.000000,1066.94,1082.71,776,
27.000000,955.912,969.55,697.42,
28.000000,882.196,779.598,573.035,
29.000000,801.14,728.125,551.144,
30.000000,764.466,684.913,547.036,
31.000000,686.972,666.833,510.42,
32.000000,675.981,651.218,516.988,
33.000000,658.216,657.885,537.227,
34.000000,632.524,644.18,527.934,
35.000000,609.103,608.024,524.823,
36.000000,654.066,643.344,560.085,
37.000000,732.375,706.21,613.032,
38.000000,846.475,817.313,615.69,
39.000000,932.675,928.785,702.768,
40.000000,1076.55,942.203,795.288,
41.000000,1105.72,1057.82,852.744,
42.000000,1046.23,1119.93,803.584,
43.000000,959.344,1022.44,825.8,
44.000000,922.028,949.136,756.88,
45.000000,776.431,796.484,694.7,
46.000000,754.875,709.768,626.44,
47.000000,675.008,652.033,600.04,
48.000000,605.96,623.508,540.14,
49.000000,621.07,599.048,534.104,
50.000000,603.956,580.114,528.95,
51.000000,597.024,620.936,510.024,
52.000000,583.22,587.96,502.915,
53.000000,620.172,623.952,516.1,
54.000000,682.89,634.948,530.992,
55.000000,707.102,685.14,572.04,
56.000000,765.996,709.126,626.982,
57.000000,887.422,819.765,650.84,
58.000000,945.76,884.858,722.93,
59.000000,953.53,936.437,711.764,
60.000000,949.25,913.4,728.301,
61.000000,867.508,789.896,700.88,
62.000000,787.943,758.506,689.026,
63.000000,762.75,749.928,669.98,
64.000000,676.78,647.992,625.056,
65.000000,640.153,649.88,603.252,
66.000000,615.772,604.88,566.056,
67.000000,593.048,557.889,544.895,
68.000000,594.901,567.032,530.952,
69.000000,568.176,554.976,510.025,
70.000000,577.917,530.032,534.099,
71.000000,590.04,556.95,546.068,
72.000000,602.072,572.424,553.936,
73.000000,698.162,568.14,543.12,
74.000000,743.857,632.54,567.86,
75.000000,808.907,655.73,623.972,
76.000000,817.389,680.109,637.03,
77.000000,838.705,726.456,641.825,
78.000000,854.719,733.14,620.27,
79.000000,816.203,725.992,644.85,
80.000000,715.794,711.24,627.93,
81.000000,688.002,666.65,648.892,
82.000000,664.187,629.395,605.25,
83.000000,634.068,613.093,575.568,
84.000000,595.931,590.589,563.13,
85.000000,571.988,573.358,548.59,
86.000000,557.051,566.024,536.052,
87.000000,531.04,541.524,521.95,
88.000000,593.932,546.46,548.472,
89.000000,615.01,525.524,552.464,
90.000000,641.994,555.176,554.64,
91.000000,665,547.026,566.512,
92.000000,720.972,556.512,605.34,
93.000000,760.804,546.1,595.354,
94.000000,777.045,672.328,606.304,
95.000000,711.063,671.91,632.66,
