Frame number,1000000000,1000000001,1000000002,
0.000000,8835.03,1598.82,4958.78,
1.000000,6066.01,1627.81,2378.86,
2.000000,4264.92,1636.53,1670.56,
3.000000,3548.11,2175.3,1801.63,
4.000000,3561.05,3437.56,2233.92,
5.000000,4038.5,4304.79,2606.09,
6.000000,4145.15,4586.21,2873.96,
7.000000,3935.48,5314.59,2827.16,
8.000000,3652.25,4979.51,2648.78,
9.000000,3529,4603.69,2352.92,
10.000000,3709.99,3853.14,2126.07,
11.000000,3236,3477.63,1938.93,
12.000000,3187.47,2906.16,1755.92,
13.000000,3063.36,2939.5,1624.01,
14.000000,2619.61,2648.9,1548.86,
15.000000,2406.28,2429.76,1432.26,
16.000000,2202.85,2162.44,1284.5,
17.000000,2027.62,2099.29,1187.01,
18.000000,2179.62,2143.03,1190.06,
19.000000,2148.99,3086.01,1298.04,
20.000000,2546.9,3288.65,1496.97,
21.000000,2774.38,3942.26,1788.05,
22.000000,3217.35,4170.54,1990.75,
23.000000,3358.21,3986.97,2105.73,
24.000000,2997.38,3824.07,2133.92,
25.000000,2815.18,3365.31,2052.9,
26.000000,2546.38,2962.57,1957.87,
27.000000,2357.71,2586.98,1814.06,
28.000000,2392.05,2382.22,1701.98,
29.000000,2281.55,2189.15,1604.94,
30.000000,2185.8,1990.54,1519.04,
31.000000,2151.8,1663.91,1401.47,
32.000000,2013.48,1546.79,1333.07,
33.000000,1921.78,1467.77,1181.94,
34.000000,1880.7,1598.9,1169.72,
35.000000,1894.1,1792.38,1131.5,
36.000000,2044.99,2091.96,1130.05,
37.000000,2321.86,2440.93,1209.48,
38.000000,2463.94,2815.22,1370.25,
39.000000,2519.44,2984.35,1434.6,
40.000000,2504.09,3075.22,1587.42,
41.000000,2538.7,2921.44,1642.1,
42.000000,2530.3,2686.22,1650.23,
43.000000,2309.13,2510.26,1617,
44.000000,2136,2237.74,1595.14,
45.000000,2297.22,1992.3,1552,
46.000000,2154.74,1827.92,1519.58,
47.000000,2192.29,1810.44,1481.56,
48.000000,2012.53,1479.98,1372.85,
49.000000,2010.74,1390.76,1305.99,
50.000000,1885.71,1341,1265.09,
51.000000,1698.92,1268.98,1195.51,
52.000000,1661.35,1274.91,1170.06,
53.000000,1707.74,1539.11,1122.07,
54.000000,1719.31,1788.16,1130.57,
55.000000,1770.57,1969,1168.96,
56.000000,1942.06,2212.93,1282.04,
57.000000,2017.61,2371.32,1362.96,
58.000000,2140.42,2394.16,1422,
59.000000,1938.68,2316.85,1451,
60.000000,1792.82,2185.56,1482.83,
61.000000,1940,2044.01,1436.94,
62.000000,1886.82,1855.45,1408.02,
63.000000,1808.91,1655.53,1404.14,
64.000000,1788.38,1491.07,1328.97,
65.000000,1776.9,1438.58,1289.01,
66.000000,1712.09,1259.94,1214.14,
67.000000,1668.32,1229.12,1137.91,
68.000000,1692.5,1219.43,1104.08,
69.000000,1707.84,1275.5,1067.56,
70.000000,1620.3,1379.96,1010.94,
71.000000,1646.13,1561.64,1095,
72.000000,1611.63,1680.62,1075.16,
73.000000,1595.02,1828.96,1119.05,
74.000000,1737.97,1918.74,1220.08,
75.000000,1796.5,1871.8,1268.29,
76.000000,1814.21,1840.32,1277.13,
77.000000,1762.62,1745.16,1253.92,
78.000000,1774.9,1631.82,1264.98,
79.000000,1728.41,1522.08,1252.9,
80.000000,1762.5,1372.99,1152.93,
81.000000,1720,1273.15,1139.93,
82.000000,1655.44,1242.89,1094.06,
83.000000,1590.43,1085.98,1061.09,
84.000000,1573.25,1038.4,1059.49,
85.000000,1564.98,1050.69,1020.07,
86.000000,1550.2,1090.94,954.96,
87.000000,1551.75,1120.99,924.008,
88.000000,1462.17,1260.22,968.448,
89.000000,1590.73,1508.04,990.028,
90.000000,1579.03,1611.49,993.98,
91.000000,1534.88,1693.19,1083.97,
92.000000,1566.79,1612.26,1139.96,
93.000000,1605.02,1569.4,1145.01,
94.000000,1592.52,1454,1161.06,
95.000000,1606.2,1412.97,1139,
96.000000,1605.44,1307.8,1101.99,
