
Intensity Median
 ==================== 
Time [s],1000000000,1000000001,1000000002,1000000003,1000000004,1000000005,1000000006,
0.000000,1077.9,1847.75,4272.95,3135.73,3686.36,2793.67,2009.7,
1.000000,633.7,1531.42,2283.75,1275.96,2127.14,2090.58,1222.92,
2.000000,725.559,937.925,1398,1202.26,1783.49,1816.5,1078.88,
3.000000,1432.53,1452.33,1430.19,1625,2142.76,2511.78,1434.06,
4.000000,1814.05,2982.8,1687.51,2175.68,3524,6847.58,2541.44,
5.000000,1569.78,2389.41,2464.16,3050.47,3221.17,3152.58,3098.49,
6.000000,1351.88,2739.02,1690.73,1767.38,3171.82,4179.3,2877.01,
7.000000,1895.33,2383.66,1878.6,1964,3840.98,4007,2942.01,
8.000000,2108.82,1941.5,1319.86,2062.89,3014.73,4611.23,3105.96,
9.000000,1984.74,2148.48,1148.76,2269.54,3016.42,3638.32,3378.76,
10.000000,2018.66,2604.76,1324.73,2462.88,3054.77,3999.62,3671.33,
11.000000,2262.83,2438.43,1415.44,1908.55,3068.63,3678.17,3707.1,
12.000000,1996.74,2257.5,1515.4,1806.82,2204.72,3099.92,3748.68,
13.000000,1769.51,1765.38,1343.12,1313.36,1952.49,2844.26,3311.59,
14.000000,1368.91,1320.66,1219.58,1266.23,1802.92,1958.98,2675.62,
15.000000,1217.27,966.147,1043.81,1126.71,1433,1923.44,2143.56,
16.000000,1071.19,820.672,867.632,883.116,1240.71,1548.31,1640.6,
17.000000,970.82,717.165,744.36,807.734,1022.23,1415.33,1247.78,
18.000000,870.078,727.855,700.364,721.955,928.935,1282.97,1107.8,
19.000000,781.998,622.992,684.904,674.93,757.128,1272.48,1027.79,
20.000000,804.34,627.288,629.93,660.662,816.232,1348.72,993.36,
21.000000,914.548,642.008,730.896,693.868,804.028,1485.17,1129.12,
22.000000,953.366,717.304,855.082,822.625,1030.66,1708.34,1444.95,
23.000000,1055.34,864.895,1037.7,1130.41,973.54,2358.79,1896.98,
24.000000,1063.61,1261.86,1075.16,1222.98,1136.28,3101.98,2484.86,
25.000000,1255.79,1422.33,1265.03,1473.49,1275.65,2678,2318.72,
26.000000,1326,1585.03,1353.68,1507.23,1397.81,3070.63,2687.95,
27.000000,1250.46,1323.24,1272.97,1546.25,1553.33,3664.76,2799.35,
28.000000,1417.98,1297.08,1345.72,1587.44,1579.57,4277.55,2444.95,
29.000000,1260.24,1232.12,1315.06,1582.59,1505.97,4248.27,2338.93,
30.000000,1239.51,1275.64,1178.25,1508.58,1360.83,3229.74,1700.59,
31.000000,1140.33,1178.92,1111.38,1434.2,1175.14,2167.27,1560.7,
32.000000,1056.59,1141.95,1212.13,1143.38,1129.28,1979.02,1426.64,
33.000000,890.6,980.559,1108.64,1094.33,924.939,1632.66,1089.12,
34.000000,822.396,946.557,992.96,971.52,836.393,1589.79,962.39,
35.000000,732.112,838.386,824.72,851.482,690.335,1486.43,807.119,
36.000000,689.801,787.159,855.59,754.103,672.483,1363.23,818.249,
37.000000,666.115,677.734,768.34,670.63,646.235,1281.16,780.639,
38.000000,678.128,676.213,773.435,689.922,720.045,1202.74,757.7,
39.000000,678.272,722.25,884.105,760.364,729.112,1234.7,850.283,
40.000000,718.291,805.713,1047.01,912.007,778.92,1253.12,949.141,
41.000000,848.175,893.138,1192.38,1036.17,912.342,1470.12,981.859,
42.000000,887.034,902.93,1286.55,1176.24,1011.24,2104.87,1220.05,
43.000000,952.445,899.42,1364.66,1355.94,1040.83,2495.56,1282.96,
44.000000,997.478,1115.82,1498.07,1405.38,1236.44,2910.75,1446.73,
45.000000,958.675,1014.31,1543.13,1355.2,1079.96,3000.32,1456.99,
46.000000,945.15,1059.4,1537.29,1349.17,1072.77,2397.17,1369.17,
47.000000,859.532,1017.5,1242.31,1265.74,1064.57,2131.07,1418.3,
48.000000,878.928,931.196,1065.96,1206.03,1032.98,2015.16,1287.43,
49.000000,768.65,884.88,1099.14,1171.18,1089.15,1811.46,1173.74,
50.000000,729.993,832.353,959.332,996.316,954.653,1425.28,1055.35,
51.000000,674.376,806.669,889.565,950.771,830.593,1157.77,924.016,
52.000000,634.132,736.182,788.11,821.818,810.625,1080.8,817.15,
53.000000,622.514,672.245,736.307,739.609,712.235,994.98,718.252,
54.000000,600.892,649.766,688.86,751.207,679.031,972.666,769.944,
55.000000,580.484,655.297,717,724.14,634.822,887.979,742.6,
56.000000,606.2,645.041,700.74,750.109,677.145,876.65,764.9,
57.000000,651.512,661.225,747.496,756.968,717.739,856.383,822.22,
58.000000,650.24,652.305,831.83,802.126,684.232,912.052,853.136,
59.000000,673.962,705.813,913.064,818.01,740.559,1035.55,976.268,
60.000000,705.572,728.994,872.397,843.515,762.228,1105.48,1084.56,
61.000000,760.234,722.55,951.022,843.288,832.654,1219.48,1079.98,
62.000000,717.6,736.72,952.616,886.006,783.7,1137.35,1067.9,
63.000000,758.308,759.615,890.863,822.57,816.184,1076.56,1065.58,
64.000000,737.075,709.133,911.62,787.514,766.758,1027.25,1088.86,
65.000000,746.359,759.504,795.17,862.995,804.666,1104.66,1085.72,
66.000000,722.597,712.016,799.92,932.004,837.508,1091.87,933.78,
67.000000,635.16,794.11,747.043,830.816,783.67,1024.79,846.12,
68.000000,590.125,744.303,680.235,781.614,726.131,945.642,830.491,
69.000000,564.818,686.812,621.208,685.738,711.418,982.542,611.236,
70.000000,582.075,659.668,605.222,680.841,654.152,872.943,645.186,
71.000000,555.008,652.014,576.99,640.248,652.745,836.688,590.192,
72.000000,552.08,651.755,553.017,633.086,598.798,859.401,629.896,
73.000000,542.938,642.193,520.024,631.25,630.96,689.82,620.96,
74.000000,517.943,690.434,533.35,649.544,618.992,692.925,675.714,
75.000000,600.136,669.356,524.115,662.44,671.154,683.781,689.632,
76.000000,618.95,704.458,535.326,705.919,736.737,682.428,681.69,
77.000000,606.85,746.913,602.662,733.752,757.764,719.034,761.074,
78.000000,605.159,725.468,536.553,744.048,780.408,701.724,728.442,
79.000000,614.731,746.056,550.448,690.044,825.792,693.138,761.911,
80.000000,606.915,721.216,565.112,680.864,773.86,689.026,768.752,
81.000000,626.132,682.938,569.07,748.642,752.861,889.36,730,
82.000000,602.768,718.028,548.602,776.809,795.808,873.033,729.27,
83.000000,585.88,677.948,556.993,755.034,759.29,814.22,732.026,
84.000000,565.848,695.338,590.088,778.228,752.392,874.542,668.868,
85.000000,575.735,649.578,572.076,706.287,686.042,960.1,608.26,
86.000000,528.09,631.526,556.982,693.296,621.708,926.54,585.396,
87.000000,529.996,598.373,539.074,663.345,628.858,838.05,574.089,
88.000000,522.048,605.935,523.837,639.08,612.134,748.198,552.452,
89.000000,501.932,576.544,568.903,641.52,655.8,726.215,570.864,
90.000000,539.424,606.308,544.024,630.088,629.252,738.68,564.896,
91.000000,537.446,574.575,545.83,663.096,657.802,695.355,584.05,
92.000000,501.968,549.915,550.43,653.146,650.326,746.724,614.456,
93.000000,524.05,549.988,549.52,636.954,678.072,806.188,612.44,
94.000000,501,548.715,561.592,680.554,694.023,820.727,635.432,
95.000000,510.088,548.2,556.552,649.768,677.296,806.292,629.029,
