Frame number,1000000000,1000000001,1000000002,1000000003,1000000004,1000000005,1000000006,1000000007,
0.000000,1628.18,1562.02,1380.96,1967.24,1476.58,1909.05,2739.72,1510.29,
1.000000,1360.1,1343.08,1097.2,1340.02,1325.06,1556.76,2162.22,1226.52,
2.000000,1465.6,1363.35,1293.53,1866,1460.41,1803.38,2331.91,1323.22,
3.000000,1745.61,1800.82,1555.81,2139.57,1668.47,1839.65,2686.71,1589,
4.000000,1867.67,2106.6,1984.68,2573.53,2078.2,2082,2718.25,1841.53,
5.000000,2010.36,2252.47,2224.45,2872.92,2249.66,2153.56,2878.17,2039.45,
6.000000,2105.38,2364.63,2360.07,2933.33,2160.61,2101.92,2698.91,2288.23,
7.000000,2107.26,2174.09,2292.79,2537.38,2009.87,2060.65,2601.49,2185.45,
8.000000,2341.24,2032.2,1873.77,2314.34,1920.26,1898.1,2294.7,1942.91,
9.000000,2322.96,1939.78,1669.42,2010.84,1742.85,1761.7,2050.77,1842,
10.000000,2126.73,1803.78,1499.45,1928.98,1545.73,1576,1932.85,1780.26,
11.000000,1956.33,1555.02,1409.47,1787.32,1402.06,1471.94,1780.84,1687.15,
12.000000,1824.3,1497.14,1262.2,1517.03,1303.17,1385.91,1619.2,1610.09,
13.000000,1662.14,1376.2,1215.43,1517,1191.08,1351.77,1829.11,1563.22,
14.000000,1526.16,1303.91,1128.55,1389.24,1141.97,1238.99,1775.78,1533.99,
15.000000,1436.75,1215.94,1020.89,1337.18,1107.98,1190.88,1642.65,1459.89,
16.000000,1320.23,1207.08,1034.87,1249.14,1015.19,1157.18,1581.05,1412,
17.000000,1228.84,1144.01,915.94,1190.09,958.938,1073.12,1439.45,1327.5,
18.000000,1197.04,1063.54,863.42,1063.12,975.472,1017.96,1345.3,1329.08,
19.000000,1091.62,1010.9,873.45,1021.11,873.49,1098.14,1230.35,1248.49,
20.000000,1053.51,1015,861.924,965.197,872.512,1133.24,1302.06,1262.93,
21.000000,1105.5,1072.1,909.14,1086.83,899.02,1241.9,1366.29,1332.79,
22.000000,1267.35,1151.2,1021.06,1191.22,1039.92,1352.13,1479.14,1421.08,
23.000000,1571.83,1246.97,1159.5,1310.83,1162.06,1408.97,1531.73,1501.01,
24.000000,1550.82,1308,1310.34,1355.17,1245.91,1489.13,1675.08,1686.85,
25.000000,1658.21,1389.88,1245.29,1298.9,1259.97,1553.74,1644.24,1770.21,
26.000000,1639.21,1377.11,1285.82,1297.24,1252.01,1530.22,1665.75,1714,
27.000000,1567.18,1308.02,1286.17,1197.28,1209.1,1370.72,1593.28,1736.82,
28.000000,1540.94,1308.06,1141,1212.99,1149.12,1354.98,1603.81,1731.28,
29.000000,1428.72,1241.16,1110.92,1171.72,1095.59,1291.85,1524,1621.61,
30.000000,1430,1202.91,1064.93,1082.83,1088.47,1389.1,1545.58,1598.87,
31.000000,1350.14,1130.1,986.092,1044.74,1014.17,1194.1,1480.8,1597.8,
32.000000,1272.82,1111.11,920.96,1104.34,1034.91,1147.85,1506.44,1470.94,
33.000000,1238.96,1041.99,914.92,985.032,961,1139.04,1386.63,1472.97,
34.000000,1124.21,1046.09,856.146,994.1,959.52,1151.93,1324.94,1357.34,
35.000000,1136.99,934.87,817.06,903.056,887.104,1089.55,1362.87,1341.84,
36.000000,1064.97,946.002,770.928,901.968,896.985,1059.56,1223,1322.13,
37.000000,986.16,909.584,784.024,856.052,846,1079.55,1122.06,1246.23,
38.000000,945.076,891.52,763.098,853.907,819.534,1014.01,1106.92,1214.37,
39.000000,837.115,880.472,749.92,852.034,795.008,1086.58,1057.05,1170.1,
40.000000,848.107,872.469,740.022,780.081,814.912,1050.6,1078.26,1166.48,
41.000000,900.17,933.016,776.968,843.848,854.906,1040.1,1163.17,1172.95,
42.000000,1070.97,972,832.984,871.92,893.974,1113.79,1202.32,1130.82,
43.000000,1303.23,1057.04,883.54,930.848,968.546,1134.05,1318.12,1164.24,
44.000000,1282.78,1107.11,966.907,1035.1,1058.45,1157.96,1419.04,1278.69,
45.000000,1378.9,1150.1,980.596,1058.25,1070.9,1217.88,1461.88,1299.22,
46.000000,1343.85,1156.85,955.916,1027,1063.96,1175.98,1444,1432,
47.000000,1274.93,1094.1,948.924,1026.1,1020.75,1174.98,1374,1397.21,
48.000000,1268.08,1096.02,912.082,1017.18,1004.88,1127.06,1329.06,1327.83,
49.000000,1206.77,1065.5,877.928,1002.3,989.056,1143.84,1378.14,1280,
50.000000,1137,997,865.877,994,945.052,1121,1265.05,1249.13,
51.000000,1099,968.002,843.02,944.636,882.984,1069.88,1283.24,1161.86,
52.000000,1075.86,920.036,809.972,903.036,859.488,1012.25,1268.92,1136.06,
53.000000,1013.89,891.52,774.534,900.918,841.544,1055.98,1218.18,1125.66,
54.000000,954.902,875.164,733.06,868.48,805.992,1023.95,1164.11,1042.96,
55.000000,909.112,851.888,723.016,845.925,799.912,976.086,1131.7,1080.92,
56.000000,924,858.464,735.072,858,763.96,874.968,1148.56,1032.81,
57.000000,886.98,821.032,740.04,815.132,738,916.03,1156.01,982.54,
58.000000,857.064,794.02,723.056,805.116,730.04,914.094,1183.86,1015.1,
59.000000,854.928,796.014,709.964,793.874,721.924,860.932,1209.31,960.87,
60.000000,844.915,804.464,717.938,787.975,745.04,884.02,1190.18,965.092,
61.000000,873.963,851.12,742.472,811.948,744.095,860.608,1274.97,964.988,
62.000000,964.916,885.02,756.53,811,771.982,890.008,1321.14,982.928,
63.000000,1031.46,932.95,763.04,859.06,794.004,890.008,1372.93,1058.8,
64.000000,1153.99,930.984,869.052,917,813.96,955.95,1401.77,1076.11,
65.000000,1167,987.056,896.418,970.08,853.94,1036.46,1424.21,1166.08,
66.000000,1160,954.026,899.954,1007.98,889.976,1047.12,1389.02,1195.32,
67.000000,945.47,962.101,903.556,995.16,869.108,1023.02,1390.14,1199.05,
68.000000,1158.08,909.98,841.94,1014,867.054,1051.87,1295.23,1233.22,
69.000000,1082.79,880.85,813.044,948.06,845.43,1033.98,1114.9,1123.73,
70.000000,975.168,866,737.512,924.972,798.559,988.08,1146.13,1162.01,
71.000000,940.108,830.106,780.046,893.912,805.561,959.104,1028.11,1134.87,
72.000000,884.116,795.914,761.877,837.1,775.92,890.072,1019.93,1025.13,
73.000000,856,794,732.004,811.092,748.53,860.224,992.484,945.1,
74.000000,823.026,749.008,709.5,788.021,719.061,852.6,977.924,961.204,
75.000000,796.06,768.976,705.85,763.2,713.118,838.925,925.063,910.114,
76.000000,789.226,717.05,654.808,758.95,713.504,818.997,960.956,903.28,
77.000000,748.979,727.032,639.44,717.888,690.524,800.904,1019.06,922.1,
78.000000,757.072,727.956,675.968,735.24,687.023,815.804,985.994,872.16,
79.000000,737.926,719.996,709.962,725.103,686.032,767.952,1026.04,842.072,
80.000000,753.854,755.2,700.004,702.974,704.08,797.832,1075.88,817.024,
81.000000,760.928,746.992,682.06,732.049,717.07,816.04,1178.7,870.953,
82.000000,825.06,808.067,762.836,732.985,718.024,850,1322.33,869.12,
83.000000,932.97,880.984,773.06,788,710,870.893,1425.07,906.88,
84.000000,960.825,918.534,787.916,812.04,752.992,907.062,1388.88,904.956,
85.000000,1050.83,947.048,808.03,890.06,780.496,965.088,1376.89,931.02,
86.000000,1088.23,922.54,829.048,972.16,771.08,1003.92,1287.9,1007.13,
87.000000,1145.21,884,778.688,973.184,761.004,1060.92,1298.83,1095.75,
88.000000,1080.14,882.944,824.98,938.972,755.08,1020.99,1127.08,1100.82,
89.000000,1037.94,831.992,819.42,956.1,775.008,1014.94,1053.83,1144.33,
90.000000,994.136,796.008,837.042,913.924,742.056,1017.13,1080.9,1138.01,
91.000000,953.27,783.96,783.524,896.864,713.928,911.892,978.095,1113.12,
92.000000,898.131,753.904,752.48,898.1,714.93,939.878,900.049,1018.26,
93.000000,874.872,727.104,770.098,891.056,671.032,826.824,876.898,968.941,
94.000000,807.166,677.95,704.924,813.856,688.088,763.02,838.096,987.04,
95.000000,788.9,660.036,679.02,766.504,651.988,713.92,784.934,928.87,
