Time [ms],1000000000,1000000001,1000000002,1000000003,
0,1578.99,1583.73,1718.64,1693.7,
1000000000,1223.64,1397,1378.32,1222.94,
2000000000,1208.93,1340.08,1568.35,1481.4,
3000000000,1653.69,1791,1794.74,1740.49,
4000000000,2098.6,2638.15,2293.02,2047.43,
5000000000,2737.11,3980.78,3183,2516.36,
6000000000,3465.5,4682.99,4254.16,2874.61,
7000000000,3280.4,4649.12,4823,2928.4,
8000000000,3265.69,4315.58,4413.35,2816.02,
9000000000,2937.39,3397.35,3591.28,2583.25,
10000000000,2236.03,2466,2569.07,2251.61,
11000000000,1807.72,1764.6,1861,1779.52,
12000000000,1450.62,1355.57,1483.29,1456.88,
13000000000,1229.16,1048.25,1174.18,1244.26,
14000000000,1089.5,984.352,1112.99,1026.14,
15000000000,976.955,834.436,913,978.262,
16000000000,818.102,804.468,913.816,827,
17000000000,806.932,761.492,785.975,817.2,
18000000000,739.992,734.04,820,782.905,
19000000000,742.628,691,816.056,774.928,
20000000000,725.906,720.4,801.036,761.962,
21000000000,769.2,776.98,858.976,752.856,
22000000000,835.88,872.008,966.032,895.992,
23000000000,897.42,1060.05,1206.17,1031.92,
24000000000,1174.57,1274.84,1573.33,1336.76,
25000000000,1417.23,1698.11,2285.58,1914.36,
26000000000,1757.7,2090.99,2594.6,2316.16,
27000000000,1852.18,2175.66,2829,2342.76,
28000000000,1679.24,2071.73,2752,2291.09,
29000000000,1593.1,1921.33,2630,2051.34,
30000000000,1453.5,1677.93,2116,1876.67,
31000000000,1253.95,1394,1942,1627.9,
32000000000,1086.11,1115.11,1477.32,1397.86,
33000000000,916.048,987.48,1227,1092.06,
34000000000,852.144,823.04,995.32,969.766,
35000000000,780.119,808.2,885.8,886.108,
36000000000,732.936,774.853,817.008,812.908,
37000000000,713.174,722.46,829.014,767.98,
38000000000,701.979,705.136,823,712.957,
39000000000,713.198,677.991,781.971,682.096,
40000000000,696.526,670.028,751.104,696.15,
41000000000,670.185,703.877,749.923,630.913,
42000000000,660.184,728.007,798,660.842,
43000000000,709.904,830.048,882.74,701.972,
44000000000,791.9,1046.04,1044.18,850.118,
45000000000,910.081,1336.74,1634.04,1015.9,
46000000000,1113.99,1620.05,2142.4,1236.62,
47000000000,1235.12,1733.27,2721.46,1355.55,
48000000000,1160.91,1695.24,2527.62,1491.21,
49000000000,1109.2,1552.65,2248.66,1392.21,
50000000000,1060.92,1544.87,1907.41,1312.26,
51000000000,975.912,1386.99,1660.99,1309.1,
52000000000,859.05,1285.68,1426.53,1224.25,
53000000000,848.99,1151,1257.89,1016.45,
54000000000,832.004,1063.62,1254.32,1013.06,
55000000000,727.12,947.328,1082.85,922.144,
56000000000,719,848.68,1066.28,827.194,
57000000000,670.049,784.12,1012.64,808.131,
58000000000,702.088,718.992,866.92,755.26,
59000000000,635.99,677.176,875.968,670.85,
60000000000,641.6,660,831.148,636.129,
61000000000,638.964,642.966,814.959,634.144,
62000000000,613.561,638.019,773.1,628.073,
63000000000,648.016,674.12,922.36,660.835,
64000000000,638.08,784.852,980,706,
65000000000,701.97,930.004,1058.27,812.108,
66000000000,739.501,1066,1200.79,915.004,
67000000000,814.961,1225.1,1221.95,1042.14,
68000000000,902.026,1355.73,1299.79,1088.16,
69000000000,855.904,1353.91,1411.31,1189.28,
70000000000,854.947,1313.95,1464,1104.23,
71000000000,880.32,1234.5,1402.18,1110.24,
72000000000,809.954,1181.19,1225.22,1001.19,
73000000000,805.118,1089.09,1296,940,
74000000000,799.726,1017,1147.22,861,
75000000000,772.994,980.822,1173.2,867.864,
76000000000,776.204,885.854,1127.35,868,
77000000000,819.201,762.03,1135.98,811.058,
78000000000,749.9,755.848,1097.23,768,
79000000000,674.075,699.816,1116,785.18,
80000000000,712.08,628.08,1012.19,736.112,
81000000000,638.174,617.936,948.04,717.984,
82000000000,663.136,641.02,819.064,664.22,
83000000000,690.036,692.8,835.954,694.102,
84000000000,716.048,712.894,764.479,713.048,
85000000000,779.344,843.198,878.984,716.292,
86000000000,821.09,867.192,920.258,847.83,
87000000000,832.264,942.112,1001.96,950,
88000000000,868.928,1021.79,1067.7,971.938,
89000000000,881,963.168,1086.58,1045.29,
90000000000,808.96,972.93,1224.17,1006.98,
91000000000,822.016,967,1314.07,995.414,
92000000000,795.016,900,1214.8,942.834,
93000000000,708.12,866.144,1252.6,917.006,
94000000000,751.074,897.096,1149.29,797.332,
95000000000,738.105,839.068,1135.22,784.209,
