Frame number,1000000000,
0.000000,442.512,
1.000000,450.488,
2.000000,452.524,
3.000000,458.504,
4.000000,489.004,
5.000000,495.488,
6.000000,497.016,
7.000000,490.512,
8.000000,476.976,
9.000000,477.98,
10.000000,472.47,
11.000000,471.988,
12.000000,463.492,
13.000000,470.99,
14.000000,457.996,
15.000000,456.008,
16.000000,451.485,
17.000000,449.997,
18.000000,446,
19.000000,456.01,
20.000000,450.961,
21.000000,457.055,
22.000000,453.014,
23.000000,475.04,
24.000000,471.008,
25.000000,477.996,
26.000000,473.516,
27.000000,466.02,
28.000000,466.497,
29.000000,458.05,
30.000000,464.976,
31.000000,448.016,
32.000000,446.06,
33.000000,453,
34.000000,447.96,
35.000000,438.975,
36.000000,450.936,
37.000000,446.05,
38.000000,451.98,
39.000000,443.99,
40.000000,456.988,
41.000000,450,
42.000000,459.025,
43.000000,452.977,
44.000000,462.021,
45.000000,456.968,
46.000000,451.009,
47.000000,457.984,
48.000000,463.995,
49.000000,455.02,
50.000000,453.962,
51.000000,453.04,
52.000000,448.03,
53.000000,451.048,
54.000000,446.992,
55.000000,432.01,
56.000000,458.982,
57.000000,445.978,
58.000000,444.017,
59.000000,451.97,
60.000000,456.002,
61.000000,452.04,
62.000000,436.972,
63.000000,445.995,
64.000000,441.012,
65.000000,459.028,
66.000000,453.004,
67.000000,451,
68.000000,441.008,
69.000000,439.512,
70.000000,439.496,
71.000000,435.52,
72.000000,442.504,
73.000000,435.5,
74.000000,452.491,
75.000000,434.492,
76.000000,448.98,
77.000000,439.52,
78.000000,439.986,
79.000000,437,
80.000000,447.492,
81.000000,447.476,
82.000000,443.968,
83.000000,450.01,
84.000000,449.018,
85.000000,452.52,
86.000000,431.99,
87.000000,443.008,
88.000000,442.02,
89.000000,444.996,
90.000000,450.992,
91.000000,431.512,
92.000000,430.992,
93.000000,433.5,
94.000000,436.502,
95.000000,427.024,
