Frame number,1000000000,
0.000000,532.013,
1.000000,462.99,
2.000000,463.016,
3.000000,480.01,
4.000000,499.017,
5.000000,489.96,
6.000000,494.987,
7.000000,475.024,
8.000000,470.98,
9.000000,471.02,
10.000000,463.968,
11.000000,447.021,
12.000000,443.988,
13.000000,441,
14.000000,441.02,
15.000000,443.019,
16.000000,422.023,
17.000000,427.016,
18.000000,436.982,
19.000000,429.054,
20.000000,452.08,
21.000000,460,
22.000000,454.977,
23.000000,452.948,
24.000000,462.02,
25.000000,464.976,
26.000000,445.992,
27.000000,456.016,
28.000000,437.02,
29.000000,427.984,
30.000000,432.028,
31.000000,432.02,
32.000000,428.025,
33.000000,428.024,
34.000000,433.968,
35.000000,432.024,
36.000000,429.016,
37.000000,430.976,
38.000000,438.032,
39.000000,452.017,
40.000000,441.974,
41.000000,444,
42.000000,449.972,
43.000000,440.037,
44.000000,443.035,
45.000000,439.984,
46.000000,443.957,
47.000000,432.019,
48.000000,433.016,
49.000000,428.047,
50.000000,432.96,
51.000000,425,
52.000000,419.98,
53.000000,430.984,
54.000000,433.048,
55.000000,431.044,
56.000000,428.96,
57.000000,436,
58.000000,430.993,
59.000000,432.024,
60.000000,437.05,
61.000000,429,
62.000000,432.98,
63.000000,440.016,
64.000000,442.034,
65.000000,426.035,
66.000000,437.044,
67.000000,428.981,
68.000000,434.04,
69.000000,435.023,
70.000000,433.008,
71.000000,431.976,
72.000000,428.04,
73.000000,431.98,
74.000000,422.032,
75.000000,436.024,
76.000000,431.037,
77.000000,421.998,
78.000000,430.006,
79.000000,420.042,
80.000000,429.022,
81.000000,432.978,
82.000000,426.976,
83.000000,439.988,
84.000000,420.048,
85.000000,432.992,
86.000000,431,
87.000000,433.015,
88.000000,429.012,
89.000000,436.992,
90.000000,428.947,
91.000000,431.985,
92.000000,421.02,
93.000000,425,
94.000000,430.02,
95.000000,426.02,
