Frame number,1000000000,1000000001,1000000002,
0.000000,4679.7,3248.61,6294.21,
1.000000,4916.77,3877.42,8613.19,
2.000000,5216.21,4083.8,8168.61,
3.000000,5769.36,5063.4,8226.72,
4.000000,5933.44,5623.2,8252.23,
5.000000,5238.58,5634.41,7587.34,
6.000000,4254.55,4600.25,5823.63,
7.000000,3202.53,3710.22,5379.12,
8.000000,2392.52,2842.17,3864.66,
9.000000,1820.02,2515.95,3534.54,
10.000000,1490.89,1994,2802.99,
11.000000,1299.2,1673.18,2359.39,
12.000000,1174.08,1445,2023.83,
13.000000,1043.89,1313.06,1628.5,
14.000000,1022.84,1203.02,1466.66,
15.000000,1080.96,1129.15,1278.76,
16.000000,1245.14,1121.98,1236.57,
17.000000,1903.39,1190.01,1364.9,
18.000000,2814.22,1494.12,1772.09,
19.000000,3531.2,1966.92,2607.91,
20.000000,3708.76,2808.01,3639.01,
21.000000,3080.34,3207.21,4033.18,
22.000000,2483.01,3270.61,3675.18,
23.000000,1891.95,2845.99,3097.72,
24.000000,1428.23,2391.86,2575.96,
25.000000,1130.5,2016.23,2052.07,
26.000000,1012.05,1704.8,1749.78,
27.000000,899.12,1455.95,1404.01,
28.000000,853.464,1242.11,1124.99,
29.000000,859.008,1109.17,1018.08,
30.000000,859.448,981.067,879.197,
31.000000,946.94,993.076,862.956,
32.000000,1166.04,997.998,812.976,
33.000000,1688.77,956.588,879.94,
34.000000,2340.78,1054.98,1021.89,
35.000000,2886.34,1195.17,1436.82,
36.000000,2885.83,1527.39,2096.58,
37.000000,2432.02,1881.17,2692.91,
38.000000,2010.1,2460.65,3061.33,
39.000000,1520.52,2661.47,3040.87,
40.000000,1143.86,2399.15,2664.72,
41.000000,960.52,2067.03,2147.27,
42.000000,852.004,1768.17,1704.43,
43.000000,800.024,1555.9,1334.16,
44.000000,754,1318.19,1110.03,
45.000000,736.082,1093.01,949.117,
46.000000,745.526,1046.52,827.062,
47.000000,838.997,903.6,780.008,
48.000000,1195.36,935.92,727.033,
49.000000,1872.36,864.008,755.086,
50.000000,2618.55,868.024,850.904,
51.000000,2918.01,950.01,1076.09,
52.000000,2570.78,1007.95,1511,
53.000000,2035.98,1246.46,2018.81,
54.000000,1600.15,1650.18,2475.96,
55.000000,1278.16,1990.65,2713.41,
56.000000,1042.88,2192.2,2567.69,
57.000000,934.468,2142.96,2285.69,
58.000000,868.064,1953.36,1865.08,
59.000000,871.068,1669.05,1466.11,
60.000000,825.02,1433.78,1181.85,
61.000000,840.004,1220,968.06,
62.000000,902.12,1035.98,846.112,
63.000000,1036.92,939.96,772,
64.000000,1358.11,915.918,742.091,
65.000000,1661.12,915.912,732.015,
66.000000,2002.96,867.024,798.54,
67.000000,2210.82,828.048,963.982,
68.000000,2190.14,894.098,1250.13,
69.000000,1895.6,953.03,1761.94,
70.000000,1504.09,1124.89,2377.29,
71.000000,1253.92,1518.79,2669.93,
72.000000,1045.94,1970.79,2703.6,
73.000000,892.9,2009.19,2382.91,
74.000000,856.84,1953.98,2078.01,
75.000000,816.032,1779.84,1654.36,
76.000000,828.016,1504.13,1328.31,
77.000000,872.012,1323.91,1087.01,
78.000000,937.04,1156,933.882,
79.000000,1250.59,1022.94,820.382,
80.000000,1666,975.855,759.125,
81.000000,2034.07,935.04,766,
82.000000,2359.19,897.02,792.984,
83.000000,2267.91,876.5,962.984,
84.000000,2101.79,898.426,1159.03,
85.000000,1570.85,931.536,1752.87,
86.000000,1278.47,953.938,2280.75,
87.000000,1044.06,1140.53,2875.66,
88.000000,897.48,1389.95,3222.74,
89.000000,792.96,1712.29,2900.52,
90.000000,773.968,1870.51,2368.03,
91.000000,746.965,1814.57,2018.02,
92.000000,779.52,1700.48,1686.34,
93.000000,839.94,1541.78,1420.23,
94.000000,1078.03,1423.22,1168.2,
