Frame number,1000000000,
0.000000,472.016,
1.000000,461.004,
2.000000,439.996,
3.000000,441.995,
4.000000,446.004,
5.000000,455.008,
6.000000,456.998,
7.000000,462.006,
8.000000,460.999,
9.000000,456.992,
10.000000,441,
11.000000,443,
12.000000,440.996,
13.000000,432.998,
14.000000,434.018,
15.000000,433.985,
16.000000,431.001,
17.000000,433.008,
18.000000,426,
19.000000,435,
20.000000,434.992,
21.000000,440.997,
22.000000,440.994,
23.000000,445.012,
24.000000,447,
25.000000,446.005,
26.000000,449,
27.000000,441.006,
28.000000,447.005,
29.000000,438.004,
30.000000,433.006,
31.000000,434.991,
32.000000,428,
33.000000,435.008,
34.000000,431.996,
35.000000,428.996,
36.000000,437.008,
37.000000,424.99,
38.000000,434,
39.000000,437.996,
40.000000,428.996,
41.000000,442.003,
42.000000,448.984,
43.000000,440.026,
44.000000,434.004,
45.000000,438,
46.000000,439,
47.000000,429.005,
48.000000,432,
49.000000,430.994,
50.000000,433,
51.000000,430.005,
52.000000,428.01,
53.000000,434.993,
54.000000,429.996,
55.000000,425.006,
56.000000,436,
57.000000,429.002,
58.000000,430.99,
59.000000,430.012,
60.000000,430.003,
61.000000,439.016,
62.000000,441,
63.000000,437.01,
64.000000,432,
65.000000,432.01,
66.000000,431.997,
67.000000,435.002,
68.000000,434.999,
69.000000,433.004,
70.000000,427.005,
71.000000,425,
72.000000,426.994,
73.000000,427.001,
74.000000,428.995,
75.000000,429.005,
76.000000,428.009,
77.000000,429.99,
78.000000,431.007,
79.000000,430.01,
80.000000,429.996,
81.000000,428.992,
82.000000,423.995,
83.000000,429.992,
84.000000,428.989,
85.000000,427.003,
86.000000,425.99,
87.000000,431.008,
88.000000,422.992,
89.000000,429,
90.000000,433.01,
91.000000,423.998,
92.000000,422.995,
93.000000,429.008,
94.000000,429.998,
95.000000,426.996,
96.000000,422.004,
