Time [ms],1000000000,1000000001,1000000002,1000000003,
0,856.964,819.672,1110.58,763.036,
1000000000,1738.52,1386.98,1791.65,1347.46,
2000000000,2621.05,2285.3,2550.06,1821.53,
3000000000,3843.52,3368.26,2963.07,2742.34,
4000000000,5057,4834.8,3858.72,3215.08,
5000000000,4667.25,4788.67,4034.62,3094.04,
6000000000,4326.07,4458.23,4028.92,3126.2,
7000000000,3676.19,3863.56,3620.52,2992.13,
8000000000,3537,3568.97,3465.09,2690.59,
9000000000,3114.09,3209.28,3098.6,2594.95,
10000000000,2819.2,2890.5,2664.18,2234.87,
11000000000,2498.44,2815.56,2479.44,2086.57,
12000000000,2300.59,2499.55,2057.7,1908.35,
13000000000,2138.16,2323.1,1893.26,1807.14,
14000000000,1914.04,2177.91,1786.76,1660,
15000000000,1733.89,1952.88,1737.39,1567.9,
16000000000,1657.03,1823.18,1647.48,1473.32,
17000000000,1815.9,1840.64,1799.17,1548.77,
18000000000,2079.82,2029.92,1876.5,1780.41,
19000000000,2461.02,2348.36,2117.45,2168.38,
20000000000,2492.87,2340.06,2182.67,2157.43,
21000000000,2503.66,2282.09,2107.08,2075.1,
22000000000,2425.39,2227.87,2213.73,2095.5,
23000000000,2410.53,2298.88,2254.4,2098.49,
24000000000,2216.48,2127.96,2182.99,1880.87,
25000000000,2055.79,1987.05,2069.55,1752.88,
26000000000,1804,1820.98,1691.28,1556.45,
27000000000,1713.6,1749.6,1653.23,1489.3,
28000000000,1644.85,1499.12,1558.97,1390.98,
29000000000,1489.92,1383.32,1380.44,1286.49,
30000000000,1348.1,1370.11,1299.19,1225.13,
31000000000,1308.18,1354.46,1230,1180.88,
32000000000,1383.47,1316.9,1171.14,1200.97,
33000000000,1537.96,1392.85,1199.87,1319.88,
34000000000,1668.55,1521.98,1326.86,1345.05,
35000000000,1632.09,1567.02,1415.56,1405.01,
36000000000,1597.97,1571.12,1442.95,1363.05,
37000000000,1555.9,1495.94,1447.56,1366.45,
38000000000,1605.22,1517.41,1413.83,1339.06,
39000000000,1551.01,1468.47,1411.83,1324.08,
40000000000,1446.95,1421.97,1314.82,1174.54,
41000000000,1346.78,1334.43,1272.04,1152.22,
42000000000,1282.03,1285.61,1185.53,1073.9,
43000000000,1219.96,1230.44,1096.94,1013.94,
44000000000,1166.1,1153.52,1039.17,964.956,
45000000000,1093.13,1116.55,974.14,942.94,
46000000000,1121.18,1100.01,923.951,904.904,
47000000000,1126.98,1126.07,911.035,922.08,
48000000000,1246.16,1197.05,931.76,1014.1,
49000000000,1336.59,1336.8,1029.5,1073.89,
50000000000,1283.62,1364.6,1076.29,1010.9,
51000000000,1394.03,1291.18,1079.08,1041.81,
52000000000,1282.86,1295.54,1104.62,1080.01,
53000000000,1300.1,1248.1,1064.9,1022.42,
54000000000,1269.1,1240.53,1025,1031.91,
55000000000,1156.96,1202.17,1033.48,1002.02,
56000000000,1151.99,1150.96,977.984,957,
57000000000,1102.22,1053.57,961.344,949.064,
58000000000,1097.03,1019.02,920.532,890.172,
59000000000,962.976,1026.1,909.149,872.04,
60000000000,933.384,1014.12,887.052,827.992,
61000000000,899.934,989.968,821.086,793.08,
62000000000,939.22,989.884,786.48,822.88,
63000000000,1012,1038.46,793.056,865.948,
64000000000,1058.23,1089.84,884.962,908.904,
65000000000,1026.14,1140.69,899.5,913.072,
66000000000,1085.88,1136.52,951.608,944.032,
67000000000,1049.86,1153.62,912.068,949.908,
68000000000,1058.52,1128.15,940.94,953.16,
69000000000,1038.92,1133.21,957.66,932.024,
70000000000,994.48,1031.85,941.404,926.031,
71000000000,944.068,1045.94,917.052,868.064,
72000000000,897.316,1021.12,891.728,865.06,
73000000000,895.396,943.026,878.548,871.848,
74000000000,832.98,960.164,855.02,812.9,
75000000000,815.448,946.112,825.54,767.6,
76000000000,845.02,903.104,774.1,752.9,
77000000000,849.52,888.065,777.016,754.452,
78000000000,885.656,931.942,762.54,759.95,
79000000000,922.48,973.094,781.904,813.004,
80000000000,909.012,977.148,803.98,874.99,
81000000000,886.08,1049.93,856.96,828.984,
82000000000,941.9,1006.93,856.944,844.464,
83000000000,966.096,1024.96,892.068,858.992,
84000000000,914.956,984.464,889.04,826.984,
85000000000,880.08,964.04,868.088,831.872,
86000000000,917.932,940.85,863.024,810.192,
87000000000,846.085,905.983,865.608,800.91,
88000000000,843.005,885.054,837.972,773.07,
89000000000,804.056,826.08,800.932,763.917,
90000000000,755.976,853,793.97,760.045,
91000000000,749.962,815.812,765.44,729.072,
92000000000,771.512,807.114,739.894,713.921,
93000000000,806.452,867.952,738.98,736.036,
94000000000,821.532,881,726.08,778.928,
