Frame number,1000000000,
0.000000,436,
1.000000,442,
2.000000,452.005,
3.000000,469.99,
4.000000,467.988,
5.000000,468.014,
6.000000,461.003,
7.000000,462.994,
8.000000,460.01,
9.000000,454.988,
10.000000,462,
11.000000,451,
12.000000,448,
13.000000,441,
14.000000,446,
15.000000,445.996,
16.000000,450.008,
17.000000,439.997,
18.000000,443.992,
19.000000,453.01,
20.000000,451.992,
21.000000,470.004,
22.000000,465.999,
23.000000,464.99,
24.000000,462.996,
25.000000,458.983,
26.000000,461.008,
27.000000,458,
28.000000,454.012,
29.000000,447.009,
30.000000,439.014,
31.000000,448.999,
32.000000,440.022,
33.000000,440.008,
34.000000,450,
35.000000,437.996,
36.000000,448.994,
37.000000,446.01,
38.000000,442.004,
39.000000,453,
40.000000,446.996,
41.000000,453.012,
42.000000,438,
43.000000,451.98,
44.000000,450.006,
45.000000,446.007,
46.000000,446,
47.000000,448.996,
48.000000,446,
49.000000,440.012,
50.000000,432.004,
51.000000,435.99,
52.000000,433.994,
53.000000,441.496,
54.000000,443.488,
55.000000,447.99,
56.000000,444.49,
57.000000,444.004,
58.000000,441.011,
59.000000,436.008,
60.000000,443,
61.000000,447,
62.000000,442.99,
63.000000,443.006,
64.000000,434.014,
65.000000,438.02,
66.000000,439.008,
67.000000,431,
68.000000,437.986,
69.000000,432.996,
70.000000,436.005,
71.000000,437.004,
72.000000,438,
73.000000,436,
74.000000,432.013,
75.000000,444.994,
76.000000,427.988,
77.000000,439,
78.000000,433.007,
79.000000,439.002,
80.000000,430.5,
81.000000,435.01,
82.000000,427.992,
83.000000,431.997,
84.000000,426.995,
85.000000,443,
86.000000,437.991,
87.000000,434,
88.000000,430.504,
89.000000,438,
90.000000,432.505,
91.000000,439.008,
92.000000,437.008,
93.000000,436.996,
94.000000,432.011,
95.000000,434.996,
