Time [ms],1000000000,1000000001,1000000002,1000000003,
0,27872,41452,31199,54776,
1000000000,5564.6,13442.5,12757.3,8544.73,
2000000000,3273.15,5332.89,6882.68,2677.49,
3000000000,2435.34,3324.38,5134.12,1765.97,
4000000000,2275.34,2444.08,4227.69,1586.09,
5000000000,2047.14,2100.93,3821.66,1359.28,
6000000000,2095.5,1885.22,3775.7,1260.93,
7000000000,2534.92,1536.48,3794.73,1362.04,
8000000000,2604.86,2247.19,4127.93,1722.06,
9000000000,2230.04,2570.77,3862.27,1806.79,
10000000000,1572,3232.95,3290.48,1514.08,
11000000000,1313.28,2450.46,2924.61,1102.65,
12000000000,1285.09,1583.9,2546.09,930.424,
13000000000,1211.01,1309.96,2201.64,886.975,
14000000000,1098,1210.73,1996.18,925.52,
15000000000,1024.03,1151.2,1984.05,953.568,
16000000000,1095.94,1142.1,1972.14,1013.1,
17000000000,1141.78,1171.95,1861.9,1184.04,
18000000000,1181.34,1106.25,1768.24,1350.95,
19000000000,1154.89,1196.2,1725.38,1547.99,
20000000000,1154.68,1226.15,1694.23,1613.05,
21000000000,1201.96,1244.92,1773.22,1530.68,
22000000000,1271.58,1213.19,1738.73,1650.88,
23000000000,1371.14,1296,1703.06,1618.98,
24000000000,1332.15,1420.89,1684.71,1362,
25000000000,1381.97,1332.57,1709.16,1344.93,
26000000000,1496.94,1364.9,1739.92,1309.04,
27000000000,1377.1,1279.9,1685.13,1217.25,
28000000000,1335.74,1327.83,1655.82,1070.09,
29000000000,1419.45,1211.89,1581.06,1007.99,
30000000000,1425.17,1242.18,1592.81,1012.47,
31000000000,1420.93,1165.9,1548.13,1047.06,
32000000000,1324,1192.9,1513.93,1025.96,
33000000000,1353.18,1227.19,1475.8,1086.9,
34000000000,1340.97,1196.2,1383.21,1194.96,
35000000000,1243.53,1186.46,1379.12,1072.15,
36000000000,1230.92,1138,1341.93,1316.99,
37000000000,1264.18,1158.24,1370.69,1424.88,
38000000000,1372.83,1139.23,1384.18,1463.1,
39000000000,1287.86,1144.88,1305.03,1465.06,
40000000000,1234.49,1153.87,1283.88,1464.96,
41000000000,1152.72,1174.65,1316.08,1420.92,
42000000000,1225.3,1205.2,1240.14,1349.98,
43000000000,1125.5,1116.01,1244.7,1300.99,
44000000000,1225,1162.73,1218.04,1241.05,
45000000000,1253.89,1193.87,1261.03,1139.11,
46000000000,1203.28,1275.02,1240.96,1062.04,
47000000000,1160.14,1198.18,1235.02,979.03,
48000000000,1202.06,1225.71,1199.06,948.148,
49000000000,1255.04,1237.79,1197.93,891.942,
50000000000,1204.81,1289.45,1204.83,918.96,
51000000000,1178.56,1173,1239.07,925.122,
52000000000,1207.11,1265.2,1197.1,931.935,
53000000000,1217.1,1115.93,1208.97,909.416,
54000000000,1278.38,1163.45,1222.49,1002.04,
55000000000,1231.7,1073.12,1249.12,1000.58,
56000000000,1238.95,1070.06,1184.96,1015.47,
57000000000,1211.15,1032.95,1146.98,1012.92,
58000000000,1215.93,1036.2,1166.26,1028.95,
59000000000,1136.28,1090.16,1172.72,1009.95,
60000000000,1090.05,1039.78,1178.13,953.904,
61000000000,1135.89,1064.4,1179.91,988.556,
62000000000,1144.95,994.976,1097.04,982.934,
63000000000,1138.85,1058.98,1092.94,1062.96,
64000000000,1138.98,1020.94,1120,1023.03,
65000000000,1110.13,1112.09,1112.08,986.536,
66000000000,1100.01,1108.06,1110.65,1002.5,
67000000000,1104.96,1150.86,1092.98,970.12,
68000000000,1082.07,1148.07,1080.91,996.128,
69000000000,1116.22,1125.21,1099.75,988.172,
70000000000,1207.87,1144.25,1086.99,966.048,
71000000000,1166.98,1197.65,1043.85,992.52,
72000000000,1179.3,1145.48,1124.06,999.068,
73000000000,1128.63,1139.82,1144.07,1024.56,
74000000000,1142.48,1079.78,1090.14,1012.32,
75000000000,1092.8,1087.88,1107.86,999.498,
76000000000,1123.17,1061.94,1105.12,958.054,
77000000000,1066.06,1060.37,1101.17,949.12,
78000000000,1080.11,1041.12,1035.85,940.08,
79000000000,1109.84,1065.94,1085.94,962.008,
80000000000,1090.78,1024.15,1048.88,945.992,
81000000000,1055.84,1050.06,1034.09,957.055,
82000000000,1054.81,1017.04,1047.04,966.964,
83000000000,1094.09,1041.82,1032.02,953.056,
84000000000,1037.83,1018.85,998.055,970.05,
85000000000,1013.97,1050.84,989.84,964.916,
86000000000,1025.22,1075.92,1037.1,994.408,
87000000000,999.04,1065.76,1029.89,957.5,
88000000000,1078.81,1046.84,1006.97,964.463,
89000000000,1060.74,1121.96,990.154,991.992,
90000000000,1086.35,1085.2,1035.17,980.564,
91000000000,1012.83,1052.21,1038.9,953.552,
92000000000,1133.1,993.404,1001.19,979.044,
93000000000,1069.93,992.58,976.14,915.98,
94000000000,1099.62,979.969,976.199,924.932,
95000000000,1087.86,952.724,959.1,930.08,
