
Intensity Median
 ==================== 
Time [s],1000000000,1000000001,1000000002,1000000003,1000000004,1000000005,1000000006,
0.000000,3487.22,2851.18,3271.39,5207,1900.76,1738.2,1604.83,
1.000000,2998.82,2184.43,2431.38,4127.68,1625.28,1267.22,1152.05,
2.000000,2175.15,2217.05,2514.37,3564.81,1651.02,1176.04,1045.69,
3.000000,1879.2,2272.51,2418.71,3319.04,1675.69,1057.6,1359.13,
4.000000,2132.06,2782.23,2536.34,5311.79,2391.55,1750.1,2587.88,
5.000000,2632.2,3682.06,3560.18,8049.38,3824.67,2879.82,5117.23,
6.000000,2820.34,4739.32,4377.62,9803.76,5112.68,3711.56,6606.2,
7.000000,2850.79,5467.26,5020.23,10217.1,5908.18,4172.77,7157.52,
8.000000,2802.6,5775.27,5294.88,10714.2,6495.34,4261.65,7307.15,
9.000000,2790.33,4551.19,5272.08,11057.8,6531.87,4431.2,7004.65,
10.000000,2722.29,5590.18,5136.1,11051.1,6520.21,4104,6972.8,
11.000000,2736.32,5846.9,4797.37,10345.6,6566.62,3782.11,6576.73,
12.000000,2516.65,5505,4379.44,9101,6335.82,3507.52,5978.46,
13.000000,2431.48,5126.21,4085.85,7683.48,5697.12,3427.79,5604.62,
14.000000,2307.12,4526.63,3884.36,6767.02,5123.61,3401.28,5170.57,
15.000000,2250.74,3802.04,3592.68,5953.12,5078.68,3300.8,4844.16,
16.000000,2116.92,3215.59,3357.06,5573.48,4396.61,3355.31,4703.29,
17.000000,1960.14,2965.52,3012.47,5161.24,4102.12,2994.75,4698.86,
18.000000,1899.04,3481.07,2837.64,4572.34,3960.35,2768.03,4350.93,
19.000000,1895.68,3240.89,2693.65,4261.49,3651.24,2689.12,4143.02,
20.000000,1834.07,3010.82,2456.42,3621.57,2983.74,2565.91,3994.2,
21.000000,1668.22,2999.77,2456.67,2942.27,2902.49,2469.11,3930.67,
22.000000,1737.01,3111.8,2460.61,2639.34,3091.81,2701.76,4312.9,
23.000000,1848.99,3151.5,2586.29,2928.29,3585.02,2842.98,4617.19,
24.000000,1893.99,3233,2908.88,3047,4031.74,2520.14,4801.4,
25.000000,2063.87,3467.55,3123.18,3185.52,4456.07,3453.15,5111.74,
26.000000,2119.79,3618.7,3135.62,3536,4830.24,3759.4,5183.85,
27.000000,2097.52,3508.94,3026.29,3531.95,5016.73,3535.73,5101.16,
28.000000,2036.85,3445.94,2891,3471.27,4860.75,3261.42,4716.44,
29.000000,1886.33,3138.76,2785.33,3235.78,4397.88,3098.93,4482.91,
30.000000,1811.97,3042.6,2590.55,2871.81,4110.85,2805.66,4195.4,
31.000000,1727.22,2714.35,2500.79,2781.34,3990.87,2674.82,4155.82,
32.000000,1654.42,2657.62,2287.24,2589.22,3561.02,2549.13,3933.6,
33.000000,1593.34,2437,2309.88,2409.79,3379.72,2567.08,4075.64,
34.000000,1539.86,2220.32,2160.02,2275.02,3316.5,2289.4,3690.07,
35.000000,1447.23,2049.75,2038.23,2028.04,3119.64,2265.38,3586.25,
36.000000,1323.83,1906.1,1759.54,1822.34,2837.38,2176.34,3279.01,
37.000000,1322.39,1703.77,1454.97,1811.99,2618.35,1904.62,3014.2,
38.000000,1266.13,1622.92,1430.15,1686.03,2319.29,1942.9,2884.2,
39.000000,1277.06,1622.81,1492.12,1613.09,2329.48,2136.31,2891.07,
40.000000,1372.82,1693.28,1619.36,1662.06,2595.62,1709.94,3157.74,
41.000000,1439.98,1915,1693.93,1806.18,2926.3,1841.96,3294.59,
42.000000,1506.25,2041.09,1646.01,2028.67,3458.03,1960.15,3609.81,
43.000000,1478.64,1990.88,1558.24,2230.49,3417.26,2074.54,3593.46,
44.000000,1474.07,2089.18,1562.78,2456,3356.7,2056,3688.59,
45.000000,1428.88,1938.96,1466.59,2485.01,3373.55,1988.7,3567.27,
46.000000,1365.3,1850.58,1440.06,2307.56,3292.56,1897.66,3444.13,
47.000000,1327.74,1758,1364.1,2249.2,2906.52,1836.87,3071.19,
48.000000,1256.88,1716,1252.1,2195.77,2834.29,1682.78,2840.68,
49.000000,1151.22,1636.3,1163.88,2061.08,2610.25,1622.7,2724.93,
50.000000,1119.77,1506.16,1143.03,1829.88,2428.88,1593.74,2770.81,
51.000000,1090.05,1438.98,1106.95,1725.97,2398.6,1527.21,2603.24,
52.000000,1025.84,1302.11,1029.02,1636,2123.31,1430.41,2403.37,
53.000000,1014.87,1207.08,955.06,1546.24,1925.28,1376.53,2213.09,
54.000000,959.948,1132.42,952.001,1414.9,1760.12,1255.05,2116.9,
55.000000,944.768,1136.66,993.6,1381.06,1719.19,1207.01,2018.58,
56.000000,941.032,1194.08,1036.01,1310.06,1700.59,1176.47,1984.83,
57.000000,957.072,1278.06,1090.98,1294.04,1875.86,1276.38,2059.37,
58.000000,1008.08,1340.21,1093.89,1377.88,2046.22,1369.96,2219.9,
59.000000,1002.08,1311.02,1074.43,1545.86,2354.95,1354.41,2318.39,
60.000000,1021.07,1324.54,1006.02,1605.9,2234.47,1375.85,2203.39,
61.000000,970.036,1290.96,953.949,1662.5,2109.32,1362.84,2124.51,
62.000000,1224.02,1698.87,978.532,1679.52,2505.34,1345.63,2258.78,
63.000000,1199.46,1412.12,954.05,1693.02,2386.6,1364.05,2134.02,
64.000000,1200.53,1458.5,937.96,1671.25,2467.8,1324,2109.25,
65.000000,1128.09,1308.06,926.975,1578.82,2273.79,1290.82,1953.49,
66.000000,1091.77,1370.05,867.08,1461,1978.42,1254.94,1885.68,
67.000000,1056.87,1291.3,811.44,1486.97,2011.86,1215.96,1855.82,
68.000000,1013,1201.77,777.04,1358.39,1862.15,1132.04,1733.5,
69.000000,913.44,1137.74,770.024,1321.59,1778.96,1111.11,1515.07,
70.000000,873,1055.18,737,1253.02,1685.08,1069.92,1474.42,
71.000000,823.971,1027.05,762.036,1170.07,1471.8,1002.94,1228.78,
72.000000,844.08,1061.12,761.91,1142.96,1324.14,1004.43,1199.83,
73.000000,789.934,1073.35,742.984,1108.99,1433.98,1005.92,1241.87,
74.000000,897.9,1131.13,756.982,1117.03,1593.66,1196.48,1329.31,
75.000000,888.946,1177.52,779.99,1118.06,1735.35,1366.49,1320.06,
76.000000,932.088,1167.27,754.015,1131.04,1785.76,1331.73,1338,
77.000000,914.108,1238.36,766.982,1446.5,1906.22,1221.65,1318.9,
78.000000,912.04,1203.93,755.118,1479.96,1792.73,1261.42,1284.14,
79.000000,923.1,1225.83,745.921,1562.64,1890.57,1303.4,1350,
80.000000,885.028,1168.99,729.95,1544.16,1809.32,1213.93,1337.16,
81.000000,872.084,1127.73,719.048,1309.88,1778.58,1308,1256.97,
82.000000,816.03,1120.23,664.988,1266.95,1604.5,1353.99,1167.54,
83.000000,805.052,1024,671,1218.14,1555.5,1230,1118.03,
84.000000,767.952,1009.88,657.032,1234.98,1510.69,1128,1253.28,
85.000000,749.024,947.896,653.968,1162.97,1435.5,1151,1141.28,
86.000000,739,931.86,645.015,1154.25,1302,1135.98,1114.92,
87.000000,696.96,896.004,625.96,1105.1,1324.5,1105.31,1094.07,
88.000000,691.992,865.97,622.964,1044.22,1256,1052.9,1047.84,
89.000000,718.416,910,642.52,1039.12,1157.14,971.064,1008.95,
90.000000,727.082,915,609.948,1018.13,1239.75,1076.14,1072.92,
91.000000,748.1,908,614.992,1007.82,1251.23,1040,1096.8,
92.000000,724.03,946.288,644.973,982.18,1405.69,1162.17,1144.04,
93.000000,762,991.12,656.95,1040.06,1444.19,1132,1189.08,
94.000000,768.052,1012.18,638.012,1063.84,1444.25,1161.78,1182.08,
95.000000,715.01,969.096,639.504,1095.05,1566.2,1158.24,1169.32,
