Frame number,1000000000,1000000001,1000000002,1000000003,1000000004,1000000005,1000000006,1000000007,
0.000000,573.008,570.836,626.26,527.915,678.8,648.901,640.311,591.94,
1.000000,621.94,562.916,826.286,533.48,713,794.93,677.074,673.1,
2.000000,589.988,616.764,845.941,523.634,684.83,766.46,716.035,797.232,
3.000000,592.224,664.072,800.915,536.12,684.078,725.02,662.35,721.439,
4.000000,564.16,645.65,739.405,519.943,636.009,680.567,604.729,715.032,
5.000000,513.992,562.712,670.043,513.09,605.946,662.024,608.38,656.153,
6.000000,503.016,558.112,584.988,484.8,590.104,571.934,564.92,592.45,
7.000000,489.106,503.28,551.891,498.965,527.884,596.072,587.93,549.98,
8.000000,475,523.918,516.396,501.992,508.54,594.972,562.125,535.35,
9.000000,465.088,504.44,501.584,484.05,496.54,512.05,517.11,517.519,
10.000000,459,487.078,514.592,478.005,498.516,543.584,516.106,523.94,
11.000000,454.136,472.52,473.083,495.902,496.062,525.04,487.12,505.987,
12.000000,452.984,472.024,515.032,468.061,501.037,518.956,494.896,512.977,
13.000000,469.05,479.122,514.628,496.986,482.09,491.936,494.976,517.06,
14.000000,452.968,485.21,496.93,494.102,511.957,503.924,512.856,527.976,
15.000000,465.552,514.932,508.933,522.142,517.071,528.064,526.931,537.921,
16.000000,499.392,592.844,524.516,535.126,536.979,536.52,532.911,552.888,
17.000000,503.12,655.092,609.48,636.852,579.596,560.674,565.331,586.161,
18.000000,524.035,727.136,644.514,623.05,648.953,646.077,594.291,662.72,
19.000000,572.25,788.02,711.779,610.978,694.145,653.716,561.167,680.93,
20.000000,591.696,719,699.516,639.604,702.828,661.075,638.344,668.25,
21.000000,580.176,696.534,775.744,590.172,669.215,657.006,581.126,662.223,
22.000000,587.032,624.115,703.599,539.063,643.878,619.245,621.285,637,
23.000000,542.628,570.997,691.291,535.074,593.9,654.139,602.18,594.065,
24.000000,531.1,552.992,650.915,561.226,594.95,607.086,557.257,583.28,
25.000000,497.876,527.582,613,528.08,601.085,554.827,538.959,573.785,
26.000000,500.051,528.652,565.987,523.134,551.951,542.64,563.975,537.013,
27.000000,494.1,523.204,521.9,503.97,538.031,521.328,557.138,516.125,
28.000000,472.022,484.46,526.12,493.956,502.985,508.921,510.037,535.003,
29.000000,487.98,495.64,513.076,478.935,515.993,494.556,506.999,531.187,
30.000000,479.08,487.52,549.482,504.075,495.062,510.98,485.985,521.04,
31.000000,494.6,513.938,535.054,500.14,497.05,512.052,514.952,468.093,
32.000000,504.059,527.148,563.465,504.008,513.9,507.576,495.045,514.907,
33.000000,499.065,572.656,533.908,541.814,517.978,503.096,506.133,484.044,
34.000000,559.096,592.474,570.136,580.785,538.604,479.544,558.047,546.182,
35.000000,558.04,600.669,596.917,557.694,561.044,526.535,574.193,543.136,
36.000000,540.015,671.58,698.89,584.099,579.056,551.534,528.126,545.223,
37.000000,575.332,667.946,652.732,558.181,587.048,554.08,661.802,597.62,
38.000000,576.218,641.065,657.108,558.879,568.136,559.936,649.112,554.979,
39.000000,563.181,621.896,690.09,526.079,555.996,539.441,628.11,510.904,
40.000000,566.28,610.927,651.171,506.03,521.048,560.66,615.075,505.995,
41.000000,547.567,583.64,648.03,500.946,559.512,529.025,598.935,516.945,
42.000000,506.515,590.032,611.195,500.83,514.474,525.045,578.076,486.041,
43.000000,510.072,540.067,603.939,492.968,526.552,512.56,529.053,504.958,
44.000000,499.058,516.041,585.959,508.93,533.06,495.919,532.987,523.978,
45.000000,465.152,493.002,531.831,473.031,492.604,506.468,516.015,521.046,
46.000000,486.052,484.905,552.009,467.995,496.984,478.079,486.528,531.015,
47.000000,493.028,499.939,525.08,469.886,479.5,494.564,496.872,506.108,
48.000000,474.036,502.066,498.959,468.064,460.021,488.52,504.968,494.1,
49.000000,471.124,511.464,521.96,465.992,490.03,477.456,510.032,501.052,
50.000000,483.906,529.187,509.04,465.872,511.99,491.572,512.025,471.993,
51.000000,512.899,569.63,546.212,478.855,512.992,452.456,554.074,503.46,
52.000000,519.021,578.02,643.851,496.123,538.12,496.466,568.192,491.52,
53.000000,583.157,599.725,627.031,496.077,527.952,496.476,584.952,502.52,
54.000000,629.118,628.509,767.63,483.035,528,509.464,613.978,498.554,
55.000000,594.142,676.524,677.825,490.84,527.962,529.096,571.908,524.468,
56.000000,595.428,691,884.993,466.037,512.04,524.024,555.082,530.916,
57.000000,566.92,693.44,759.127,485.91,542.496,549.012,575.044,531.476,
58.000000,585.16,669.534,832.771,478.02,543,544.53,568.2,479.48,
59.000000,548.026,613.523,802.182,469.52,548.992,546.37,593.008,485.977,
60.000000,537.504,587.408,720.964,466,522.1,506.559,561.048,496.456,
61.000000,543.172,590.393,720.224,454.928,509.928,485.87,540.108,483.07,
62.000000,501.061,547.4,639.735,467.48,498.02,512.496,525.997,494.052,
63.000000,488.568,535.074,614.342,461.52,521.072,501,525.011,467.12,
64.000000,488.096,549.188,604.079,454.492,488.016,475.446,525.04,476,
65.000000,487.052,550,584.16,445.058,474.926,504.914,530.926,503.038,
66.000000,506.016,513.51,600.002,445.013,460.094,468.94,511.78,493,
67.000000,496.02,549.348,567.743,450.93,471.919,484.99,524.971,474.974,
68.000000,528.518,584.604,606.87,464.878,492.16,505.046,522.116,492.62,
69.000000,537.012,607.098,672.661,442.944,473.928,496.945,527.949,502.984,
70.000000,549.128,674.662,693.56,480.069,476.922,511.866,601.146,473.528,
71.000000,574.512,753.904,795.582,467.065,503.464,532.142,596.218,476,
72.000000,614.044,787.932,842.376,485.1,525.944,520.134,602.955,482.994,
73.000000,623.96,769.846,840.728,513.014,533.056,517.938,622.101,506.425,
74.000000,596.496,758.154,873.56,505.16,520.056,548.194,595.015,496.502,
75.000000,620.49,726.776,904.47,495.824,482.952,556.997,586.044,506.51,
76.000000,611,642.047,820.25,479.86,467.956,542.125,559.152,485.466,
77.000000,584.948,604.832,806.445,477.949,477.024,546.088,548.396,508.54,
78.000000,548.424,557.712,592.847,472.95,444.96,532.123,577.136,492.976,
79.000000,551.484,531.24,642.648,476.96,457.94,514.093,567.014,494.01,
80.000000,531.038,550.43,624.887,438.924,471.007,505.972,526.16,482.048,
81.000000,507.532,546.48,602.112,452.048,473.01,519.08,545.983,470.973,
82.000000,507.544,522.2,611.473,450.012,465.99,544.03,528.92,472.513,
83.000000,483.484,527.928,614.018,455.966,480.044,551.976,527.952,471.472,
84.000000,520.034,544.19,580.279,440.936,460.486,507.995,552.915,465.03,
85.000000,534.88,529.153,645.615,453.928,472.036,489.94,541.004,465.044,
86.000000,547.13,566.552,589.933,449.1,493.122,500.951,541.144,443.04,
87.000000,595.064,556.838,628.915,464.02,480.455,498.865,544.44,469.98,
88.000000,649.96,584.922,599.865,468.9,489.004,515.019,572.514,455.008,
89.000000,619.076,658.27,593.738,471.968,487.625,520.985,579.586,462.94,
90.000000,675.874,704.875,719.83,475.92,484.04,514.904,616.533,444.003,
91.000000,652.483,624.725,866.674,472.16,465.982,515.408,597.048,475.487,
92.000000,635.536,637.089,878.589,468.951,455.021,528.006,597.585,473.05,
93.000000,627.272,611.099,766.26,480.82,465.01,528.952,579.06,480.065,
