Frame number,1000000000,1000000001,1000000002,1000000003,1000000004,1000000005,1000000006,1000000007,
0.000000,1773.96,1424.85,1065.04,1167.4,1649.05,1361.06,2129,1659.39,
1.000000,1591.63,1510.1,970.024,1192.07,1593.21,1304.83,2058.32,1529.27,
2.000000,2040.91,2019.77,1113,1545.98,1647.38,1445.24,2183.86,1481.04,
3.000000,2673.5,2811.81,1426.92,1957.08,2000.31,1755.3,2615.23,1715.66,
4.000000,3096.6,3366.67,1795,2401.46,2267,2025.62,2846.9,1859.94,
5.000000,2997.88,3437.58,1964.98,2647.56,2661.44,2270.48,3297,2229.9,
6.000000,2984,3494.18,2355.52,2537.3,2772.95,3274.66,3607.73,2640.93,
7.000000,2865.1,3254.25,2852,2344.82,2727.06,3271.62,4439.16,3346.84,
8.000000,2992.01,2934.53,2415.56,2101.51,2837.32,2683.29,3611.77,3153.08,
9.000000,2740.9,2675.19,2086.4,1977.65,2907.2,2388.67,3328.04,2581.18,
10.000000,2438.95,2339.13,2025.07,1808.39,2708.5,2319.47,3043.92,2478.24,
11.000000,2088.06,2120.1,1848.02,1521.93,2634.74,2224.25,2910.5,2380.1,
12.000000,2014.77,2039.14,1662.98,1444.71,2529,2144.57,2683.31,2224.89,
13.000000,1956.98,1850.93,1564.1,1378.93,2370.86,2091.96,2638.29,2071.95,
14.000000,1860.14,1716.03,1503.99,1315.76,2173.36,1965,2543.42,2050.98,
15.000000,1815.07,1778.92,1477.12,1294.15,1982.55,1893.09,2225.4,1919.06,
16.000000,1748.18,1617.1,1345.06,1253.83,2071.16,1764.16,2038.4,1860.05,
17.000000,1661.05,1554.01,1254.96,1058.17,1940.19,1572.06,1878.03,1702.93,
18.000000,1669.89,1445,1197.91,1064.9,1842.8,1442.18,1796.97,1584.04,
19.000000,1796.78,1565.1,1174.08,1105,1913.12,1494.04,1749.49,1559.11,
20.000000,2029.54,1657.01,1292.9,1139.84,1781.1,1465.21,1919.15,1676.02,
21.000000,2049.88,1846.11,1437.97,1302.86,1723.89,1636.64,2041.78,1819.15,
22.000000,2029.04,1894.97,1558,1232.96,1829.44,1750.84,2320.93,2060.5,
23.000000,2039,1920.16,1697.12,1329.91,2207.27,1839.14,2341.56,2135.42,
24.000000,2178.93,1845.03,1697,1404.81,2322.59,1995.24,2477.74,2195,
25.000000,2091.79,1877.04,1758,1467.05,2320.17,2019.76,2421.98,2287.63,
26.000000,1876.86,1887.92,1742.89,1545.89,2317.32,2190.95,2530.42,2367.48,
27.000000,1811.98,1794,1727.88,1528.97,2398.45,2364.75,2848.43,2299.84,
28.000000,1701.16,1733.9,1680.07,1445.99,2253.54,2212.5,2849.21,2389.98,
29.000000,1712,1612.45,1711.98,1374.8,2112.2,2055,2790.7,2356.44,
30.000000,1602.12,1565.52,1580,1321.17,2212.36,1899,2631.74,2344,
31.000000,1487.02,1463,1486.1,1316.96,2147.28,1723.19,2485.44,2196.56,
32.000000,1357.08,1426.04,1354.45,1239.93,2304.34,1640.68,2301.03,2109.44,
33.000000,1377.92,1317.04,1247.46,1138.13,2166.73,1522.42,2005.02,1983.98,
34.000000,1292,1295.24,1136,1106.8,2059.82,1462,2016.98,1897.03,
35.000000,1295.8,1269.06,1108.45,1073.94,1813,1380.68,2016.5,1814.14,
36.000000,1470.97,1344,1056.46,1091.95,1752.65,1329.85,1827.21,1710.9,
37.000000,1621,1346.02,1050.58,1136.16,1628.08,1291,1858.03,1611.51,
38.000000,1709.93,1432.08,1082,1125.05,1812.36,1289.14,1806.14,1572.5,
39.000000,1737.94,1488.26,1161.52,1141.86,1841.82,1383,1997.43,1606.34,
40.000000,1706.87,1499.9,1250.93,1142.14,1865.04,1482.07,2051.7,1694.84,
41.000000,1671.17,1556,1320.08,1177.92,1992.32,1559,2273.33,1820.02,
42.000000,1704.01,1544.97,1393.94,1188.47,2077.96,1612.7,2303.68,1934.8,
43.000000,1753.99,1535.07,1450.21,1262.58,2231.58,1653.98,2466.85,1983.99,
44.000000,1746.94,1529.1,1446.14,1289.74,2322.95,1815.82,2530.9,2143.06,
45.000000,1724.99,1478.11,1447.05,1347.12,2328.84,1775.07,2613.18,2156.91,
46.000000,1730.9,1461.05,1441.06,1332.92,2323.72,1787.05,2659.48,2178.87,
47.000000,1586.95,1410.05,1455.05,1408.98,2203.62,1742.24,2667.47,2193.07,
48.000000,1634.94,1364.84,1449,1303.41,2180.12,1741.9,2675.43,2145.96,
49.000000,1479.13,1337.01,1391.01,1272.25,2128.14,1652.68,2593.49,2104.01,
50.000000,1421.21,1283.13,1368.1,1292.26,2090.04,1599.28,2533.19,2140.15,
51.000000,1406.06,1189,1307.02,1213.27,1983.8,1569.16,2372.45,2062.99,
52.000000,1287.11,1104,1212.02,1124.15,1952.39,1421.58,2140.77,2056.99,
53.000000,1328.12,1103.89,1143,1122.02,1959.08,1327.8,2027.7,1906.04,
54.000000,1438.95,1134.97,1134.54,1103.95,1843.97,1356.91,2002.81,1789.58,
55.000000,1526.9,1169,1141.54,1124.13,1703.58,1399.92,1920.44,1728.13,
56.000000,1592.9,1269.06,1198.03,1139.85,1544.24,1421.1,1991.12,1651.02,
57.000000,1583.03,1323.98,1262.1,1192.96,1484.42,1529.67,2112.18,1619,
58.000000,1521.98,1365.04,1377.02,1163.08,1465,1531.09,2121.02,1658.84,
59.000000,1517.07,1361.97,1418.51,1215.12,1514.48,1603.28,2143.82,1673.87,
60.000000,1429.94,1322.01,1389.96,1245.91,1596.43,1637.28,2075.9,1768.07,
61.000000,1469.44,1288.06,1403.98,1173.9,1606.1,1678.88,2059.47,1759.99,
62.000000,1422.93,1228.07,1346.42,1277.18,1719.86,1659.72,2099.09,1759.45,
63.000000,1431.92,1183.95,1348.01,1228.9,1708.03,1580.11,2090.71,1754.06,
64.000000,1403.44,1226.08,1338.55,1298.6,1752.28,1671.33,1984.66,1727.91,
65.000000,1394.53,1212.02,1294.91,1289.01,1690.04,1672.87,1999.85,1715.54,
66.000000,1352.5,1165.07,1279.06,1265.43,1566.89,1543.96,1987.83,1711.5,
67.000000,1314.01,1103.04,1207.9,1277.04,1599.82,1450,1867.19,1726.53,
68.000000,1174.98,1084,1134.87,1217.4,1564.75,1344.1,1783.04,1599.48,
69.000000,1133.06,999.05,1088.63,1156.25,1535.3,1278.92,1648.17,1561.01,
70.000000,1136.02,941.064,1009.08,1066.08,1463.97,1194.91,1531.48,1445.49,
71.000000,1155.93,895.06,943.868,1063.83,1384.97,1100.02,1463.39,1375.49,
72.000000,1209.01,880.006,897.948,1041.03,1312.94,1075.87,1359.94,1330.08,
73.000000,1347.01,846.98,873.9,1050.94,1198.14,1020.08,1342.2,1286.78,
74.000000,1441.08,862.968,862.052,1046.01,1139.77,952.136,1311.14,1226.99,
75.000000,1425.07,866.98,844.014,1020.24,1142.74,875,1212.96,1189.97,
76.000000,1423.96,843,814.904,1037.04,1098.57,859.064,1286.91,1183.95,
77.000000,1322.98,876.968,859.072,1040.07,1100.26,846.878,1233,1194.01,
78.000000,1313.02,927.017,873.914,1058.75,1146.14,867.47,1247.1,1209,
79.000000,1274.95,962.047,856.916,1050.01,1216.92,904.04,1216.04,1228.93,
80.000000,1283.94,940.905,809.46,1023,1172.17,889.104,1228.91,1284.06,
81.000000,1233.96,864.047,811.04,1032.87,1183,888.922,1132.05,1272.02,
82.000000,1198.07,838.98,853.086,1003.17,1169.95,906,1127.05,1273.88,
83.000000,1153.9,802.015,855.996,1014.09,1179.08,911.96,1047.97,1291.99,
84.000000,1101.97,776.968,863.54,1057.08,1142.88,872,969.172,1250.93,
85.000000,1060.94,801.018,835.991,1073.08,1102.09,827.996,923,1249,
86.000000,1010.92,770.956,838,967.912,1065.98,804.976,919.038,1234.04,
87.000000,943.008,727.968,802.988,925.032,1004.93,802.068,897,1191.87,
88.000000,952.936,701.052,808.016,899,949.924,764.046,910.822,1069.98,
89.000000,947.918,684.952,772.912,857.104,913.52,757.476,870.073,967.912,
90.000000,940,644.02,804.024,818.976,906.912,750.99,854.08,966.81,
91.000000,1028.02,639.934,753.504,790.984,858.476,751.993,851.1,960.104,
92.000000,1052.04,634.968,751.486,801.008,846.028,754.96,841.013,956.966,
93.000000,1029.96,641.088,765.98,748.934,845.064,780.476,854.97,1008.43,
94.000000,966.016,649.04,745.976,719.016,842.52,823.12,886.059,1026.01,
95.000000,965.048,615.033,770.032,714.984,810.987,836.084,856.984,979.895,
