Frame number,1000000000,1000000001,1000000002,
0.000000,1045.51,902.988,1207.43,
1.000000,854.466,796.58,811.84,
2.000000,974.317,989.471,793.829,
3.000000,1198.9,1014.58,1218.16,
4.000000,1609.99,996.56,1842.72,
5.000000,1744.21,1195.44,2155.89,
6.000000,1273.92,1362.94,1737.35,
7.000000,1094.08,1224.41,1583.25,
8.000000,1072.34,1333.1,1368.77,
9.000000,1173.4,1285.54,1577.82,
10.000000,1393.54,1323.44,1243.66,
11.000000,1497.36,970.37,1476.18,
12.000000,1185,915.795,1225.84,
13.000000,705.496,842.104,1114.16,
14.000000,791.81,777.083,828.002,
15.000000,673.722,760.002,834.702,
16.000000,621.312,717.47,711.975,
17.000000,607.832,736.018,764.24,
18.000000,679.99,670.26,782.272,
19.000000,814.21,746.07,709.904,
20.000000,988.04,867.115,797.906,
21.000000,1359.78,1029.4,971.009,
22.000000,1259.23,1210.51,984.152,
23.000000,1344.95,1280.75,1129.84,
24.000000,1388.58,967.1,1138.5,
25.000000,1475.93,1043.7,1209.6,
26.000000,1421.73,1117.26,1033.02,
27.000000,1366.53,1087.65,1005.14,
28.000000,931.804,804.428,951.835,
29.000000,752.686,762.512,853.979,
30.000000,727.28,671.714,796.442,
31.000000,739.1,687.676,782,
32.000000,674.167,612.036,729.008,
33.000000,670.4,580.037,683.256,
34.000000,738.37,545.227,698.594,
35.000000,816.166,526.236,696.02,
36.000000,773.794,547.855,718.932,
37.000000,814.88,576.238,738.228,
38.000000,882.9,627.714,876.128,
39.000000,1010.82,742.99,962.84,
40.000000,1173.38,769.542,1028.5,
41.000000,1013.91,836.37,1157.51,
42.000000,1106.93,866.714,1276.91,
43.000000,1167.41,867.107,1214.09,
44.000000,1151.11,850.613,1133.54,
45.000000,1235.17,827.8,958.522,
46.000000,994.593,759.688,849.081,
47.000000,858.254,695.945,793.933,
48.000000,864.025,690.79,730.696,
49.000000,784.586,648.758,669.167,
50.000000,750.808,684.86,620.072,
51.000000,694.694,641.06,626.984,
52.000000,715.79,669.6,603.904,
53.000000,675.654,657.803,623.104,
54.000000,658.316,647.897,612.14,
55.000000,637.638,705.77,669.84,
56.000000,670.11,762.179,760.819,
57.000000,695.292,819.715,873.278,
58.000000,793.376,932.31,989.103,
59.000000,830.071,983.253,1067.29,
60.000000,932.284,976.881,1056.26,
61.000000,1066.49,1037.37,1021.79,
62.000000,1071.97,930.596,1009.37,
63.000000,1077.09,969.525,870.584,
64.000000,1071.19,881.57,801.032,
65.000000,965.777,719.244,776.96,
66.000000,888.833,684.901,689.92,
67.000000,836.747,679.73,699.132,
68.000000,720.95,618.168,654.12,
69.000000,714.491,596.415,623.14,
70.000000,655.202,611.294,607.05,
71.000000,595.821,604.21,587.088,
72.000000,646.863,621.934,597.144,
73.000000,665.592,658.858,625.087,
74.000000,689.131,696.832,697.69,
75.000000,683.51,768.671,795.207,
76.000000,883.229,842.518,871.552,
77.000000,993.352,881.075,946.778,
78.000000,1157.16,1016.66,888.458,
79.000000,1473.34,990.761,873.977,
80.000000,1607.3,951.578,803.217,
81.000000,1328.02,858.348,726.839,
82.000000,1190.88,773.436,694.045,
83.000000,1032.56,731.879,744.082,
84.000000,893.531,671.493,706.215,
85.000000,804.435,693.533,707.99,
86.000000,764.651,659.606,662.037,
87.000000,750.434,599.995,657.488,
88.000000,673.212,627.995,659.093,
89.000000,647.943,636.572,670.92,
90.000000,657.936,619.662,653.16,
91.000000,724.024,645.953,711.28,
92.000000,731.62,704.467,736.064,
93.000000,836.59,776.782,761.536,
94.000000,994.618,829.906,832.048,
95.000000,1044.08,955.79,844.56,
