
Intensity Median
 ==================== 
Time [s],1000000000,1000000001,1000000002,
0.000000,3224.06,6479.26,2236.74,
1.000000,2041.54,3861.69,1210.89,
2.000000,1472.52,2265.39,936.016,
3.000000,1358.16,2112,841.996,
4.000000,1340,2121.05,831.048,
5.000000,1427,2098.34,857.97,
6.000000,1399.04,2023.18,843.012,
7.000000,1295.38,2014.82,798.07,
8.000000,1298.01,1928.11,784.033,
9.000000,1176.57,1836.01,779.07,
10.000000,1167.3,1789.07,764.989,
11.000000,1075.23,1703.2,737.996,
12.000000,986.814,1598.91,720.464,
13.000000,952.092,1520.97,687.485,
14.000000,902.127,1451.96,669,
15.000000,881.858,1459.94,660.982,
16.000000,813.008,1400.06,651.92,
17.000000,773,1342.97,664.016,
18.000000,739.08,1310.04,634.015,
19.000000,758.936,1366.07,647.965,
20.000000,770.966,1416.1,655.952,
21.000000,826.052,1473.93,695.068,
22.000000,848,1606.11,710.964,
23.000000,851.082,1593.05,721.054,
24.000000,850.51,1602.99,714.052,
25.000000,786.024,1483.19,710.034,
26.000000,819.504,1456.92,686,
27.000000,796.11,1350.87,659.98,
28.000000,763.104,1319.07,651.972,
29.000000,735.024,1184.98,640.984,
30.000000,739.1,1123.19,621.024,
31.000000,705.941,1152.15,612.016,
32.000000,706.97,1078.09,616.973,
33.000000,710.96,1056.91,588.032,
34.000000,677.968,1067.02,590.001,
35.000000,688.036,1050.82,590.993,
36.000000,670.961,1055.92,598,
37.000000,677.25,1064.85,615.545,
38.000000,695.006,1052.96,638.036,
39.000000,713.04,1107.08,637.045,
40.000000,706.154,1094.14,646.984,
41.000000,700.967,1055.02,607.543,
42.000000,691.006,1036.01,623.912,
43.000000,691.052,1008.1,607.016,
44.000000,668.036,952.048,595,
45.000000,659.04,907.966,582.965,
46.000000,639.068,899.1,578.496,
47.000000,612.94,861.02,571.535,
48.000000,635.504,860.055,548.924,
49.000000,622.024,817.96,553.975,
50.000000,635.008,817.97,533.005,
51.000000,643.967,790.032,546.5,
52.000000,629.992,801.998,541.024,
53.000000,638.021,811.88,561.512,
54.000000,651.04,788.052,551.476,
55.000000,616.054,807.082,557.988,
56.000000,624.961,796.936,565,
57.000000,635.075,799.96,556.977,
58.000000,602.1,798.576,543.041,
59.000000,625.997,742.964,546.978,
60.000000,611.963,718.104,521,
61.000000,598.028,727.94,524.981,
62.000000,602.942,703.012,542.048,
63.000000,623.006,687.945,521.969,
64.000000,618.02,679.004,514.961,
65.000000,628.008,676.054,497.972,
66.000000,602.064,660,508.976,
67.000000,646.968,659.954,521,
68.000000,579.482,651.028,510.032,
69.000000,581.58,646.041,522.024,
70.000000,573.528,666.032,510.042,
71.000000,580.012,659.932,508,
72.000000,561.032,690,499.992,
73.000000,578.058,655.047,505.524,
74.000000,558.46,630.974,498,
75.000000,592.462,624.994,498.036,
76.000000,593.048,643.064,481,
77.000000,578.032,625.992,502.968,
78.000000,602.031,622.045,501.5,
79.000000,618.988,601.112,504.99,
80.000000,662.94,608.059,493.952,
81.000000,664.136,620.096,487.49,
82.000000,672.904,601.94,487.008,
83.000000,660.064,598.972,466,
84.000000,676.935,570.96,483.996,
85.000000,620.874,589.965,479.538,
86.000000,623.099,579.036,481.992,
87.000000,607.035,596.028,471.5,
88.000000,596.048,596.008,482.53,
89.000000,611.93,590.6,496.55,
90.000000,591.018,567.968,485.512,
91.000000,626.986,573.996,474.52,
92.000000,613.968,566.992,470,
93.000000,617.067,577,469.98,
94.000000,632.022,575.044,481.98,
95.000000,630.979,576.945,481.024,
96.000000,612.956,579.987,468.976,
97.000000,655.964,553.05,453.98,
