Frame number,1000000000,
0.000000,437.007,
1.000000,416.988,
2.000000,412.004,
3.000000,424,
4.000000,440.012,
5.000000,440.003,
6.000000,452.988,
7.000000,455,
8.000000,457,
9.000000,449.982,
10.000000,461.008,
11.000000,457.994,
12.000000,435.998,
13.000000,443.988,
14.000000,437.003,
15.000000,432.007,
16.000000,426.497,
17.000000,434.496,
18.000000,431.004,
19.000000,426.988,
20.000000,424.005,
21.000000,429.008,
22.000000,423.512,
23.000000,430.52,
24.000000,443.504,
25.000000,436,
26.000000,430.008,
27.000000,435.995,
28.000000,436.001,
29.000000,433,
30.000000,434.004,
31.000000,433.99,
32.000000,432.008,
33.000000,427.01,
34.000000,420.004,
35.000000,429.997,
36.000000,431.005,
37.000000,428.502,
38.000000,426.996,
39.000000,422.505,
40.000000,427.997,
41.000000,423,
42.000000,434.996,
43.000000,427.506,
44.000000,422.004,
45.000000,431,
46.000000,429.5,
47.000000,430.999,
48.000000,427.995,
49.000000,431.99,
50.000000,425.02,
51.000000,428,
52.000000,425.01,
53.000000,424,
54.000000,430.006,
55.000000,415.992,
56.000000,420.011,
57.000000,424.002,
58.000000,418.986,
59.000000,433.014,
60.000000,425.003,
61.000000,430.008,
62.000000,427.01,
63.000000,425.496,
64.000000,426.008,
65.000000,419.008,
66.000000,424.004,
67.000000,429.996,
68.000000,416.016,
69.000000,423.009,
70.000000,420.002,
71.000000,425.988,
72.000000,416.007,
73.000000,426.992,
74.000000,422,
75.000000,413.996,
76.000000,428.01,
77.000000,424.996,
78.000000,426.008,
79.000000,416.009,
80.000000,417.99,
81.000000,419.005,
82.000000,418.998,
83.000000,423,
84.000000,425.002,
85.000000,419.996,
86.000000,425,
87.000000,421.988,
88.000000,418.014,
89.000000,418.006,
90.000000,421.008,
91.000000,423.004,
92.000000,420.008,
93.000000,421.002,
94.000000,421.01,
95.000000,420.002,
96.000000,421.008,
