Frame number,1000000000,1000000001,1000000002,
0.000000,927.464,827.251,814.352,
1.000000,978.564,832.255,721.698,
2.000000,1195.29,1155.91,930.482,
3.000000,1267.97,1553.06,1216.34,
4.000000,1660.84,1659.35,1462.7,
5.000000,1738.33,1641.35,1402.31,
6.000000,1441.9,1106.5,1353.01,
7.000000,1077.89,1129.81,1206.65,
8.000000,1034.12,830.353,996.408,
9.000000,1038.1,933.422,908.4,
10.000000,957.24,930.64,803.304,
11.000000,865.048,708.805,727.122,
12.000000,759.52,762.228,673.092,
13.000000,726.14,698.325,662,
14.000000,623.342,674.65,604.978,
15.000000,606.4,636.537,578.996,
16.000000,632.783,605.268,565.039,
17.000000,634.254,596.899,590.812,
18.000000,643.392,670.842,648.15,
19.000000,753.96,735.345,711.945,
20.000000,804.122,843.919,834.532,
21.000000,1048.67,922.48,965.549,
22.000000,1082.08,1181.21,986.064,
23.000000,1016.86,1156.23,963.166,
24.000000,1000.94,1119.73,933.976,
25.000000,1059.29,1111.41,881.488,
26.000000,975.013,964.456,794.84,
27.000000,901.913,864.125,716.304,
28.000000,804.176,783.06,665.744,
29.000000,724.84,685.977,621.16,
30.000000,710.976,668.563,569.854,
31.000000,653.084,613.665,565.056,
32.000000,635,615.695,549.889,
33.000000,664.68,583.01,544.926,
34.000000,660.36,596.456,537.992,
35.000000,727.802,588.98,560.08,
36.000000,759.979,600.714,561.04,
37.000000,840.022,636.654,619.124,
38.000000,973.5,656.89,695.072,
39.000000,1101.14,744.654,828.056,
40.000000,738.234,799.647,906.988,
41.000000,747.572,778.242,924.422,
42.000000,1163.78,767.736,833.336,
43.000000,930.1,753.727,771.48,
44.000000,911.833,723.322,707.492,
45.000000,662.142,697.239,651.048,
46.000000,605.909,660.222,657.072,
47.000000,628.106,597.189,588.124,
48.000000,588.905,571.04,541.92,
49.000000,586.85,559.178,538.6,
50.000000,579.22,554.916,523.979,
51.000000,560.072,543.112,519,
52.000000,656.02,576.115,524.904,
53.000000,644.044,558,521.059,
54.000000,667.86,613.32,548,
55.000000,791.079,640.818,568.848,
56.000000,870.48,664.808,677.924,
57.000000,898.625,759.66,740.632,
58.000000,879.78,731.745,793.072,
59.000000,780.534,818.253,754.74,
60.000000,734.925,850.614,761.732,
61.000000,813.267,739.521,735.872,
62.000000,630.81,691.321,647.518,
63.000000,642.915,626.138,646.6,
64.000000,628.156,603.7,573.1,
65.000000,591.952,582.87,566.065,
66.000000,559.102,540.075,543.068,
67.000000,571.044,555.072,529.986,
68.000000,555.126,552.021,526.034,
69.000000,573.952,550.983,502.995,
70.000000,570.88,525.032,531.046,
71.000000,653.88,562.023,520.95,
72.000000,720.186,587.096,551.002,
73.000000,810.558,638.971,582.146,
74.000000,863.046,675.764,640.97,
75.000000,826.382,726.908,694.144,
76.000000,803.274,690.235,691.608,
77.000000,781.287,689.224,708.336,
78.000000,736.456,685.734,675.932,
79.000000,649.711,611,616.985,
80.000000,640.13,617.4,598.256,
81.000000,627.918,591.822,600.592,
82.000000,605.492,577.944,545.094,
83.000000,569.01,565.048,532.912,
84.000000,598.066,602.148,531.957,
85.000000,566.975,564.032,545.906,
86.000000,586.166,556.144,531.044,
87.000000,625.12,558.056,502.084,
88.000000,618.272,565.48,527.05,
89.000000,693.278,570.04,561.1,
90.000000,744.035,601.944,570.916,
91.000000,788.72,652.468,596.024,
92.000000,763.055,660.344,628.124,
93.000000,804,620.192,629.106,
94.000000,704.724,618.44,619.098,
