Frame number,1000000000,1000000001,1000000002,
0.000000,723.052,610.894,652.88,
1.000000,783.844,742.976,699.076,
2.000000,1380.46,958.345,824.808,
3.000000,1817.47,1308.43,1023.88,
4.000000,1500.75,1314.7,1163.32,
5.000000,1431.16,1311.39,1189.29,
6.000000,1429.88,1238.06,1148.01,
7.000000,1409.36,1429.74,1157.91,
8.000000,1356.88,959.508,1031.93,
9.000000,1072.02,904.52,1004.86,
10.000000,924.072,873.138,882.88,
11.000000,967.85,847.096,807.292,
12.000000,804.96,675.515,701.99,
13.000000,737.14,635.08,719.859,
14.000000,690.116,605.96,664.05,
15.000000,678.908,630.08,638.039,
16.000000,698.904,638.208,609.943,
17.000000,668.085,619.836,658.985,
18.000000,715.072,664.06,724.944,
19.000000,777.883,793.008,744.941,
20.000000,921.184,886.944,808.87,
21.000000,996.811,944.088,884.128,
22.000000,990.08,929.522,847.9,
23.000000,1018.38,973.04,799.664,
24.000000,845.059,880.76,764.896,
25.000000,853.432,872.23,721.22,
26.000000,795.536,905.88,726.12,
27.000000,746.984,869.844,691.96,
28.000000,688.008,770.791,654.02,
29.000000,656.096,711.945,617.078,
30.000000,642.896,650.952,587.5,
31.000000,626,620.088,576.542,
32.000000,614.976,626.633,568.03,
33.000000,567.033,597.02,560.016,
34.000000,561.925,562.984,567.999,
35.000000,613.012,610.071,558,
36.000000,572.104,617.055,577.072,
37.000000,670.016,660.884,615.996,
38.000000,720.181,703.497,634.992,
39.000000,696.016,745.447,669.02,
40.000000,708,826.974,692.91,
41.000000,693.812,813.609,689.1,
42.000000,674.99,772.561,672.079,
43.000000,673.912,747.019,668.115,
44.000000,681.05,751.141,616.112,
45.000000,645.994,721.473,616.962,
46.000000,639.01,701.73,569.05,
47.000000,620.912,649.96,566.976,
48.000000,610.008,652.54,555.011,
49.000000,582.017,628.509,543.033,
50.000000,577.01,604.016,536.97,
51.000000,550.934,613.569,537.02,
52.000000,556.938,550.035,539.04,
53.000000,562.938,565.544,572,
54.000000,585.015,586.52,540.912,
55.000000,609.1,627.507,544.015,
56.000000,563.92,672.92,556.068,
57.000000,596.975,659.13,571.922,
58.000000,599.984,684.125,602.918,
59.000000,578.936,677.086,577.02,
60.000000,607.078,663.462,578.96,
61.000000,562.932,659.808,544.04,
62.000000,577.09,661.303,566.976,
63.000000,565.078,629.47,554.064,
64.000000,533.063,696.546,501.966,
65.000000,581.09,588.493,534.908,
66.000000,544.936,604.998,513,
67.000000,565.996,603.008,514.032,
68.000000,546,567.96,505.952,
69.000000,538.975,591.072,515.968,
70.000000,557.06,603.11,495.032,
71.000000,566,557.44,520.046,
72.000000,539.976,589.013,516,
73.000000,552.996,590.498,538.999,
74.000000,594.96,595.548,518.01,
75.000000,569,611.917,532.444,
76.000000,553.512,594.033,522.492,
77.000000,559.4,597.04,534.96,
78.000000,578.996,632.93,564.524,
79.000000,561.5,614.519,529.014,
80.000000,582.56,632.027,521.963,
81.000000,584.49,624.512,534.48,
82.000000,568,588.562,538.036,
83.000000,545.504,592.04,532.92,
84.000000,538.98,586.568,505.52,
85.000000,554.9,565.06,529.94,
86.000000,532.05,573.052,508.016,
87.000000,526.03,550.096,513.988,
88.000000,518.484,546.955,505.996,
89.000000,512.05,567.065,517.964,
90.000000,527.524,575.979,514.925,
91.000000,513.1,569.974,527.076,
92.000000,555.106,580.49,515.928,
93.000000,532.512,561.028,542.98,
94.000000,533.008,579.914,526.008,
