Frame number,1000000000,1000000001,1000000002,
0.000000,3594.13,2480.24,2232.24,
1.000000,3452.37,2768.65,2601.89,
2.000000,3945.43,3284.22,3197.55,
3.000000,4145.93,3312.72,3359.2,
4.000000,4291.31,2981.7,3390.46,
5.000000,4777.93,3160.94,3091.16,
6.000000,4187.04,3228.98,2931.79,
7.000000,3610.1,2924.09,2648,
8.000000,3379.96,2996.82,2401.28,
9.000000,2947.7,2779.17,2174.77,
10.000000,2801.78,2709.56,2005.93,
11.000000,2675.77,2470.5,1810.49,
12.000000,2662.56,2396.56,1781,
13.000000,2499,2263.9,1749.02,
14.000000,2217.59,2225.12,1629,
15.000000,2085.29,2167.48,1618.06,
16.000000,2023.11,2131.33,1553.68,
17.000000,1966.58,2220.61,1674.26,
18.000000,2087.92,2441.67,1756.77,
19.000000,2092,2462.75,1891.15,
20.000000,2157.78,2546.95,2054.23,
21.000000,2187.33,2581.5,1993.37,
22.000000,2186.7,2552.39,2027.14,
23.000000,2065.59,2370.5,1895.35,
24.000000,1959.24,2058,1762.12,
25.000000,1895.68,1899.2,1712,
26.000000,1818.25,1838.7,1532.18,
27.000000,1700.58,1786.1,1505.25,
28.000000,1675.36,1692.79,1316.23,
29.000000,1617.36,1526.01,1303.98,
30.000000,1546.65,1579.04,1282.1,
31.000000,1488,1336.74,1257.01,
32.000000,1511.84,1432.99,1280,
33.000000,1460.07,1305.91,1248.91,
34.000000,1467.82,1407.95,1291.72,
35.000000,1472.16,1520.12,1316.76,
36.000000,1568.24,1777.35,1469.32,
37.000000,1622.16,1908.75,1486.23,
38.000000,1708.27,1836.34,1584.05,
39.000000,1651.7,1854.01,1607.2,
40.000000,1634.2,1668.24,1556.93,
41.000000,1545.99,1607.03,1540.03,
42.000000,1501.24,1503.62,1535.99,
43.000000,1418.15,1424.12,1393.2,
44.000000,1383.82,1356.11,1352.02,
45.000000,1277.04,1270.02,1257.86,
46.000000,1289.17,1144.02,1227.09,
47.000000,1231.98,1152.7,1257.94,
48.000000,1190.99,1116.85,1212.98,
49.000000,1186.9,1030.81,1213.9,
50.000000,1147.99,1061.5,1167.16,
51.000000,1102.08,1071,1201.81,
52.000000,1205.12,1050.09,1230.86,
53.000000,1288.14,1210.88,1286.23,
54.000000,1311,1264.84,1385.08,
55.000000,1450.64,1328.25,1419.51,
56.000000,1513.76,1402.81,1436.86,
57.000000,1477.8,1355.84,1612.94,
58.000000,1415.9,1286.87,1465.92,
59.000000,1340.96,1245.92,1407.66,
60.000000,1283.18,1246.25,1358.96,
61.000000,1121.9,1144.19,1239.08,
62.000000,1059.27,1035.81,1227.81,
63.000000,1024.79,963.854,1144.68,
64.000000,978.201,926.856,1169.09,
65.000000,960.282,932.888,1082.96,
66.000000,931.961,907.02,1080.12,
67.000000,925.032,945.08,1061.89,
68.000000,927.08,968.117,995.251,
69.000000,888.998,933.12,1068.03,
70.000000,949.88,991.04,1008.15,
71.000000,1028.87,1003.02,1059.18,
72.000000,1045.97,999.908,1137,
73.000000,1045.5,1078.92,1148.86,
74.000000,1094,1079.19,1066.97,
75.000000,1076,1019.2,1072.02,
76.000000,1054,1028.08,1086.94,
77.000000,1014.9,979.068,1098,
78.000000,957,956.904,1053.87,
79.000000,958.92,920.969,1011.83,
80.000000,954,886.916,982,
81.000000,864.02,871.97,922.932,
82.000000,873.848,803.902,954.848,
83.000000,872.896,796.05,881.08,
84.000000,867.92,797.14,887.056,
85.000000,825,762.035,828.052,
86.000000,830,789.1,833.014,
87.000000,807.852,793.086,823.851,
88.000000,803,817.96,844.104,
89.000000,819,804.146,847.208,
90.000000,881.06,908.04,833.016,
91.000000,927.06,891.204,843.12,
92.000000,938.016,963.928,854.06,
93.000000,909,943.02,843.86,
