Time [ms],1000000000,
0,473.986,
1000000000,435.001,
2000000000,433.956,
3000000000,419,
4000000000,428.018,
5000000000,433.026,
6000000000,430.996,
7000000000,426.008,
8000000000,442.992,
9000000000,424.976,
10000000000,431.986,
11000000000,427.016,
12000000000,428.046,
13000000000,424.01,
14000000000,421.016,
15000000000,429.984,
16000000000,427.02,
17000000000,423,
18000000000,421.984,
19000000000,420.964,
20000000000,429.02,
21000000000,415,
22000000000,431.017,
23000000000,431.998,
24000000000,431.012,
25000000000,423.01,
26000000000,426.98,
27000000000,431.008,
28000000000,435.982,
29000000000,425.014,
30000000000,422,
31000000000,422.96,
32000000000,420.994,
33000000000,417.998,
34000000000,413.018,
35000000000,425.003,
36000000000,419.995,
37000000000,425.98,
38000000000,423.972,
39000000000,427.04,
40000000000,426.992,
41000000000,420.032,
42000000000,415.011,
43000000000,424.006,
44000000000,427.028,
45000000000,425.968,
46000000000,423.005,
47000000000,425.003,
48000000000,422.032,
49000000000,416.968,
50000000000,417.008,
51000000000,413.948,
52000000000,414.968,
53000000000,414.972,
54000000000,419.007,
55000000000,419.025,
56000000000,424.028,
57000000000,425.98,
58000000000,412.982,
59000000000,420.032,
60000000000,426.016,
61000000000,414.01,
62000000000,424.024,
63000000000,417.968,
64000000000,422.03,
65000000000,419.994,
66000000000,422.989,
67000000000,413.019,
68000000000,411.982,
69000000000,415.01,
70000000000,415.038,
71000000000,421.02,
72000000000,416.996,
73000000000,418.025,
74000000000,421.018,
75000000000,417.012,
76000000000,410.022,
77000000000,426.015,
78000000000,421.994,
79000000000,425.987,
80000000000,417,
81000000000,415.028,
82000000000,414.956,
83000000000,417.018,
84000000000,415.994,
85000000000,415.968,
86000000000,422.001,
87000000000,417.012,
88000000000,421.988,
89000000000,422.02,
90000000000,411.992,
91000000000,418.98,
92000000000,416.989,
93000000000,413.996,
94000000000,424.025,
95000000000,416.018,
