Time [ms],1000000000,1000000001,1000000002,1000000003,
0,1497.2,1512.71,1265.92,1059.99,
1000000000,1297.37,1104.5,995.875,1074.19,
2000000000,1384.53,1084.5,1125.87,1084.75,
3000000000,1547,1041.21,1085.14,1123.97,
4000000000,1661.39,1188.26,1169.22,1168,
5000000000,1666.58,1408.37,1342.35,1268.22,
6000000000,1730.07,1973.4,1432.56,2000.15,
7000000000,1819.77,1977.86,1563.8,2190.3,
8000000000,1871.22,1746.82,2048.67,1716.66,
9000000000,1870.34,1632.02,1787.51,1365.93,
10000000000,1786.86,1494.96,1473,1298.47,
11000000000,1673.09,1365.84,1300,1184.05,
12000000000,1442,1231.92,1161.2,1125.13,
13000000000,1373.88,1150.93,1075.2,1082.61,
14000000000,1319.13,1159.87,1100.17,1091.16,
15000000000,1276.95,986.412,930.984,1064,
16000000000,1236.06,938.468,1001.14,1109.7,
17000000000,1257.3,1100.98,1043.84,1179.88,
18000000000,1311,1130.76,1044.94,1250.53,
19000000000,1326.73,941.032,1202.58,1403.12,
20000000000,1311,1229.24,1449.61,1378.9,
21000000000,1358.5,1340.82,1727,1569.06,
22000000000,1330,1340.76,1510.96,1566.88,
23000000000,1201,1249.02,1679.67,1412.76,
24000000000,1236.12,1399.59,1477.2,1331.39,
25000000000,1199.1,1465.56,1293.4,1340.07,
26000000000,1298.18,1519,1299.68,1219.16,
27000000000,1238.36,1476.77,1282.99,1164.87,
28000000000,1282.92,1309.1,1167.28,1119.85,
29000000000,1197.5,1242.92,1144.14,1083.19,
30000000000,1196.17,1268.82,1036.95,1079.55,
31000000000,1081.52,1290.93,1056.1,1050.83,
32000000000,1096.15,1246.02,971.56,1009.07,
33000000000,1028.14,1175.25,1013.92,1006.25,
34000000000,998.058,1175.79,971.184,1033.91,
35000000000,1036.02,1135.16,1010,1053.51,
36000000000,979.93,990.264,1040.5,1163.2,
37000000000,959.99,1011.01,1095.78,1100.7,
38000000000,989.184,1094.91,1111.81,1227.42,
39000000000,976.872,1038.76,1151.84,1209,
40000000000,1038.49,1081.08,1118.09,1194.16,
41000000000,1000.52,1115.99,1195.52,1188,
42000000000,1065.64,1097.9,1201.13,1062.7,
43000000000,1036.42,1111.1,1185.99,1184.21,
44000000000,1037.8,1100.98,1234.18,1163.91,
45000000000,1076.89,1070.08,1144.28,1142.37,
46000000000,1045.37,1068.06,1122.83,966.096,
47000000000,1110.01,1094.25,1182.78,974.92,
48000000000,1067.93,1080.12,1212.07,945.28,
49000000000,1103,1016.76,1177.15,890.912,
50000000000,1034.18,1067.76,1182.6,945.208,
51000000000,1023.04,1058.79,1116.34,883,
52000000000,1033.05,1019.83,1051.25,857.528,
53000000000,1000.24,1048.22,1103.96,834.834,
54000000000,1018.64,1006.31,1043.14,781.786,
55000000000,948.017,998,925.965,849.944,
56000000000,975.99,994.072,952.268,842.528,
57000000000,924.95,984.3,968.96,926.984,
58000000000,891.868,882.072,964.12,914.04,
59000000000,926.131,920,983.952,890.854,
60000000000,989.948,888.552,961.97,833.5,
61000000000,940.927,907,995.228,952.85,
62000000000,968.891,948.832,1015.2,865.424,
63000000000,921.82,900.176,1000.34,818.008,
64000000000,954.022,896.82,1052.1,869.94,
65000000000,984.054,914,1008.7,840.87,
66000000000,972.097,928.232,1005.09,890.646,
67000000000,969.119,892.044,986.03,839.914,
68000000000,956.054,889.84,976.13,864.465,
69000000000,975.12,924.58,999.2,835.9,
70000000000,939,860.548,926.196,770.873,
71000000000,929.832,851.924,986.112,810.876,
72000000000,974.16,843,932.104,804.704,
73000000000,915.02,889.148,930.032,855.592,
74000000000,887.024,874.544,934.144,818.976,
75000000000,916.554,855.46,896.136,879,
76000000000,882.448,844.072,880.108,826.88,
77000000000,861.984,813.38,914.98,820.84,
78000000000,851.502,784.488,908.986,839.146,
79000000000,832.05,810.592,896.872,819.208,
80000000000,832.088,824.22,816.912,851.22,
81000000000,837.568,800.03,865.036,777.88,
82000000000,839.572,786.188,894.002,804.232,
83000000000,821.582,835.068,890.032,805.03,
84000000000,823.54,804.06,844.996,780.85,
85000000000,828.52,816,840.064,783.96,
86000000000,807.528,814.1,856.9,761.732,
87000000000,835.448,802.072,911.04,825.456,
88000000000,847.974,802.28,911.044,762.584,
89000000000,818.004,811.92,889.104,760.608,
90000000000,832.904,773.11,885.029,739.896,
91000000000,806.018,791.232,932.14,752.904,
92000000000,820.876,778,865.08,744.992,
93000000000,792.952,808.116,883.92,735.908,
94000000000,829.04,787,896.859,741.12,
