Frame number,1000000000,1000000001,1000000002,1000000003,1000000004,1000000005,1000000006,
0.000000,977.904,848.48,864.04,778.04,872.68,1199.22,814.951,
1.000000,833.592,860.67,630.732,801.886,823.56,961.555,784.074,
2.000000,841.536,714.97,668.076,769.832,836.784,834.768,703.182,
3.000000,811.036,674.248,777.089,770.736,959.124,767.91,640.063,
4.000000,777.496,604.048,687.756,711.744,979.68,668.804,670.025,
5.000000,685.952,537.024,611.974,685.222,765.168,646.764,621.572,
6.000000,733.5,517.524,647.3,823.8,761.381,617.088,611.52,
7.000000,645.09,529.49,571.872,723.16,708.178,643.888,559.326,
8.000000,620.128,483.112,606.084,706.019,636.852,545.892,583.1,
9.000000,591.054,467.072,582.005,661.12,648.6,527.515,547.584,
10.000000,599.992,488.986,548.15,569.941,616.023,530.947,526.576,
11.000000,569.852,490.128,594.007,597.947,564.893,530.025,543.99,
12.000000,535.048,488.89,534.054,597.964,602.804,543.01,542.52,
13.000000,563.984,510.1,498.048,637.118,640.07,567,566.096,
14.000000,602,544.88,524.92,775.494,760.074,667.92,660.52,
15.000000,671.072,592.848,568.144,858.096,843.929,770.04,802.492,
16.000000,680.972,623.73,674.155,1195.86,998.76,835.192,836.844,
17.000000,736.856,598.084,731.22,1305.68,1133.7,965.627,923.203,
18.000000,746.962,650.876,779.88,1156.15,1055.83,850.299,850.847,
19.000000,718.959,633.059,762.736,1065.66,1123.12,759.218,820.863,
20.000000,685.999,661.116,696.766,950.88,1092.75,721.995,723.872,
21.000000,650.04,628.25,678.158,775.037,975.018,767.77,661.996,
22.000000,601.893,667.96,635.047,686.904,897.002,721.748,598.966,
23.000000,555.072,633.2,646.98,657.92,767.908,599.875,553.983,
24.000000,561.456,612.037,600.032,609.96,741.152,611.544,519.004,
25.000000,520.973,519.936,557.982,532.474,644.934,579.494,491.11,
26.000000,518.068,528.095,523.134,531.06,588.075,560.063,520.464,
27.000000,506.096,536.03,494.97,531.976,582.976,530.664,491.056,
28.000000,488.958,547.878,516.02,528.4,587.956,548.18,506.992,
29.000000,517.048,578.162,482.92,609.536,656.843,536.104,525.96,
30.000000,575.084,638.992,515.104,637.912,730,630,581.052,
31.000000,642.98,757.124,563.995,726.866,845.897,680.842,694.064,
32.000000,738.066,715.9,673.035,898.746,966.82,708.07,802.228,
33.000000,764.042,794.28,795.138,1022.75,944.688,722.136,860.06,
34.000000,794.1,773.045,803,845.447,876.682,705.114,897.944,
35.000000,820.948,749.132,922.692,931.386,805.952,740.107,784.35,
36.000000,782.12,717.384,924.216,839.827,778.288,698.974,739.054,
37.000000,755.48,649.002,873.835,734.026,818.59,762.048,689.029,
38.000000,659.957,640.14,767.719,630.837,745.65,676.6,599.926,
39.000000,610.07,616.073,737.175,591.072,667.737,658.03,581.055,
40.000000,593.917,553.088,621.724,575.072,606.025,549.1,537.973,
41.000000,532.951,527.099,583.224,524.118,550.194,555.788,489.864,
42.000000,545.083,515.08,551.83,532,524.084,549.1,507.066,
43.000000,490.951,518.11,527.906,502.488,520.028,530.504,502.053,
44.000000,488.1,569.08,558.25,556.02,586.902,553.04,503.996,
45.000000,520.996,606.964,531.512,573.168,665.075,556.956,547.176,
46.000000,585.606,737.23,545.92,690.084,916.953,672.86,659.13,
47.000000,626.984,793,585.93,902.864,1250.95,841.071,659.064,
48.000000,759.87,815.096,642.068,1191.34,1321.74,852.72,756.92,
49.000000,780.018,830.219,767.094,1330.8,1241.82,906.908,837.176,
50.000000,797.68,693.911,852.936,898.099,900.154,714.078,835.101,
51.000000,755.369,617.104,954.868,851.239,794.4,681.792,852.94,
52.000000,690.024,684.04,940.172,964.167,706.06,646.79,736.032,
53.000000,621.136,641.612,857.986,817.996,630.492,619.024,725.088,
54.000000,621.088,575.52,844.92,719.824,575.046,618.148,586.496,
55.000000,573.957,537.979,739,624.04,532.553,554.094,572,
56.000000,522,516.55,659.016,568.089,509.008,523.847,544.984,
57.000000,512.912,520.035,624.164,535.056,525.98,495.947,522.958,
58.000000,499.48,519.978,564.933,529.016,502.985,521.986,491.074,
59.000000,531.05,559.008,538.934,518.912,508.062,497.48,497.019,
60.000000,548.88,648.84,546.952,558.069,544.058,540.965,481.098,
61.000000,600.858,685.526,580.008,658.044,624.868,607.135,507.978,
62.000000,676,729.15,579.844,776.824,788,694.946,578.508,
63.000000,686.08,847.8,624.888,1020.12,814.196,785.02,672.584,
64.000000,719.528,825.78,668,1029.01,900.268,828.108,737.874,
65.000000,710.04,896.202,744,1061.19,952.136,818.054,799.99,
66.000000,714.416,830.792,830.76,987.778,971.076,716.012,782.798,
67.000000,679.528,687.104,842,992.114,872.16,695.536,748.892,
68.000000,682.56,628.784,858.784,899.117,718.96,655.944,711.896,
69.000000,632.982,618.13,787.872,750.008,654.125,624.532,668.86,
70.000000,587.97,583.856,823.136,694.99,585.984,561.022,650.12,
71.000000,524.033,574.914,755.791,625.064,578.08,521.949,608.872,
72.000000,507.97,522.951,697,582.903,532.954,493.1,557.833,
73.000000,537.096,509.125,656.904,544.94,505.556,503.527,540.07,
74.000000,521.996,539.116,565.14,561.964,550.008,514.528,500.95,
75.000000,592.056,542.95,556.04,561.976,605.576,573.156,491.944,
76.000000,673.168,686.957,545.019,696.95,661.088,590.932,488.032,
77.000000,634.334,694.2,556.068,706.035,837.2,631.654,543.12,
78.000000,837.036,831.252,601.919,904.978,1008.16,746.856,595.862,
79.000000,895.822,871,670.875,1071.29,1049.56,869,674.034,
80.000000,860.188,793.868,751.262,765.536,1045,837.62,745.04,
81.000000,822,745.612,741.862,818.16,973.696,971.975,778.56,
82.000000,756,755.047,739.176,796.15,815.384,790.118,835.895,
83.000000,627.944,703.997,727.106,846.74,723.856,681.88,731.902,
84.000000,585.884,619.158,746.096,705.404,654.893,621.972,656.06,
85.000000,554.93,608.12,726.948,641.7,573.045,584.642,617.154,
86.000000,500.075,577.933,690.988,607.52,540.06,524.593,573.914,
87.000000,487.987,534.922,679.48,577.025,502.117,510.968,567.063,
88.000000,485.479,506.984,681.02,533.504,520,491.42,519.84,
89.000000,505.96,505.016,601.656,507.001,544.018,496.544,506.975,
90.000000,581.899,493.895,607.888,547.472,570.067,532.042,497.015,
91.000000,659.872,545.56,560.584,612.938,636.985,603.864,483.056,
92.000000,789.975,621.058,589.024,719.52,839.898,666.928,485.904,
93.000000,871.804,696,614.884,904.2,949.088,707.872,519.978,
94.000000,1009.91,796,671,1125.8,938.25,845.922,550.992,
