Frame number,1000000000,1000000001,1000000002,1000000003,
0.000000,1141.64,1680.09,1226.52,1656.34,
1.000000,856.327,1113.88,819.602,1086.87,
2.000000,784.574,903.55,806.18,985.195,
3.000000,854.32,748.09,879.96,945.624,
4.000000,926.776,896.912,983.26,844.8,
5.000000,960.028,1064.34,763.792,734.987,
6.000000,979.752,867.031,843.735,739.972,
7.000000,1026.21,967.637,735.136,785.368,
8.000000,911.2,1099.74,744.933,668.768,
9.000000,878.616,851.518,837.4,729.96,
10.000000,800.744,652.192,805.862,762.7,
11.000000,743.772,629.24,725.823,754.52,
12.000000,691.71,594.455,571.074,725.289,
13.000000,655.98,673.388,557.101,708.028,
14.000000,632.336,607.88,536.214,636.65,
15.000000,728.824,599.02,543.88,713.409,
16.000000,784.25,641.23,630.716,799.007,
17.000000,952.932,695.296,570.804,863.838,
18.000000,1042.29,683.59,637.667,1067.57,
19.000000,1039.3,813.996,716.222,1241.12,
20.000000,1098.5,940.906,781.916,1190.13,
21.000000,1172.11,865.175,821.132,1260.65,
22.000000,1199,768.8,791.54,1241.29,
23.000000,1134.91,760.832,767.056,1164.73,
24.000000,1112.33,751.78,697,982.93,
25.000000,801.91,659.98,636.444,849.095,
26.000000,662.966,554.44,635.164,807.968,
27.000000,660.4,492.72,639.042,781.136,
28.000000,597.168,601.015,548.006,624.09,
29.000000,602.031,502.98,545.938,563.365,
30.000000,575,497.975,606.06,527.556,
31.000000,591.125,561.15,542.938,543.704,
32.000000,565.034,537.024,628,580.021,
33.000000,655.868,509.26,652.847,581.168,
34.000000,759.903,530.446,718.728,679.22,
35.000000,763.726,672.866,656.074,787.708,
36.000000,854.935,730.928,850.4,873.782,
37.000000,1002.64,709.004,918.504,804.75,
38.000000,1012.43,662.186,802.115,904.356,
39.000000,997.492,541.139,800.029,798.1,
40.000000,874.384,570.08,785.998,764.768,
41.000000,793.201,561.976,734.75,702.956,
42.000000,754.675,612.12,677.024,630.45,
43.000000,662.01,581.2,597.68,635.01,
44.000000,640.232,600.194,543.584,617.923,
45.000000,600.21,569.088,517.65,571.01,
46.000000,556.062,573.088,538.12,571.228,
47.000000,561.494,517.808,489.857,559.16,
48.000000,538.7,515.031,509.028,566.012,
49.000000,560.25,542.1,514.256,629.01,
50.000000,576.382,531.006,501.49,643.291,
51.000000,623.412,589.218,510.486,700.391,
52.000000,751.064,624.432,535.608,753.016,
53.000000,895.752,710.177,603,853.888,
54.000000,899.96,797.848,710.075,909.148,
55.000000,911.4,692.864,808.105,910.12,
56.000000,846.128,692.2,760.9,856.32,
57.000000,923.655,669.47,735.619,783.88,
58.000000,792.656,624.1,721.706,740.491,
59.000000,779.13,594.33,643.534,686.8,
60.000000,709.62,522.151,627.025,662.932,
61.000000,632.378,484.997,602.807,615.06,
62.000000,639.066,482.156,613.041,624.196,
63.000000,630.096,479.9,577.074,613.12,
64.000000,597.906,481.925,551,628.768,
65.000000,585.854,459.86,557.88,532.974,
66.000000,528.107,463.927,587.884,580.942,
67.000000,568.112,498.048,611.84,628.236,
68.000000,632.727,521.081,722.029,633.193,
69.000000,650.998,559.824,813.12,664.912,
70.000000,676.227,599.828,797.857,858.856,
71.000000,730.032,615.094,852.6,883.124,
72.000000,769.375,746.404,890.688,851.14,
73.000000,779.9,680.47,818.424,800.888,
74.000000,766.036,687.248,847.34,779.21,
75.000000,725,680.424,751.07,680.763,
76.000000,724.28,599.352,693.713,657.032,
77.000000,687.101,617.986,648.013,673.4,
78.000000,634.017,554.227,631.842,619.178,
79.000000,619.474,595.225,593.951,675.884,
80.000000,621.264,538.106,592.12,692.78,
81.000000,621.612,541.937,608.968,717.008,
82.000000,669.864,573.078,641.144,769.398,
83.000000,680.081,555.277,755.965,856.05,
84.000000,718.43,583.154,846.412,901.084,
85.000000,729.355,660.969,953.7,913.905,
86.000000,720.183,758.068,989.97,867.339,
87.000000,752,812.432,950.76,907.16,
88.000000,668.002,806.08,845.484,911.871,
89.000000,638.232,871.35,850.572,760.875,
90.000000,666.578,834.806,744.509,745.912,
91.000000,636.536,747.68,785.01,933.76,
92.000000,688.272,747.215,740.92,756.83,
93.000000,652.948,706.56,683.678,755.57,
94.000000,622.755,659.984,679.141,713.706,
95.000000,664.422,645.218,651.112,776.13,
