Time [ms],1000000000,1000000001,1000000002,1000000003,
0,1612.5,4283.57,2350.79,2711.54,
1000000000,2079.9,3618.73,1727.8,2493.04,
2000000000,4342.45,3866.68,2006.59,2685.49,
3000000000,6538.52,3710.22,3630.13,3796.42,
4000000000,7467.75,4568.62,3407.39,3740.45,
5000000000,6982.39,4451.29,2183.53,3419.44,
6000000000,5963.43,4551.27,4535.87,3510.95,
7000000000,5154.96,4422.21,4139.69,3050.11,
8000000000,4286.58,4169.65,3806.16,2868.73,
9000000000,3843.38,3798.7,3591.19,2737.78,
10000000000,3197.32,3368.28,3364.25,2526.17,
11000000000,2826.09,3186.1,3367.33,2393.27,
12000000000,2596.34,2714.79,3130.26,2242.06,
13000000000,2381.14,2597.34,2675.38,2126.66,
14000000000,2019.77,2517.88,2184.27,2050.08,
15000000000,2041.02,2318.35,1800.63,1946.8,
16000000000,2065.28,2264.71,1695.54,1922.16,
17000000000,2265.24,2290.29,1726.85,2063.16,
18000000000,2878.99,2386.62,2094.2,2057.92,
19000000000,3319.29,2529.97,1977.97,2214.77,
20000000000,3247.15,2477.27,2417.12,2109.9,
21000000000,3053.57,2257.02,2062.83,2164.21,
22000000000,2917.39,2336.76,2356.64,2202.87,
23000000000,2632.75,2484.48,2376.77,2128.12,
24000000000,2503.02,2464.4,2244.75,1886.8,
25000000000,2258.09,2344.2,2188.28,1846.08,
26000000000,2076.16,2142.06,1968.21,1774.08,
27000000000,1888.14,1970.82,1865.23,1685.13,
28000000000,1782.54,1891.85,1678.77,1597.21,
29000000000,1683.99,1798.1,1579.01,1462.49,
30000000000,1534.37,1645.94,1482.33,1422.99,
31000000000,1553.49,1504.18,1406.11,1444.84,
32000000000,1649.74,1469.02,1331.75,1467.06,
33000000000,1840.76,1500.92,1424.22,1568.49,
34000000000,1905.28,1598.02,1433.09,1479.13,
35000000000,1894.8,1599.22,1353.03,1556.41,
36000000000,1808.1,1519.98,1326.03,1576.48,
37000000000,1935.43,1505.81,1370.2,1578.33,
38000000000,1919.4,1604.78,1381.92,1445.06,
39000000000,1786.5,1646.98,1373.04,1413.16,
40000000000,1653.34,1624.83,1367.02,1321.02,
41000000000,1486.2,1541.99,1302.07,1289.98,
42000000000,1394.14,1442.8,1237.02,1248.01,
43000000000,1331.1,1445.14,1162.94,1177.99,
44000000000,1243.05,1326.96,1133.13,1135.96,
45000000000,1189.02,1293.93,1033,1148.94,
46000000000,1206.52,1211.99,1013.1,1128.45,
47000000000,1297.13,1127,984.044,1132.17,
48000000000,1430.9,1156.98,1012.96,1259,
49000000000,1497.01,1232.06,996.91,1311.06,
50000000000,1472.01,1240.94,1026.06,1179.06,
51000000000,1468.2,1256.09,974.84,1179.13,
52000000000,1372.15,1234.03,946.92,1229.88,
53000000000,1353.13,1186.89,980.948,1221.03,
54000000000,1277.07,1263.93,1060.1,1182.98,
55000000000,1185.04,1365.52,1074.89,1118.87,
56000000000,1130.09,1299.01,1069.9,1103.06,
57000000000,1071.96,1203.15,969.106,1109.91,
58000000000,1029.45,1106,988.916,1074.92,
59000000000,990.064,1114.91,939.88,1088.92,
60000000000,968.882,1089.92,899.1,1044.91,
61000000000,1031.11,1007.04,885.488,1042.96,
62000000000,1057.03,1012.07,839.94,972.992,
63000000000,1104.9,954.04,885.556,972.948,
64000000000,1203,950.076,912.125,1004.1,
65000000000,1192.97,1032.1,946.88,1012.9,
66000000000,1151.05,965.83,984.08,998.104,
67000000000,1139.96,1026.09,965,1168.12,
68000000000,1119.04,1028.07,948.064,1085.89,
69000000000,1059.08,1013.04,988.104,1094.98,
70000000000,1048.1,1025,979.15,1053.18,
71000000000,1035.98,1006.1,987.072,1055.05,
72000000000,935.064,1034.07,973.896,1030.96,
73000000000,935.992,981.11,947.946,1031,
74000000000,886.872,941.08,866.08,1012.94,
75000000000,856.952,945.016,915.942,1012,
76000000000,892,917.968,822.968,968.5,
77000000000,886.02,885.07,789,915.94,
78000000000,937,881.404,828.125,1001.62,
79000000000,994.304,875.964,864.064,989.524,
80000000000,1005.1,918.938,940.102,1008.13,
81000000000,1031.15,958.99,980,1034.06,
82000000000,1023.16,1007,998.032,998.072,
83000000000,1022.01,1008.01,983.128,1000.1,
84000000000,1008.15,1007.95,994.144,989.9,
85000000000,948.892,1027.03,992.888,1020.47,
86000000000,932.967,969.94,1002.97,952.132,
87000000000,898.982,983.886,933.976,945.1,
88000000000,882.915,923.987,907.096,960.08,
89000000000,839.93,905.976,900.928,933,
90000000000,863.02,866.984,902.13,913.048,
91000000000,866.004,891.104,857.024,922.962,
92000000000,913.96,852.032,841.364,950.132,
93000000000,911,831.013,756.964,957.452,
94000000000,974.965,823.018,804.02,931.06,
