Time [ms],1000000000,
0,1207.47,
1000000000,649.528,
2000000000,486.984,
3000000000,469.97,
4000000000,459.964,
5000000000,440.982,
6000000000,437.982,
7000000000,439.013,
8000000000,439.017,
9000000000,430.044,
10000000000,416,
11000000000,418.015,
12000000000,426.016,
13000000000,416.992,
14000000000,427.004,
15000000000,429.008,
16000000000,429.992,
17000000000,425.996,
18000000000,426.966,
19000000000,425.022,
20000000000,434.006,
21000000000,435,
22000000000,434.03,
23000000000,423.97,
24000000000,421,
25000000000,421.022,
26000000000,422.024,
27000000000,423.008,
28000000000,409.032,
29000000000,414.04,
30000000000,419.017,
31000000000,415,
32000000000,412.058,
33000000000,407,
34000000000,419.052,
35000000000,418.968,
36000000000,420.042,
37000000000,420.976,
38000000000,424.003,
39000000000,416.001,
40000000000,418.016,
41000000000,414.02,
42000000000,410.982,
43000000000,424.024,
44000000000,415.976,
45000000000,413.996,
46000000000,420.016,
47000000000,412,
48000000000,404,
49000000000,417.986,
50000000000,408.983,
51000000000,419.976,
52000000000,418.984,
53000000000,419.02,
54000000000,423.02,
55000000000,407.986,
56000000000,406.98,
57000000000,418.044,
58000000000,419.98,
59000000000,417.992,
60000000000,413.98,
61000000000,416.008,
62000000000,402.98,
63000000000,415.048,
64000000000,417.996,
65000000000,421.04,
66000000000,415.55,
67000000000,407.016,
68000000000,416.993,
69000000000,405.98,
70000000000,410.995,
71000000000,410.5,
72000000000,415.52,
73000000000,419.002,
74000000000,420.004,
75000000000,416.484,
76000000000,413.016,
77000000000,416.504,
78000000000,411.464,
79000000000,408.038,
80000000000,410.484,
81000000000,416.504,
82000000000,416.975,
83000000000,414.01,
84000000000,408.518,
85000000000,413.013,
86000000000,410.008,
87000000000,407.516,
88000000000,420.02,
89000000000,405.015,
90000000000,416.5,
91000000000,415.976,
92000000000,413.004,
93000000000,407.526,
94000000000,412.02,
95000000000,417,
