Frame number,1000000000,1000000001,1000000002,1000000003,
0.000000,1007.28,913.257,717.1,743.866,
1.000000,862.364,826.874,717.958,719.525,
2.000000,1075.4,1034.16,774.916,764.208,
3.000000,1602.8,1204.83,933.828,1021.18,
4.000000,2261.48,1476.12,1089.13,1135.82,
5.000000,2362.92,1715.56,1091.92,1268.52,
6.000000,2542.19,1643.04,988.984,1213.58,
7.000000,2283.92,1422.89,897.03,1158.13,
8.000000,1785.72,1148.98,820.779,904.835,
9.000000,1470.84,1031.35,786.97,819.798,
10.000000,1147.57,874.558,738.892,771.92,
11.000000,1009.24,775.993,662.997,659.068,
12.000000,981.966,725.645,609.208,625.906,
13.000000,841.212,671.266,583.94,613.965,
14.000000,833.209,653.496,565.896,564.07,
15.000000,755.057,600.2,532.936,546.912,
16.000000,733.938,611.384,523.033,540.09,
17.000000,694.148,576.628,526.927,525.052,
18.000000,716.525,596.872,516.882,527.09,
19.000000,799.626,607.938,531.928,536.97,
20.000000,888.7,604.344,555.48,588.026,
21.000000,1018.4,765.832,621.919,598.012,
22.000000,1154.6,838.988,732.896,650.038,
23.000000,1319.48,940.499,757.85,757.924,
24.000000,1466.36,1163.4,857.211,864.112,
25.000000,1462.26,1183.6,825.926,789.162,
26.000000,1347.28,1133.79,766.22,813.938,
27.000000,1167.17,1040.9,757.833,764.546,
28.000000,957.59,910.831,714.907,682.168,
29.000000,863.523,760.072,691.89,646.105,
30.000000,842.632,718.504,627.105,599.946,
31.000000,725.996,697.52,614.878,579.925,
32.000000,704.032,629.625,568.926,561.088,
33.000000,691.592,627.938,550.024,531.55,
34.000000,674.036,573.55,548.028,551.992,
35.000000,665,587.084,541.09,532.076,
36.000000,673.966,560.511,545.864,522,
37.000000,644.122,570.962,537.932,517,
38.000000,645.828,545.5,518.99,525.936,
39.000000,723.108,566.504,541.06,539.944,
40.000000,771.973,592.057,546.44,522.992,
41.000000,854.198,646.027,569.02,561.072,
42.000000,823.076,745.939,568.515,592.176,
43.000000,943.36,790.349,657.112,615.12,
44.000000,1032.17,848.911,653.9,612.008,
45.000000,940.106,849.456,675.6,632.992,
46.000000,933.048,842.531,677.516,656,
47.000000,896.169,780.906,648.108,656,
48.000000,783.939,726.921,626.984,604.94,
49.000000,754.976,631.516,603.944,584.056,
50.000000,739.123,607.896,576.474,587.01,
51.000000,684.104,567.952,564.457,561.1,
52.000000,665.022,587.554,534.96,541.075,
53.000000,650.015,591.936,548.448,542.05,
54.000000,607.957,569.96,543.98,515.046,
55.000000,641.98,560.948,515.489,529.048,
56.000000,628.96,562.98,507.052,515.02,
57.000000,638.051,551.931,505.54,517.04,
58.000000,664.89,579.468,523.468,527.016,
59.000000,694.08,595.032,524.504,558.014,
60.000000,734.214,654.448,542.006,568.088,
61.000000,739.07,654.84,541.556,554.924,
62.000000,770.862,701.48,568.524,558,
63.000000,790.91,718.05,547.014,577.106,
64.000000,757.921,711.64,586.016,562,
65.000000,809.037,752.9,549.537,569.935,
66.000000,828.187,708.568,566.453,597.06,
67.000000,813.816,659.88,581.464,595.016,
68.000000,741.004,653.04,557.503,590,
69.000000,765.05,646.128,546.01,565.959,
70.000000,694.012,598.05,547.505,556.989,
71.000000,653.93,581.988,514,542.066,
72.000000,641.055,555.52,524.446,531.92,
73.000000,631.005,567.04,500.944,519.912,
74.000000,612.085,529.536,515.04,529.962,
75.000000,628.043,554.072,539.76,533.03,
76.000000,657.106,580.964,530.512,539.954,
77.000000,656.069,600.976,530.008,538.05,
78.000000,687.085,614.968,533.502,580.866,
79.000000,710.172,628.604,534.01,552.081,
80.000000,707.92,648.878,530.58,567.003,
81.000000,695.085,622.084,585.986,537.04,
82.000000,697.868,628.011,561.85,519.992,
83.000000,693.928,647.878,548.074,540.98,
84.000000,717.04,680,548.041,555.912,
85.000000,700.08,640.11,567.059,536.998,
86.000000,748.134,652.995,570.952,563.968,
87.000000,739,648.986,559.121,555.973,
88.000000,727.132,617.995,550.992,556.056,
89.000000,654.119,612.073,553.042,540.936,
90.000000,683.16,563.921,547.1,534.03,
91.000000,625.064,576.892,512.054,535.918,
92.000000,595.008,565.974,517.09,527.11,
93.000000,595.89,551.938,499.931,519.942,
94.000000,618.094,559.003,533.022,531.964,
95.000000,597.086,583.975,537.935,537.992,
