Frame number,1000000000,1000000001,1000000002,
0.000000,700.559,673.112,1262.26,
1.000000,604.042,623.984,942.066,
2.000000,628.083,619.117,905.163,
3.000000,731.48,682.259,1011.62,
4.000000,871.967,781.867,1121.48,
5.000000,882.85,875.014,1238.8,
6.000000,1068.02,912.141,1312.41,
7.000000,958.872,988.084,1453.26,
8.000000,865.6,917.245,1392,
9.000000,844,837.295,1355.71,
10.000000,752.563,795.093,1206.2,
11.000000,728.91,729.865,1078,
12.000000,699.065,694.134,926,
13.000000,669.09,645.949,921.168,
14.000000,623.952,617.076,824.096,
15.000000,596.544,577.999,757.026,
16.000000,594.015,564.016,757.008,
17.000000,561.012,577.918,713.88,
18.000000,612.968,612.135,792.944,
19.000000,638.48,649.218,864.024,
20.000000,706.44,714.23,954.081,
21.000000,856.956,759.372,1053.79,
22.000000,967.928,804.85,1204.06,
23.000000,967.064,837.743,1255.14,
24.000000,964.093,944.755,1294.07,
25.000000,932.14,884.949,1213.12,
26.000000,885.256,991.016,1096.97,
27.000000,810.815,917.785,1071.64,
28.000000,755.36,854.31,1005.92,
29.000000,700.924,768.025,931.252,
30.000000,641,725.905,881.656,
31.000000,612.872,647.08,811.304,
32.000000,582.027,604.871,795,
33.000000,570.067,571.897,726.03,
34.000000,559.061,543.077,669.136,
35.000000,545.982,513.932,648.912,
36.000000,553.005,523.104,682.926,
37.000000,554.939,559.094,663.92,
38.000000,579.982,577.156,710.035,
39.000000,578.832,628.98,750.112,
40.000000,611.046,688.142,850.144,
41.000000,620.844,690.959,855.922,
42.000000,653.846,672.146,888.188,
43.000000,678.921,673.084,895.756,
44.000000,777,625.98,928.927,
45.000000,703.14,625.075,898.616,
46.000000,717.02,646.831,836.864,
47.000000,694.901,643.925,834.856,
48.000000,642.97,617.916,774.96,
49.000000,608.034,599.023,759.84,
50.000000,600.01,586.905,697.156,
51.000000,558.025,580.988,692.962,
52.000000,531.084,528.97,629.02,
53.000000,516.954,534.064,610.01,
54.000000,517.043,566.065,602.016,
55.000000,514.032,558.059,595.112,
56.000000,503.984,547.067,571.056,
57.000000,484.975,580.044,599.134,
58.000000,491.014,607.05,635.094,
59.000000,503.098,603.1,680.961,
60.000000,517.999,592.116,683.158,
61.000000,583.015,597.96,704.084,
62.000000,610.061,562.094,699.072,
63.000000,632.045,582.968,676.596,
64.000000,630.991,547.064,627.988,
65.000000,610.516,553.956,643.04,
66.000000,589.494,540.013,637.442,
67.000000,589.548,531.936,634.976,
68.000000,553.505,557.968,579.02,
69.000000,544.504,536.048,577.592,
70.000000,547.46,510.035,579.94,
71.000000,498.954,513.012,556.08,
72.000000,510.48,495.993,537.068,
73.000000,483.004,488.962,505.035,
74.000000,484.048,483.985,502.962,
75.000000,482.021,493.995,507.996,
76.000000,484.99,494.971,508.967,
77.000000,494.016,503.005,537.036,
78.000000,481.033,510.023,563.04,
79.000000,483.02,512.963,573.074,
80.000000,500,512.942,596.084,
81.000000,510.976,524.964,574.088,
82.000000,522.988,508.05,573,
83.000000,527.05,503.068,573.024,
84.000000,512.02,515.036,577.048,
85.000000,513.034,502.03,553,
86.000000,512.028,485.977,557.958,
87.000000,518.988,505.008,510.96,
88.000000,492.96,485.048,511.042,
89.000000,467.984,482.997,515.948,
90.000000,469.997,461.023,499,
91.000000,455.05,472.016,491.968,
92.000000,463.05,474.008,489.932,
93.000000,450.003,457.034,491,
94.000000,446.01,463.008,497,
95.000000,448.484,457.994,490.02,
