Frame number,1000000000,1000000001,1000000002,
0.000000,2363.56,4379.88,9227.6,
1.000000,1634.14,2420.97,6279.46,
2.000000,1311.04,1637.02,3614.34,
3.000000,1839.09,1965.96,3589.73,
4.000000,2584.2,2665.19,4431.25,
5.000000,4352.61,3432.38,5861.29,
6.000000,4522.22,4211.45,6355.9,
7.000000,4459.5,4011.62,6052.57,
8.000000,4395.1,4091.14,4938.59,
9.000000,4465.82,4094.76,4862.54,
10.000000,4138.64,3571.81,4167.86,
11.000000,3618.33,3383,3495.2,
12.000000,3173.59,3293.01,3084.63,
13.000000,2998,3177.09,2791.42,
14.000000,2545.82,3070.27,2620.6,
15.000000,2558.86,2844.84,2336.98,
16.000000,2279.04,2699.37,2001.4,
17.000000,2331.02,2585.41,1938.14,
18.000000,2307.96,2773.94,2006.71,
19.000000,2561.32,2969.64,2179.69,
20.000000,2853.33,3655.25,2555.52,
21.000000,3607.52,4092.8,2879.02,
22.000000,3832.69,4724.3,3170,
23.000000,3850.07,4627,3356.46,
24.000000,3784,4605.1,3149.4,
25.000000,3553.18,3967.1,3123.43,
26.000000,3448.58,3746.87,2862.6,
27.000000,3379.58,3333,2606.9,
28.000000,3181.97,3101.34,2422.47,
29.000000,2932.94,2768.39,2445.23,
30.000000,2786.3,2736.16,2235.7,
31.000000,2560.04,2592.13,2114.7,
32.000000,2377.76,2429.8,2044.58,
33.000000,2220.94,2157.84,1854.71,
34.000000,2148.96,2308.82,1793.08,
35.000000,2233.02,2403.08,1748.76,
36.000000,2425.35,2665,1803.36,
37.000000,2884.67,3009.37,2093,
38.000000,3344.95,3474.1,2235.49,
39.000000,3450.6,3679.57,2326,
40.000000,3508.96,3795.45,2475,
41.000000,3469.79,3469.46,2482.6,
42.000000,3214.84,3289.26,2612.56,
43.000000,2981.88,2946.19,2568.93,
44.000000,2665.07,2584.9,2318.28,
45.000000,2490.24,2334.85,2353.02,
46.000000,2352.25,2182.77,2209.83,
47.000000,2299.24,1903.62,2029.14,
48.000000,2011.16,1883.76,1892.69,
49.000000,1900,1748.34,1846.01,
50.000000,1769.1,1743.07,1748.73,
51.000000,1856.99,1718.1,1665.3,
52.000000,1941.72,1922.09,1618.11,
53.000000,2283.1,2232.05,1616.24,
54.000000,2521.77,2538.24,1755.93,
55.000000,2991.83,2904.9,1819.18,
56.000000,3161.08,3093.96,1931.31,
57.000000,3209.99,3115.91,2126.32,
58.000000,2977.02,2908.67,2184.5,
59.000000,2755.87,2690.96,2166.81,
60.000000,2492.02,2426.04,2163.96,
61.000000,2370.19,2159.33,2053.61,
62.000000,2189.98,1992.49,1973.78,
63.000000,2031.01,1819.43,1959.14,
64.000000,1940,1657.96,1963.93,
65.000000,1786.93,1611.98,1779.98,
66.000000,1718.8,1496.17,1676.06,
67.000000,1712.12,1492.88,1586.23,
68.000000,1832.86,1533.16,1486.95,
69.000000,2123.75,1810.1,1524.69,
70.000000,2579.76,2216.85,1417.21,
71.000000,3035.06,2633.89,1464.8,
72.000000,3328,2883.05,1604.15,
73.000000,3397.8,2942.96,1761.04,
74.000000,2990.71,2730.81,1739,
75.000000,2829.06,2594.91,1939.36,
76.000000,2542.07,2319.82,1960.39,
77.000000,2247.9,2090.12,1983.16,
78.000000,2020.06,1807.91,1893.92,
79.000000,1883.65,1660.91,1834.97,
80.000000,1696.78,1507.87,1746.61,
81.000000,1574.99,1440.37,1602.72,
82.000000,1547.11,1340.45,1510.05,
83.000000,1541.02,1306.97,1487.97,
84.000000,1638.14,1325.01,1388.06,
85.000000,1808.34,1521.87,1287.01,
86.000000,2214.33,1839.23,1271.92,
87.000000,2472.45,2213.87,1317.76,
88.000000,2668.49,2548.64,1361.83,
89.000000,2968.66,2564.16,1387.99,
90.000000,2843.06,2550.54,1457.8,
91.000000,2643.95,2422.59,1600.33,
92.000000,2379,2118.76,1756.36,
93.000000,2174.95,1964.06,1770.72,
94.000000,1964.99,1714.88,1757.01,
95.000000,1846.14,1574.83,1769.76,
96.000000,1700.92,1478.01,1676.05,
