Time [ms],1000000000,1000000001,1000000002,
0,1228.84,2568.45,1786.73,
1000000000,1205.17,2650.44,2206,
2000000000,1168.08,2681.74,2275.89,
3000000000,1072.75,2620.32,1948.39,
4000000000,974.86,2488.82,1557.13,
5000000000,853.116,2151.32,1360.84,
6000000000,760.13,1846.76,1249.52,
7000000000,746.988,1622.35,1241.8,
8000000000,678.913,1443.06,1210.42,
9000000000,643.993,1462.74,1185.1,
10000000000,597.082,1415.98,1077.34,
11000000000,608.984,1265.47,1038.9,
12000000000,620.047,1163.32,1046.08,
13000000000,666.77,1201.17,1033.92,
14000000000,726.045,1208.5,1020.1,
15000000000,803.874,1408.26,1109,
16000000000,994.849,1498.31,1122.08,
17000000000,1028.07,1651.5,1110.14,
18000000000,1164.01,1577.09,1162.19,
19000000000,1218.9,1566.49,1161.22,
20000000000,1147.86,1632.04,1206.78,
21000000000,1114.15,1504.72,1185.1,
22000000000,1062.96,1456.68,1186.78,
23000000000,937.756,1414.32,1226.98,
24000000000,872.824,1355.46,1225.09,
25000000000,854.029,1239.03,1188.34,
26000000000,836.974,1228.84,1193.89,
27000000000,776.865,1089.14,1188.34,
28000000000,736.824,1075.11,1289.93,
29000000000,772.988,1089.16,1024.97,
30000000000,811.943,1138.82,1023.97,
31000000000,816.814,1099.01,1208.64,
32000000000,837.1,1215.1,1219.2,
33000000000,854.869,1192.3,1186.64,
34000000000,934.525,1341.85,1261.89,
35000000000,1026.89,1298.26,1239,
36000000000,1091.12,1291.29,1363.62,
37000000000,1137.87,1263.07,1367,
38000000000,1162.16,1268.26,1333,
39000000000,1102.88,1267,1281.4,
40000000000,1078.2,1281.86,1377.95,
41000000000,1006.86,1162.81,1448.22,
42000000000,949.977,1141.74,1479.25,
43000000000,879.551,1088.94,1365.02,
44000000000,843.008,1042.3,1364.34,
45000000000,821.04,987.304,1390.8,
46000000000,820.482,938.998,1285.79,
47000000000,806.004,982.426,1340.81,
48000000000,807.566,967.107,1379.79,
49000000000,816.092,944.76,1318.62,
50000000000,850.955,994,1380.1,
51000000000,904.952,987.02,1395.1,
52000000000,949.5,1017.13,1460.3,
53000000000,956.42,1006.07,1481.9,
54000000000,968.61,1061.74,1492.58,
55000000000,1012.87,1100.21,1508.12,
56000000000,968.567,1050.81,1526.9,
57000000000,1024.81,1070.65,1541.03,
58000000000,1027.98,1046.25,1522.07,
59000000000,985.956,1082.85,1497.42,
60000000000,948.035,1098.31,1474.04,
61000000000,849.056,1042.8,1450.98,
62000000000,830.616,1069.48,1539.64,
63000000000,791.97,1004.79,1459,
64000000000,766.064,934.252,1529.07,
65000000000,758.48,951.25,1481.11,
66000000000,727.052,870.106,1551.83,
67000000000,780.925,878.142,1545.14,
68000000000,759.018,862.584,1559.74,
69000000000,774.68,867.12,1556.81,
70000000000,797.978,809.816,1582.3,
71000000000,836.856,789.131,1512.99,
72000000000,842.912,799.02,1516.1,
73000000000,841.81,797.954,1508.84,
74000000000,829.534,760.142,1556.08,
75000000000,798.52,806.222,1516.17,
76000000000,828.884,801.06,1493.74,
77000000000,811.872,837.188,1442.98,
78000000000,802.049,817.189,1479.22,
79000000000,802.064,856.82,1500.78,
80000000000,743.848,859.062,1480.94,
81000000000,727.019,870.944,1422.9,
82000000000,717.88,801,1424.76,
83000000000,709.071,838.04,1383.93,
84000000000,682.058,805.04,1318.72,
85000000000,714.985,816.12,1343.87,
86000000000,693.065,790.784,1335.84,
87000000000,724.902,779.92,1343.62,
88000000000,694.976,707.064,1298.92,
89000000000,714.904,768.88,1286.02,
90000000000,741.109,733.976,1264.77,
91000000000,738.048,748.104,1243.9,
92000000000,758.144,726.096,1278.14,
93000000000,774.03,726.93,1198.11,
94000000000,770.92,733.804,1215.44,
