Frame number,1000000000,1000000001,1000000002,
0.000000,2463.99,3634.89,2180.75,
1.000000,1230.01,1658.42,1488.24,
2.000000,1286.52,1983.08,1488,
3.000000,1647.76,2288.51,2101.95,
4.000000,1589.17,2023.59,2410.93,
5.000000,1430.06,1687.49,2128.02,
6.000000,1456.96,1540.84,1729.76,
7.000000,1251.9,1351.07,1439.9,
8.000000,1195.12,1140.83,1298.8,
9.000000,1244.62,990.095,1162.5,
10.000000,1116.44,1194.04,1050.96,
11.000000,1059.04,1404.1,952.104,
12.000000,1455.27,1668.87,903.888,
13.000000,1695.59,1730.37,819.036,
14.000000,1689.02,1743.62,896.968,
15.000000,1743.82,1811.84,931.973,
16.000000,1866.59,1887.39,977.988,
17.000000,1880.55,2075.97,1175.18,
18.000000,2073.92,2417.65,1451.01,
19.000000,2265.5,2783.4,1642.13,
20.000000,2388.79,3043.34,1751.89,
21.000000,2463.26,3115.07,1803.14,
22.000000,2442.62,3019.69,1711.74,
23.000000,2353.42,2746.22,1671,
24.000000,2363.75,2419.03,1584.06,
25.000000,2123.86,2325.45,1607.12,
26.000000,1989.19,2284.56,1477.65,
27.000000,1888.64,1919.76,1456.1,
28.000000,1852,1929.67,1321,
29.000000,1815.01,1763.81,1297.46,
30.000000,1837.75,1664.3,1164.86,
31.000000,1688.25,1615.94,1190,
32.000000,1680.87,1513.77,1257.89,
33.000000,1667.3,1402.39,1365.9,
34.000000,1711.08,1514.32,1552.21,
35.000000,1750.63,1561.92,1747.94,
36.000000,1877.94,1873.49,2003.86,
37.000000,1957.03,2004.39,2134.62,
38.000000,1839.32,1979.49,2278.3,
39.000000,2034.81,1967.05,2305.08,
40.000000,2008.16,2045.16,2235.76,
41.000000,1895.5,1823.1,1905,
42.000000,1940.23,1863.22,1895.78,
43.000000,1792.09,1733.73,1602.13,
44.000000,1940.79,1585.92,1495.68,
45.000000,1802.13,1620.67,1320.3,
46.000000,1700.13,1450.05,1295.08,
47.000000,1586.84,1330.17,1217.81,
48.000000,1674.97,1298.77,1199.18,
49.000000,1600.74,1363.4,1233.99,
50.000000,1655.26,1296.92,1215.65,
51.000000,1523.7,1303.21,1260.19,
52.000000,1534.57,1308.44,1338.95,
53.000000,1460.74,1248.2,1444.55,
54.000000,1533.63,1323.22,1473.7,
55.000000,1574.31,1265.32,1524.02,
56.000000,1562.02,1145.31,1553.38,
57.000000,1491.3,1142.71,1591.11,
58.000000,1455.89,1198.35,1500.07,
59.000000,1547.24,1345.4,1546.14,
60.000000,1506.89,1380.77,1521.98,
61.000000,1528.01,1331.85,1420.87,
62.000000,1525.77,1295.82,1410.77,
63.000000,1471.19,1208.8,1366,
64.000000,1533.16,1409.96,1288.96,
65.000000,1473.82,1297.85,1189.8,
66.000000,1521.35,1246.82,1269.02,
67.000000,1433.14,1248.16,1266.85,
68.000000,1404.97,1206.87,1267.06,
69.000000,1487.29,1317.79,1255.8,
70.000000,1489.16,1262.9,1291.32,
71.000000,1465.27,1243.39,1279.85,
72.000000,1452.3,1175.83,1299.02,
73.000000,1446.94,1190.64,1330.12,
74.000000,1380.19,1128.58,1342.24,
75.000000,1418.93,1053.85,1257.84,
76.000000,1362.33,1109.3,1363.24,
77.000000,1420.94,1071.75,1403.18,
78.000000,1370.02,1056.08,1356.89,
79.000000,1370.05,1031,1361.1,
80.000000,1403,1059.95,1204.18,
81.000000,1372.76,1088.75,1152.92,
82.000000,1494.24,1061.6,1197.2,
83.000000,1409.84,1120.78,1165.76,
84.000000,1359.12,1086.73,1147.71,
85.000000,1398.96,1071.17,1147.35,
86.000000,1371.17,1032.2,1128.21,
87.000000,1348.12,1056.3,1113.78,
88.000000,1370.12,1078.61,1181.23,
89.000000,1290.34,1038.76,1173.05,
90.000000,1329.38,1064.74,1195.54,
91.000000,1195.83,1038.97,1209.56,
92.000000,1181.67,945.893,1212.76,
93.000000,1216.07,957.185,1261.94,
94.000000,1214.7,913.137,1138.2,
95.000000,1229.22,865.028,1198.97,
