
Intensity Median
 ==================== 
Time [s],1000000000,
0.000000,457.007,
1.000000,479.006,
2.000000,469.97,
3.000000,474.977,
4.000000,459.036,
5.000000,449.04,
6.000000,437.994,
7.000000,444.972,
8.000000,435.976,
9.000000,436.964,
10.000000,445.06,
11.000000,433.022,
12.000000,438.024,
13.000000,434,
14.000000,440.999,
15.000000,447.976,
16.000000,452.983,
17.000000,441.014,
18.000000,446.992,
19.000000,444.034,
20.000000,443.969,
21.000000,448.996,
22.000000,449.983,
23.000000,433,
24.000000,441.992,
25.000000,441,
26.000000,435.04,
27.000000,438.99,
28.000000,436.034,
29.000000,442.024,
30.000000,453.028,
31.000000,441.994,
32.000000,438.984,
33.000000,442.002,
34.000000,434.008,
35.000000,440.976,
36.000000,433.988,
37.000000,433.024,
38.000000,438.01,
39.000000,438.975,
40.000000,422.978,
41.000000,428.032,
42.000000,437.018,
43.000000,431.988,
44.000000,434.996,
45.000000,428.027,
46.000000,437.034,
47.000000,441.99,
48.000000,431.968,
49.000000,436.988,
50.000000,430.488,
51.000000,435.03,
52.000000,432.024,
53.000000,423.008,
54.000000,434.008,
55.000000,433.008,
56.000000,430.016,
57.000000,426.008,
58.000000,424.008,
59.000000,440.998,
60.000000,421.976,
61.000000,427.984,
62.000000,424.98,
63.000000,432.026,
64.000000,424.993,
65.000000,437.979,
66.000000,424.959,
67.000000,420.985,
68.000000,432.04,
69.000000,426.014,
70.000000,423.988,
71.000000,425.964,
72.000000,428,
73.000000,427.97,
74.000000,430.972,
75.000000,424,
76.000000,428.978,
77.000000,429.984,
78.000000,425.98,
79.000000,423.032,
80.000000,431.02,
81.000000,424.985,
82.000000,419.976,
83.000000,427.028,
84.000000,426.04,
85.000000,417.032,
86.000000,424.988,
87.000000,424.01,
88.000000,420.056,
89.000000,428.048,
90.000000,417.016,
91.000000,423.005,
92.000000,418.038,
93.000000,426.988,
94.000000,425.97,
95.000000,423.992,
96.000000,416.009,
97.000000,417.992,
