Time [ms],1000000000,1000000001,1000000002,
0,551.51,557.98,539.992,
1000000000,674.47,595.977,557.978,
2000000000,730.945,684.036,617.036,
3000000000,816.05,751.924,684.05,
4000000000,892,848.15,747.95,
5000000000,1005.01,867.756,697.956,
6000000000,984.24,833.99,773.958,
7000000000,871.276,815.64,706.058,
8000000000,796.084,743.756,706.924,
9000000000,718.098,687.5,673.97,
10000000000,622.174,612.952,618.48,
11000000000,601.09,601.504,571.968,
12000000000,561.972,586,583.024,
13000000000,543.912,546.032,548.96,
14000000000,530.92,544.978,539.032,
15000000000,500,506.975,530.004,
16000000000,495.984,517.969,514.025,
17000000000,497.49,527.054,519.984,
18000000000,494.02,504.043,509.476,
19000000000,512.968,522.05,510.04,
20000000000,517.975,531.952,527.505,
21000000000,514.05,526.046,533.018,
22000000000,554.55,590,575.476,
23000000000,597.012,624.914,602.958,
24000000000,667.05,645,635.996,
25000000000,678,663,644,
26000000000,675.972,641.508,629.53,
27000000000,645.028,662.94,613.092,
28000000000,593.957,621,583.024,
29000000000,577.01,587.02,574.008,
30000000000,550.994,597.184,555.008,
31000000000,544.946,535.94,555.989,
32000000000,530.022,531,552.998,
33000000000,527.956,511.968,522,
34000000000,495.025,543.068,524.88,
35000000000,493.008,529.036,514.02,
36000000000,490.972,501,510,
37000000000,503.504,507.015,507.04,
38000000000,508.012,481.016,497.032,
39000000000,503.48,510.06,494.99,
40000000000,501.008,532.994,500.04,
41000000000,509.52,560.99,537.925,
42000000000,518.528,539.01,524.032,
43000000000,530.032,576.087,558.063,
44000000000,530,603.092,561.988,
45000000000,553,606.066,558.99,
46000000000,543.476,609.95,566.044,
47000000000,540.944,583.008,526.052,
48000000000,530.952,591.02,506.962,
49000000000,507,592.96,523.516,
50000000000,517.044,546.066,528.017,
51000000000,495.052,559.976,507.051,
52000000000,499.04,528.96,513.005,
53000000000,512.02,537.029,508.021,
54000000000,495.984,518.908,495.05,
55000000000,496.996,490.04,490.968,
56000000000,499.044,502.05,511.011,
57000000000,501.024,500.034,491.964,
58000000000,518.514,505.976,484.05,
59000000000,520.96,520.963,499,
60000000000,524.024,514.982,506.96,
61000000000,512.04,533.038,502.041,
62000000000,513.034,533.985,516,
63000000000,525.968,526.952,528.048,
64000000000,517.996,545.914,515,
65000000000,520.46,533,524.04,
66000000000,528.984,532.08,528.008,
67000000000,499,539.974,509.996,
68000000000,519.492,532.98,514.02,
69000000000,496.944,506.944,514.99,
70000000000,507.518,502.505,498.06,
71000000000,492.968,492.99,488,
72000000000,500.508,506.992,493.08,
73000000000,498.042,497.992,496.044,
74000000000,490.008,493.488,500.016,
75000000000,499.008,487.96,517.02,
76000000000,493.018,489.532,490.016,
77000000000,484.46,496.016,492.988,
78000000000,494.558,491.021,497.946,
79000000000,487.02,496.49,496.99,
80000000000,489.5,510.991,503.99,
81000000000,499.038,504.448,494.992,
82000000000,489.01,505.504,479.984,
83000000000,486.552,504.029,484.996,
84000000000,489.996,509.988,500.032,
85000000000,483.009,517.544,498.99,
86000000000,477.988,497.498,477.064,
87000000000,483.466,509.025,494.008,
88000000000,487.5,493.48,489.016,
89000000000,484.5,499.996,479.976,
90000000000,486.448,508.04,481.94,
91000000000,479.018,486.02,490.99,
92000000000,486.98,486.992,485.004,
93000000000,473.452,476.011,486.006,
94000000000,483.526,489.52,487.042,
95000000000,478.002,483.496,472.956,
