Frame number,1000000000,
0.000000,450.976,
1.000000,448,
2.000000,478.032,
3.000000,493.496,
4.000000,516.045,
5.000000,514.968,
6.000000,506.492,
7.000000,490.52,
8.000000,479.04,
9.000000,478,
10.000000,468.035,
11.000000,461.03,
12.000000,452.002,
13.000000,442.992,
14.000000,430.038,
15.000000,446,
16.000000,444.496,
17.000000,444,
18.000000,445.964,
19.000000,450,
20.000000,450.012,
21.000000,472.48,
22.000000,474,
23.000000,463.032,
24.000000,471.024,
25.000000,464.05,
26.000000,465.046,
27.000000,462.984,
28.000000,464.966,
29.000000,449.012,
30.000000,447.983,
31.000000,439.025,
32.000000,437.004,
33.000000,442.032,
34.000000,434.971,
35.000000,446.02,
36.000000,443.994,
37.000000,443.99,
38.000000,451.982,
39.000000,453.05,
40.000000,449.984,
41.000000,461.978,
42.000000,460.964,
43.000000,448.041,
44.000000,446.98,
45.000000,468.996,
46.000000,447.04,
47.000000,449.98,
48.000000,445.984,
49.000000,447.987,
50.000000,434.05,
51.000000,434.976,
52.000000,437.02,
53.000000,444.018,
54.000000,451.004,
55.000000,439,
56.000000,443.954,
57.000000,452.026,
58.000000,451.029,
59.000000,450.04,
60.000000,439.025,
61.000000,440.99,
62.000000,449.028,
63.000000,448.05,
64.000000,455.98,
65.000000,444.952,
66.000000,445.98,
67.000000,448.98,
68.000000,442.977,
69.000000,441.06,
70.000000,438.014,
71.000000,433.952,
72.000000,442.957,
73.000000,433.006,
74.000000,443.975,
75.000000,447.992,
76.000000,437.024,
77.000000,445.012,
78.000000,439.002,
79.000000,430.996,
80.000000,438.944,
81.000000,435.99,
82.000000,447.496,
83.000000,438.5,
84.000000,442.994,
85.000000,445.012,
86.000000,439.53,
87.000000,435.512,
88.000000,448.994,
89.000000,450.504,
90.000000,443.49,
91.000000,442,
92.000000,440.978,
93.000000,445,
94.000000,435.984,
95.000000,440.05,
