Frame number,1000000000,1000000001,1000000002,
0.000000,6519.96,3598.11,5894.06,
1.000000,6504.3,3899.58,5588.06,
2.000000,5491.94,3838.71,5091.12,
3.000000,5687.23,4292.09,5173.88,
4.000000,5916.22,4597.05,4850.09,
5.000000,4747.26,4222.24,4283.89,
6.000000,4019.73,3677.08,3530.92,
7.000000,3657.37,3159.65,3144.36,
8.000000,3164.6,2565.12,2870.28,
9.000000,2832.37,2081.31,2488.15,
10.000000,2407.23,1763.23,2271.98,
11.000000,2086.88,1551.48,1986.77,
12.000000,1889.83,1323.9,1794.94,
13.000000,1785.76,1164.5,1768.79,
14.000000,1718.65,1199.18,1648.64,
15.000000,1635.32,1166.38,1529.78,
16.000000,1567.15,1106.72,1460.68,
17.000000,1510.57,1108.34,1452.97,
18.000000,1643.57,1321.1,1515,
19.000000,2071.02,1801.37,1690.18,
20.000000,2484.02,2294.59,1980.97,
21.000000,2785.24,2626.03,2153.2,
22.000000,2577.74,2353.3,2080.84,
23.000000,2458.18,2209.23,1916.28,
24.000000,2294.38,1958.54,1831.36,
25.000000,2070.11,1718.53,1639.17,
26.000000,1952.96,1596.34,1498.22,
27.000000,1629.94,1391.05,1379.66,
28.000000,1494.42,1254.49,1225.29,
29.000000,1302.18,1109,1147.79,
30.000000,1195,1003.06,1010.02,
31.000000,1136.98,909.016,964.736,
32.000000,1078.24,868.932,893.854,
33.000000,1036.1,828.08,823.152,
34.000000,1016.1,897.99,859.963,
35.000000,1156.05,1001.75,971.936,
36.000000,1410.16,1276.8,1200.67,
37.000000,1812.81,1640.92,1372.3,
38.000000,1986.74,1922.52,1513.07,
39.000000,2021.36,1869.87,1528.29,
40.000000,1898.77,1699.55,1406.02,
41.000000,1768.22,1519.17,1369.93,
42.000000,1644.33,1396.38,1305.92,
43.000000,1516.17,1291.08,1140.35,
44.000000,1444.35,1101.31,1055.08,
45.000000,1245.47,1017.58,930.24,
46.000000,1124.38,935.648,884.882,
47.000000,997.766,840.956,806.846,
48.000000,988.424,819.264,760.911,
49.000000,920.877,778.952,712.951,
50.000000,890.014,746.062,715.992,
51.000000,922.068,769.482,713.861,
52.000000,997.04,893.93,800.05,
53.000000,1141.02,1153.74,921.954,
54.000000,1439.21,1446.56,1084.79,
55.000000,1586.53,1631.68,1192.11,
56.000000,1786.57,1636.25,1252.25,
57.000000,1693.34,1529.62,1310.04,
58.000000,1561.82,1463.56,1205.16,
59.000000,1472.24,1326.07,1183.87,
60.000000,1421.87,1164.03,1047.92,
61.000000,1223.43,1035.5,945.061,
62.000000,1122.11,968.572,869.904,
63.000000,1038,871.78,783.155,
64.000000,929.48,781.128,698.9,
65.000000,868.99,717.464,669.086,
66.000000,810.153,693.08,614.932,
67.000000,790.4,675.547,615.951,
68.000000,796.08,698.956,633.96,
69.000000,846.972,783.02,651.879,
70.000000,908.134,911.001,742.016,
71.000000,1075.55,1077.46,847.906,
72.000000,1226.24,1198.42,873.956,
73.000000,1399,1270.47,952.888,
74.000000,1477.5,1301.67,997.05,
75.000000,1540.1,1293.48,1025.75,
76.000000,1403.64,1253.64,962.16,
77.000000,1351.83,1138.96,898.91,
78.000000,1232.17,1037.36,806.132,
79.000000,1078.65,868.816,764.945,
80.000000,949.576,802.622,670.06,
81.000000,857.06,724.048,625.014,
82.000000,787.104,648.088,609.052,
83.000000,782.096,650.008,566.064,
84.000000,749.008,635.496,574.063,
85.000000,747.539,647.986,585.994,
86.000000,793.504,717.088,591.972,
87.000000,905.107,832.85,636,
88.000000,905.952,931.02,672.118,
89.000000,1085.66,1083.21,745.904,
90.000000,1236.08,1180.77,814.824,
91.000000,1386.78,1240.92,897.01,
92.000000,1381.08,1241.76,929.116,
93.000000,1387.22,1235.13,907.952,
94.000000,1381.77,1138.97,859.46,
95.000000,1243.19,998.221,802.025,
