Frame number,1000000000,1000000001,1000000002,1000000003,1000000004,1000000005,
0.000000,536.018,555.045,522.972,532.952,518.96,554.06,
1.000000,517.983,585.971,553.944,554.116,515.031,544.004,
2.000000,541.096,686.088,581.965,689.108,529.985,596.956,
3.000000,575.544,701.011,658.92,750.152,546,670.992,
4.000000,544,808.625,719.91,872.123,561.05,710.592,
5.000000,579.098,819.997,759.06,885.744,581.04,774.268,
6.000000,576.512,822.208,710.944,871.832,610.962,803.15,
7.000000,582,841.556,681,820.16,609.018,772.06,
8.000000,551.003,763.883,700.206,747,571.992,748.082,
9.000000,546,755.97,676.008,714.939,571.944,671.93,
10.000000,531.036,663.472,642.114,676.91,584.972,647.02,
11.000000,541.018,632.962,604.023,669.006,547.938,673.12,
12.000000,563.084,650.025,570.027,619.992,546.052,607.928,
13.000000,522.996,591.464,581.048,595.134,543.964,601.06,
14.000000,512.96,566.056,547.544,564.072,512.488,585.94,
15.000000,556.02,529.955,531.048,544.056,519.52,575.006,
16.000000,514.976,536.005,532.58,529.06,505.032,550.068,
17.000000,517.016,497.032,524.005,493.016,489.968,548.976,
18.000000,514.032,523.46,527.012,512.968,493.453,538.992,
19.000000,511.036,532.005,512.016,513.008,490.04,542.028,
20.000000,521.968,558.959,538.024,552.992,502.992,551.058,
21.000000,532.96,593.146,527.025,599.012,526.978,588,
22.000000,538.971,691.62,544.99,661.6,520.003,596.904,
23.000000,561.88,676.916,581.958,715.025,522.968,625.061,
24.000000,547.021,652.074,546.052,748.488,530.072,635.88,
25.000000,556.983,645.92,611.057,720.984,543.07,621.46,
26.000000,530.97,652.976,547.033,747.084,544.04,607.064,
27.000000,516.968,628.932,565.038,661.144,536.058,592,
28.000000,530.04,619.94,563,620.036,525.028,581.06,
29.000000,515.046,608.092,552.962,623,505.048,583.964,
30.000000,500.048,560.98,545,584.94,500.982,565.45,
31.000000,521.04,551,542.985,568.056,505.028,558.976,
32.000000,506.975,557.979,519.04,529.92,487.054,528.992,
33.000000,489.006,546.928,524.004,527.984,477.005,530.948,
34.000000,492.015,517.022,510.988,501.904,484.014,527.992,
35.000000,498.052,506.02,506.974,525.024,468.926,511.022,
36.000000,474.456,503.968,504.036,499.96,459,507.015,
37.000000,482.528,524,497.941,501.024,475.016,497,
38.000000,479.972,526.94,493.028,492.55,482.022,513.542,
39.000000,511.042,537.908,504.048,526.993,471.016,529.977,
40.000000,487.953,551.037,528.008,537.015,479.499,515.045,
41.000000,501,542.011,537.958,594.08,488.52,558.98,
42.000000,503.004,560.976,526.966,577,486.469,524.02,
43.000000,501.09,530.54,536.024,589.088,477.016,520.924,
44.000000,494.912,536.979,507,538.972,473.004,538.04,
45.000000,487.993,531.49,513.96,560,491.52,546.964,
46.000000,496.974,522.976,504.952,547.013,479.024,536.024,
47.000000,479.036,515.972,502.036,546.012,483.493,502.984,
48.000000,487.07,524.48,500.052,543.996,488.524,498,
49.000000,480,504.976,507.004,523.034,474.984,509.02,
50.000000,460.035,514.994,478.944,521.08,471.485,491.024,
51.000000,486.95,502.961,499.924,517.928,463.02,485.96,
52.000000,464.037,489.035,496.04,485,461.985,510.992,
53.000000,480.028,483.985,482.932,485.976,459.98,482,
54.000000,476.025,486,494.023,489.974,462.034,477.039,
55.000000,484.03,484.952,479.002,483.024,468.02,478.974,
56.000000,480.031,499.036,481.945,524.974,462.008,488.999,
57.000000,486.038,517.046,496,501.012,461.028,496.992,
58.000000,465.004,514.98,511.008,521.01,463.996,521.046,
59.000000,474.532,516.044,501.04,522.006,468.004,498,
60.000000,489.46,520.99,498.988,543.1,467.04,505.015,
61.000000,489.493,525,489.988,551.52,463.974,498.04,
62.000000,470.488,515.987,497.987,544.496,490.983,507,
63.000000,476.96,504.964,505.008,524.018,465.976,501.96,
64.000000,470.017,509.967,495.024,538.94,462.026,502.02,
65.000000,470.528,495.022,490.04,531.927,464.972,497.052,
66.000000,484.014,498.95,488.944,535.52,460.968,485.05,
67.000000,466.524,501.036,502.008,499.964,469.977,489,
68.000000,451.992,487.05,481.04,531.016,458.968,491.991,
69.000000,469.528,486.956,476.008,509.01,453.052,476.018,
70.000000,465.02,469.044,467.035,491.012,466.04,483.984,
71.000000,458.015,489.06,465.991,504.538,457.01,475.972,
72.000000,459.504,494.041,471.018,490.995,451.006,479.968,
73.000000,473.016,484.026,477.01,505.436,463.968,475.011,
74.000000,475.992,488,472,506.96,458.01,494.044,
75.000000,473,487.982,486,506.962,457.976,478.04,
76.000000,473.52,494.968,480.04,506.568,454.03,483.034,
77.000000,461.528,497.976,491.957,519.028,458.956,484.036,
78.000000,468.495,491.05,481.025,514.008,457.996,489.988,
79.000000,460.966,480.023,481.009,513.047,455,486.016,
80.000000,467.048,476.988,473.972,517.976,451.006,463.042,
81.000000,463.48,489.029,474.98,515.94,451.975,483.004,
82.000000,463.512,483.038,465.974,505.504,458,492.992,
83.000000,453.51,492,476,519,447.987,481.975,
84.000000,465.05,468.052,466.043,496.018,447.008,474.976,
85.000000,453.016,474.032,463.972,514.04,453.984,479.97,
86.000000,444.496,475.975,471.015,503.028,452.03,473.028,
87.000000,457.01,476.032,465.96,505.02,443.025,472.978,
88.000000,452.51,475.936,459.992,484.497,447.968,470.008,
89.000000,461.008,464.028,456.004,488.517,447.023,464.008,
90.000000,465.468,470.977,445.992,481.505,445.03,465.025,
91.000000,460.509,477.98,463.016,482.976,450.041,474.03,
92.000000,456.989,474.989,460.018,483.456,444.045,455.996,
93.000000,468.984,477.04,463.938,482.072,447.027,472.936,
94.000000,463.5,489.944,470.98,495.016,446.032,468.043,
95.000000,452.504,483.028,472.03,492.994,441.042,466.992,
