Frame number,1000000000,1000000001,1000000002,1000000003,1000000004,
0.000000,4714.78,6670.75,8621.7,18778.9,11469.5,
1.000000,3526.1,7666.9,6849.84,16840.7,8539.34,
2.000000,4842.91,6423.02,5350.92,12727.8,8963.49,
3.000000,5274.76,6005.61,5389.12,11734.6,8374.93,
4.000000,5485.15,5358.82,5213.7,9904.08,9141.53,
5.000000,5355.56,5183.31,5691.8,9146.4,10593.4,
6.000000,5287.97,5158.23,6502.26,9350.61,10980.8,
7.000000,4758.85,4821.6,6788.85,7864.35,9452.97,
8.000000,3875.71,4379.39,6287,6958.8,9952.05,
9.000000,3567.95,3897.68,5792.55,6775.28,8321,
10.000000,3082.7,3894.68,5489.67,5952.14,6967.07,
11.000000,2578.93,3575.61,4927.03,4827.54,6315.62,
12.000000,2346.9,3293.61,4492.66,4401.58,5785.57,
13.000000,2035.48,3149.38,5123.67,4100.62,5483.54,
14.000000,2003.72,3933.67,5099.52,3892.3,5200.1,
15.000000,1998.05,3324.28,5083.5,3955.03,5132.72,
16.000000,2078.84,4007.42,4697.84,4275.26,5292.16,
17.000000,2135.07,2825.44,4832.12,4884.29,5475,
18.000000,2358.08,3753.54,4898.49,6179.15,6169.85,
19.000000,2919.93,2673.11,4977.86,7450.52,6384.32,
20.000000,3352.25,3667.22,4805.37,7528.77,7052.2,
21.000000,3469.95,2840.8,5080.88,7195.09,7465.96,
22.000000,3412.32,3610.79,4628.2,6802,7278.92,
23.000000,3357.06,2760.28,4916.86,6926.12,7396.5,
24.000000,3108.31,2800.74,4304.76,5864.44,6608.96,
25.000000,2804.78,2283.63,4265.08,5263.82,6105.6,
26.000000,2558.87,3393.33,3753.42,4630.53,5651.21,
27.000000,2366.19,2833.84,3933.84,4285.53,5396.76,
28.000000,2120.16,3312.28,4237.02,4178.13,5108.45,
29.000000,1957.2,2427.16,4459,3800.11,4872.82,
30.000000,1952.89,4049.26,4680.92,3996.03,4903,
31.000000,1969.9,3393.02,4470.3,4050.14,5088.4,
32.000000,1973.93,4532.51,3484.41,4356.5,5055.37,
33.000000,2070.36,3534.77,4362.83,4811.87,5533.17,
34.000000,2372.7,6788.3,3082.24,5467.52,5960.77,
35.000000,2697.3,5886.44,4602.84,5744.55,5976.18,
36.000000,2828.35,6589.42,3491.18,5379.75,6089.95,
37.000000,2948.18,5392.37,4589,5126.92,6206.35,
38.000000,2890.64,5013.37,3496.88,4830.89,5711.78,
39.000000,2757,4633.52,4343.42,4497.39,5451.16,
40.000000,2586.76,4304.74,3297.68,4105.68,4917.92,
41.000000,2407.37,4134.52,3894.36,3749.24,4677.09,
42.000000,2234.98,4477.6,3330.77,3489.55,4503.01,
43.000000,2040,4021.16,4174.35,3156.18,4342.13,
44.000000,1969.84,4021.5,3530.59,3161.08,4388.59,
45.000000,1896.92,3774.92,5106,3237.96,4706.23,
46.000000,1852.72,5167.69,4405.36,3483.05,4594.11,
47.000000,1850.5,5155.66,6160.1,3947.94,5060.55,
48.000000,2037.62,5388.47,5051.78,4027.82,5085.92,
49.000000,2216.44,4404.12,6417.43,4131.53,5396.95,
50.000000,2390.25,4595.63,5591.34,4329.54,5089.57,
51.000000,2525.93,4131.94,6087.12,4510.76,4956.48,
52.000000,2633.77,4130.63,4623.59,4471.56,4526.99,
53.000000,2719.22,3987.37,5106.08,4047.6,4590.84,
54.000000,2692.44,3942.76,4240.21,3711.12,4727.98,
55.000000,2631.51,3518.41,4751.47,3465.25,4910.41,
56.000000,2550.5,3552.92,4334.21,3124.39,4582,
57.000000,2388.92,3656.14,5166.29,2853.49,4624.04,
58.000000,2268.04,4080.22,4378.44,2876.09,4309.39,
59.000000,2154.4,4506.29,6909.93,2856.35,4568.84,
60.000000,2091.95,4782.92,5870.81,3009.44,4820.01,
61.000000,2057.02,5032.38,7004.77,2849.05,4964.8,
62.000000,2086,5037.48,5411.64,3383.46,5071.7,
63.000000,2191.81,5149.67,5946.53,3718.84,4942.63,
64.000000,2293.32,4748.17,5171.89,3960.7,4772,
65.000000,2434.92,4531.09,6457.57,3993.45,4448.63,
66.000000,2517.19,4122.3,5463.79,3937.47,4412.5,
67.000000,2479.09,4169.64,6138.58,3776.17,4336.54,
68.000000,2439.49,4112.69,4954.94,3657.04,3993.42,
69.000000,2385.16,4100.5,5158.49,3367.65,4132.64,
70.000000,2437.95,4216.08,4476,3193.06,4072.4,
71.000000,2382.91,4268.11,5355.33,2891.55,3758.25,
72.000000,2253,4438.24,4613.75,2737.86,3932.19,
73.000000,2157.22,4522.02,5974.4,2628.01,4169.66,
74.000000,2072.13,4424.94,5068.12,2682.58,4200.5,
75.000000,2001.84,4382.6,6145.76,2794.38,4825.41,
76.000000,1993.99,4430.08,5005.52,3023.19,4825.94,
77.000000,2056.06,4265.76,5868.76,3285.46,4792.66,
78.000000,2145.96,4362.22,4803.62,3344.7,4566.67,
79.000000,2305.06,4415.69,5762.53,3450.74,4665.28,
80.000000,2266.15,4293.06,4785.99,3470.39,4316.99,
81.000000,2434.14,3926.9,5641.85,3397.27,4206.6,
82.000000,2446.09,3873.21,4813.24,3279.92,4086.38,
83.000000,2452.4,3835.12,5564.18,2958.86,3969.21,
84.000000,2391.37,4094.65,5015.52,2757.57,3892.4,
85.000000,2369.77,4017.46,5897.06,2651.99,4053.79,
86.000000,2208.29,4395.47,5536.17,2510.57,4060.44,
87.000000,2080.84,4307.32,6495.99,2311.87,4321.16,
88.000000,2075.9,4535.43,6126.2,2310.41,4975.25,
89.000000,2056,4431.62,6346.1,2413.75,4941.82,
90.000000,2012.88,4468.76,5900.36,2410.93,4920.59,
91.000000,2044.18,4292.73,5899.72,2726.48,4924.53,
92.000000,2072.12,4371.74,5512.45,2908.11,4842.67,
93.000000,2188.11,3909.04,5605.8,2852.61,4785.74,
94.000000,2252.95,4230.26,5496.53,2933.21,4593.08,
95.000000,2350.99,3996.46,5555.32,2879.11,4209.44,
