Time [ms],1000000000,
0,428.022,
1000000000,430.028,
2000000000,441.992,
3000000000,443.002,
4000000000,458.022,
5000000000,451.01,
6000000000,445.999,
7000000000,448.993,
8000000000,436.956,
9000000000,449,
10000000000,434.97,
11000000000,430.98,
12000000000,430.988,
13000000000,431.5,
14000000000,432.003,
15000000000,422.988,
16000000000,425.03,
17000000000,427.992,
18000000000,429.008,
19000000000,432.984,
20000000000,434.978,
21000000000,427.994,
22000000000,432.99,
23000000000,435,
24000000000,433.97,
25000000000,440.028,
26000000000,435,
27000000000,435.02,
28000000000,430.016,
29000000000,427.006,
30000000000,423.96,
31000000000,425.001,
32000000000,425,
33000000000,415.982,
34000000000,418.012,
35000000000,427.046,
36000000000,420.972,
37000000000,427.976,
38000000000,432.015,
39000000000,433.991,
40000000000,430.988,
41000000000,425.985,
42000000000,430.99,
43000000000,429.008,
44000000000,430.006,
45000000000,432.976,
46000000000,423,
47000000000,429.04,
48000000000,424.02,
49000000000,426.989,
50000000000,416.986,
51000000000,428.993,
52000000000,424.02,
53000000000,434.01,
54000000000,431,
55000000000,424.005,
56000000000,425.96,
57000000000,419.98,
58000000000,421.99,
59000000000,421.008,
60000000000,423.002,
61000000000,424,
62000000000,421.027,
63000000000,423.019,
64000000000,425.985,
65000000000,430.06,
66000000000,414.984,
67000000000,421.032,
68000000000,424.986,
69000000000,424.027,
70000000000,429.954,
71000000000,432.004,
72000000000,437.025,
73000000000,428.016,
74000000000,423.98,
75000000000,418,
76000000000,415.976,
77000000000,424.008,
78000000000,426.976,
79000000000,426.992,
80000000000,421.988,
81000000000,419.018,
82000000000,417,
83000000000,422.99,
84000000000,430.992,
85000000000,423.016,
86000000000,428.008,
87000000000,421.022,
88000000000,447.022,
89000000000,423.018,
90000000000,435.014,
91000000000,425,
92000000000,411.976,
93000000000,471.995,
94000000000,489.052,
