Time [ms],1000000000,
0,456.982,
1000000000,482.983,
2000000000,477.037,
3000000000,477.046,
4000000000,483.982,
5000000000,481.974,
6000000000,480.977,
7000000000,465.978,
8000000000,443.002,
9000000000,461.008,
10000000000,456.963,
11000000000,457.956,
12000000000,437.016,
13000000000,438.976,
14000000000,442.99,
15000000000,440.024,
16000000000,443.998,
17000000000,444.002,
18000000000,445,
19000000000,433.004,
20000000000,451.964,
21000000000,458.04,
22000000000,447.032,
23000000000,437,
24000000000,436.554,
25000000000,438.49,
26000000000,443.018,
27000000000,441.956,
28000000000,441.967,
29000000000,430.503,
30000000000,434.042,
31000000000,437.504,
32000000000,429,
33000000000,439.489,
34000000000,442.03,
35000000000,443.996,
36000000000,442.028,
37000000000,445.044,
38000000000,439.988,
39000000000,431.024,
40000000000,430.028,
41000000000,435.01,
42000000000,415.982,
43000000000,439.012,
44000000000,424.03,
45000000000,429.952,
46000000000,428.982,
47000000000,435.022,
48000000000,431.01,
49000000000,427.98,
50000000000,424.978,
51000000000,429,
52000000000,437.484,
53000000000,444.988,
54000000000,430.52,
55000000000,440.007,
56000000000,430.992,
57000000000,428.022,
58000000000,430.03,
59000000000,425.5,
60000000000,427.52,
61000000000,434.996,
62000000000,432.032,
63000000000,424.004,
64000000000,421.004,
65000000000,425.006,
66000000000,425.978,
67000000000,428.492,
68000000000,434.007,
69000000000,422.962,
70000000000,422.969,
71000000000,428.986,
72000000000,430.992,
73000000000,424.026,
74000000000,428.548,
75000000000,430,
76000000000,431.016,
77000000000,425.016,
78000000000,425.041,
79000000000,422.004,
80000000000,423.06,
81000000000,429.044,
82000000000,419.976,
83000000000,431,
84000000000,417.956,
85000000000,431.006,
86000000000,428.05,
87000000000,421,
88000000000,422,
89000000000,422.52,
90000000000,420.995,
91000000000,419.492,
92000000000,421.956,
93000000000,431.984,
94000000000,422.496,
95000000000,428.444,
