Frame number,1000000000,1000000001,
0.000000,41637,31071.7,
1.000000,43074.4,30476.4,
2.000000,43054.8,32439.9,
3.000000,42269.7,28755.1,
4.000000,36584,25950.1,
5.000000,29185.6,22206.8,
6.000000,23610,18702.8,
7.000000,18475.4,15184.4,
8.000000,24532,12425.2,
9.000000,19952.1,10702.1,
10.000000,17875.1,9139.74,
11.000000,15186.8,8214.46,
12.000000,16266.5,7490.87,
13.000000,14446.5,7236.82,
14.000000,16678,8039.75,
15.000000,18727,11027.8,
16.000000,22255.9,16575.9,
17.000000,28910.8,21999,
18.000000,34835.3,23492.6,
19.000000,32223,21487.6,
20.000000,29385.2,17607.4,
21.000000,26948.6,14261.2,
22.000000,22779,11207.5,
23.000000,18510.7,8856.96,
24.000000,14151.8,7393.52,
25.000000,11201.7,6106.84,
26.000000,9121.35,5224.06,
27.000000,7579,4646.56,
28.000000,6376.06,4300.81,
29.000000,6017.54,4526.66,
30.000000,6369.4,5751.95,
31.000000,6929.39,8505.2,
32.000000,7966.66,13534.1,
33.000000,10541.1,18176.6,
34.000000,14080.8,19769.6,
35.000000,15115,18327.8,
36.000000,14445.7,16573.9,
37.000000,13339.8,13073.3,
38.000000,10961.5,10463.2,
39.000000,8590.11,7853.78,
40.000000,6871.21,6145.14,
41.000000,5006.06,4969.24,
42.000000,4228.61,4307.4,
43.000000,3797.95,3754.46,
44.000000,3500.33,3479.58,
45.000000,3198.96,3591.36,
46.000000,3104.14,4460.82,
47.000000,3243.04,6867.42,
48.000000,4772.59,10554.9,
49.000000,6881.97,14158.6,
50.000000,9116.86,16223.7,
51.000000,12045.6,15889.8,
52.000000,11851.4,14495.5,
53.000000,11745.4,11950.2,
54.000000,9946.44,8783.35,
55.000000,8284.98,6732.96,
56.000000,6804,5121.77,
57.000000,5476.55,4118.7,
58.000000,4450.07,3555.58,
59.000000,3734.96,3124.9,
60.000000,3472.2,2859.3,
61.000000,3223.5,2818.83,
62.000000,3247.17,3670.06,
63.000000,3605.78,5393.96,
64.000000,4135.34,8206.36,
65.000000,4844.42,11366.7,
66.000000,6445.02,14967,
67.000000,8265.48,14905.8,
68.000000,10619.1,13186,
69.000000,11507.7,11391.5,
70.000000,11382.4,8481.45,
71.000000,10366.3,6295.5,
72.000000,8296.04,4975.8,
73.000000,6611.75,4127.14,
74.000000,5076.49,3297.29,
75.000000,4203.26,2912.14,
76.000000,3767.02,2669.52,
77.000000,3614.52,2902.55,
78.000000,3362.68,3574.45,
79.000000,3345.3,4654.53,
80.000000,3322.51,7204.26,
81.000000,3563.19,10239.2,
82.000000,3671.84,12595.1,
83.000000,3873.34,13161.5,
84.000000,4599.81,12795.6,
85.000000,5883.02,10998,
86.000000,7916.86,8611.21,
87.000000,10036.2,6944.19,
88.000000,9641.35,5538.82,
89.000000,8515.33,4660.48,
90.000000,7183.46,4100.07,
91.000000,5822.94,3615.64,
92.000000,5028.66,3210.32,
