Frame number,1000000000,1000000001,1000000002,
0.000000,860.077,698.836,677.372,
1.000000,781.11,934.6,685.682,
2.000000,1023.42,1199.76,791.272,
3.000000,1264.65,1887.95,1060.6,
4.000000,1720.72,1706.48,1475.54,
5.000000,1755.12,2330.7,1550.03,
6.000000,1772.25,1652.4,1657.24,
7.000000,1568.04,1631.65,1509.69,
8.000000,1458.18,1199.25,1029.5,
9.000000,1324.45,1016.01,904.115,
10.000000,977,887.388,846.944,
11.000000,915.8,811.819,784.66,
12.000000,800.74,737.615,690.08,
13.000000,798.844,682.388,610.649,
14.000000,681.193,660.508,608.114,
15.000000,654.116,606.941,616.874,
16.000000,645.4,602.25,584.633,
17.000000,642.34,622.76,558.364,
18.000000,703.524,633.51,580.876,
19.000000,647.54,681.8,613.96,
20.000000,761.032,738.602,664.212,
21.000000,908.276,904.877,816.654,
22.000000,1190.18,1027.67,1027.22,
23.000000,1467.2,1274.88,1163.06,
24.000000,1498.5,1177.96,1292.91,
25.000000,1560.52,1005.15,1191.81,
26.000000,1439,1292,1047.49,
27.000000,1220.34,1127.11,985.95,
28.000000,1103.22,805.366,814.07,
29.000000,868.76,786.52,776.848,
30.000000,788.116,678.404,670.135,
31.000000,710.988,623.01,602.921,
32.000000,691.336,582.709,599.454,
33.000000,655.872,605.828,614.121,
34.000000,600.46,564.01,576.298,
35.000000,639.532,579.059,575.788,
36.000000,632.536,568.105,540.454,
37.000000,677.008,595.521,597.848,
38.000000,741.86,699.3,650.064,
39.000000,887.636,738.592,789.112,
40.000000,1133.27,859.623,979.704,
41.000000,1421.52,929.03,1104.83,
42.000000,1570.4,1033.3,1126.71,
43.000000,1700.27,1023.66,1084.92,
44.000000,1374.36,912.159,943.848,
45.000000,1166.04,884.428,847.432,
46.000000,989.564,718.092,685.592,
47.000000,898.6,694.85,713.122,
48.000000,792.912,633.124,626.863,
49.000000,761.184,592.358,602.179,
50.000000,654.028,589.446,586.001,
51.000000,642.98,566.928,575.038,
52.000000,605.4,602.046,554.983,
53.000000,616.372,547.518,552.23,
54.000000,601.12,600.504,599.124,
55.000000,642.36,616.662,641.176,
56.000000,753.616,672.212,700.8,
57.000000,925.556,795.987,832.331,
58.000000,1138.56,926.46,891.699,
59.000000,1369.39,1043.18,978.088,
60.000000,1429.58,1003.19,983.302,
61.000000,1412,961.072,1024.13,
62.000000,1273.23,920.505,860.43,
63.000000,1171.72,771.96,768.245,
64.000000,963.06,755.492,710.991,
65.000000,775.932,645.836,612.127,
66.000000,724.26,596.598,614.175,
67.000000,693.916,621.988,587.1,
68.000000,639.224,573.952,588.06,
69.000000,631.268,622.832,577.062,
70.000000,612.804,604.03,554.003,
71.000000,595.3,632.09,533.079,
72.000000,594.124,627.166,564.16,
73.000000,654.32,690.104,608.844,
74.000000,720.976,775.574,640.021,
75.000000,756.2,886.624,648.452,
76.000000,912.772,973.916,696.5,
77.000000,986.4,735.684,756.755,
78.000000,943.508,621.695,734.47,
79.000000,969.512,908.018,740.846,
80.000000,939.136,826.658,664.66,
81.000000,857.18,748.09,680.624,
82.000000,802.704,699.09,613.294,
83.000000,682.976,637.996,586.208,
84.000000,685.301,584.512,571.956,
85.000000,649.596,591.504,541.98,
86.000000,617.036,555.508,530.064,
87.000000,631.092,544.984,541.07,
88.000000,613.496,565.048,531.448,
89.000000,658.552,576.144,553.988,
90.000000,626.832,611.088,555.592,
91.000000,706.328,640.96,566.15,
92.000000,710.512,704.016,579.672,
93.000000,814.248,733.092,646.482,
94.000000,781.492,834.088,702.736,
