Time [s],1000000000,1000000001,1000000002,1000000003,
0.000000,606.22,665.001,658.896,851.787,
1.000000,655.107,721.4,710.092,997.86,
2.000000,563.98,603.902,673.045,747.832,
3.000000,516.888,557.418,592.902,684.856,
4.000000,491.06,533.42,525.969,574.897,
5.000000,482.016,531.506,509.074,576.1,
6.000000,467.476,493.563,524.051,558.985,
7.000000,452.5,503.924,512.94,525.945,
8.000000,467.48,498.513,495.936,520.977,
9.000000,463.978,508.5,520.031,558,
10.000000,483.492,511.015,514.993,584.904,
11.000000,500.536,513.504,505.95,606.58,
12.000000,532.512,589.61,590.898,667.975,
13.000000,561.504,661.207,661.938,780.938,
14.000000,656.532,714.024,788.933,903.193,
15.000000,683.99,707.576,805.04,888.87,
16.000000,668.41,682.955,787.842,819.938,
17.000000,563.032,629.067,634.056,766.854,
18.000000,499.505,561.1,556.992,635.01,
19.000000,487.452,519.088,520.954,547.03,
20.000000,477.005,501.04,491.056,522.052,
21.000000,452.475,499.508,502.015,509.977,
22.000000,467.492,481.074,480.99,491.912,
23.000000,455.996,468.97,468.956,475.006,
24.000000,445.016,452.508,474.992,490.022,
25.000000,473.52,486.446,493.96,522.904,
26.000000,478.48,489,503.045,526.03,
27.000000,486.506,495.5,512.991,527.964,
28.000000,478.062,541.44,539.02,568.064,
29.000000,543.504,586.05,605.01,630.844,
30.000000,560.056,648.44,635.069,693.1,
31.000000,568.522,647.611,676.027,729.095,
32.000000,566.04,611.1,627.957,718.816,
33.000000,547.506,571.936,574.99,630.928,
34.000000,491.988,500.912,515.024,548.984,
35.000000,458.476,478.95,484.022,519.032,
36.000000,452.006,476.98,473.042,488.042,
37.000000,447.985,476.022,460,481.08,
38.000000,443.936,457.958,452.98,490.084,
39.000000,451.976,445.008,451.96,466.982,
40.000000,434.979,448.999,445.972,459.05,
41.000000,459.488,486.96,465.955,480.994,
42.000000,460.04,486.975,485.964,501.982,
43.000000,471.013,487.992,475.994,507.958,
44.000000,496.97,528.126,515.954,556.984,
45.000000,524.03,580.967,568.938,622.119,
46.000000,541.1,643.344,629.097,681.993,
47.000000,559.136,639.103,604.079,688.464,
48.000000,525.2,634.944,582.991,624.884,
49.000000,484,557.026,535.92,584.08,
50.000000,449.005,495.024,485.036,516.49,
51.000000,445.054,461.505,451.032,491.456,
52.000000,431,453.001,444.999,473,
53.000000,429.04,451.456,446.007,461.476,
54.000000,432.94,445.456,444.05,460.512,
55.000000,431.023,436.016,436.016,459.54,
56.000000,428.002,436.988,436.024,431.06,
57.000000,437.96,471.492,466,472.512,
58.000000,468.02,462.49,479.02,483.468,
59.000000,466.955,486.99,479,482.506,
60.000000,481.5,534.454,516.06,542.54,
61.000000,524.05,567.56,553.872,585.496,
62.000000,526.462,590.998,562.968,637.926,
63.000000,529.028,601.501,589.04,634.114,
64.000000,514.888,577.044,541.072,598.056,
65.000000,474.962,514.992,494,521.95,
66.000000,456.988,465.48,461.974,482.004,
67.000000,440.05,450.55,433.972,458.04,
68.000000,431.492,442.488,446.026,452.966,
69.000000,427.488,434.999,445.048,462.011,
70.000000,414.985,453.976,435,455.988,
71.000000,435.002,432.516,431.008,453.974,
72.000000,420.026,428.997,437.128,433.008,
73.000000,444.996,445.487,447.999,477.079,
74.000000,452.492,463.036,462,472.977,
75.000000,460.492,474.569,497.056,507.08,
76.000000,480.5,493.04,493,530.03,
77.000000,512.928,534.08,525.06,537.054,
78.000000,523.048,546.982,538,578.048,
79.000000,508.924,541.952,542.013,588,
80.000000,501.024,514.996,520.022,552.029,
81.000000,469,483.053,475.982,511,
82.000000,443.06,445.056,438.964,473.944,
83.000000,431.996,442.992,440.964,460.04,
84.000000,434,442.031,442.008,442.972,
85.000000,430.987,436.532,436.022,439.048,
86.000000,431.926,432.984,431.164,427.016,
87.000000,424.012,429,424.986,427.03,
88.000000,419.984,421.022,418.016,434.004,
89.000000,444.993,450.992,446,461.019,
