Time [ms],1000000000,1000000001,1000000002,
0,8715.79,13949.7,4958.15,
1000000000,5127,7501.35,3364.19,
2000000000,4503.16,6157.11,2959.38,
3000000000,6526.17,8080.09,3992.87,
4000000000,9143.58,13868.6,5291.82,
5000000000,8596.6,17757.4,6366.61,
6000000000,8018.18,13054.2,6458.64,
7000000000,7039.76,10621.4,6000.05,
8000000000,5495.5,7356.66,5829.65,
9000000000,4640,5443.14,5443.96,
10000000000,4270.27,4060.25,5136.86,
11000000000,3635.42,3411.85,4206.17,
12000000000,3250.92,2784.35,4104.84,
13000000000,2984.23,2554.81,3346.8,
14000000000,2666.2,2036.84,3062.17,
15000000000,2441.66,1956.75,3336.62,
16000000000,2397.48,2149.25,2689.8,
17000000000,2500.63,2584.04,3072.84,
18000000000,2985.39,3446,3995.67,
19000000000,3981.59,4658.04,4768.43,
20000000000,4487.09,5375.68,5343,
21000000000,4887.37,6664.06,5760,
22000000000,4872.5,5640.36,5239.64,
23000000000,4497.74,5404.04,4319,
24000000000,3917.98,4261,3637,
25000000000,3686.82,3738.24,3328,
26000000000,3436.3,3433.81,2868.1,
27000000000,3015,3054.95,2662.45,
28000000000,2667.82,2713.95,2373.04,
29000000000,2474.04,2557.96,2223,
30000000000,2291.31,2352.4,2135.37,
31000000000,2081.26,2157.92,1956.5,
32000000000,1918.65,1945.8,1832.56,
33000000000,1949.18,2073.18,1894.25,
34000000000,2320.84,2299.9,2171.92,
35000000000,2715.1,2690.71,2579.42,
36000000000,3137.51,3200.51,3017.96,
37000000000,3549.8,3703.12,3328.38,
38000000000,3942.73,4104.29,3520.68,
39000000000,3869.88,4144.56,3533.77,
40000000000,3771.08,3917.59,3350.65,
41000000000,3446.1,3411.28,3061.67,
42000000000,2988.58,3115.95,2820.73,
43000000000,2690.83,2639.25,2413.05,
44000000000,2386.84,2215.98,2165.87,
45000000000,2178.23,2008.22,1912.7,
46000000000,1956,1867.59,1685.37,
47000000000,1961.75,1570.27,1710.26,
48000000000,1777.11,1443.91,1537,
49000000000,1696.1,1382.72,1441.11,
50000000000,1809,1502.06,1604.02,
51000000000,2093.07,1741,1624.72,
52000000000,2549.76,2094.16,1920.01,
53000000000,3096.32,2524.25,2060.17,
54000000000,3369.93,2901.66,2512.09,
55000000000,3749.98,3058.47,2558.93,
56000000000,3569.74,3215.64,2693.3,
57000000000,3252.84,3074.22,2565.91,
58000000000,2935.7,2668.69,2524.78,
59000000000,2441.88,2304.01,2286.1,
60000000000,2186.92,2053.59,2038.5,
61000000000,2031.98,1884.96,1959.56,
62000000000,1850.06,1693.73,1798.56,
63000000000,1679.36,1557.52,1668.33,
64000000000,1515.86,1470.73,1546.12,
65000000000,1445.88,1333.22,1399.58,
66000000000,1467.91,1376.83,1386.89,
67000000000,1658.18,1354.84,1351.92,
68000000000,2024.2,1534.99,1443.94,
69000000000,2450.08,1696.05,1546.97,
70000000000,3181.17,2116.24,1678.04,
71000000000,3702.5,2397.81,1938.1,
72000000000,3570.71,2556.06,2185.9,
73000000000,3169.92,2597.06,2328.16,
74000000000,2772.5,2577.14,2353.69,
75000000000,2352.46,2231.1,2204.99,
76000000000,2116.46,2118.6,2152.21,
77000000000,1909.01,1745.65,1953.89,
78000000000,1627.5,1654.08,1856.22,
79000000000,1553.51,1477.37,1630.08,
80000000000,1326.14,1357.48,1530.58,
81000000000,1278.99,1234.24,1465.25,
82000000000,1355.95,1251.97,1381.48,
83000000000,1563.92,1206.9,1278,
84000000000,1982.66,1262.97,1244.99,
85000000000,2612.61,1444.07,1251.99,
86000000000,3037.84,1602.07,1346.95,
87000000000,3595.65,1905.55,1438.92,
88000000000,3807,2151.84,1594.98,
89000000000,3500.84,2228.2,1743.04,
90000000000,2980.76,2318.24,2023.11,
91000000000,2522.86,2219.93,2070.6,
92000000000,2189.61,2070.17,2035.4,
93000000000,1967.88,1790.15,1903.16,
94000000000,1709.11,1554.18,1844.13,
95000000000,1520.22,1442.05,1669.02,
