Frame number,1000000000,1000000001,1000000002,1000000003,
0.000000,675.518,942,929.072,1066.45,
1.000000,615.485,769,728.894,754.2,
2.000000,622.069,781.78,786.223,759.944,
3.000000,762.528,874.584,981.157,824.165,
4.000000,770.32,1003.37,1032.47,1092.29,
5.000000,932.498,1031.12,1130.06,1157.7,
6.000000,908.832,1108.41,1154.54,1335.68,
7.000000,938.6,1219.66,1172.57,1434.19,
8.000000,898.012,1059.09,1122.73,1341.29,
9.000000,758.122,1119.24,1034.45,1157.14,
10.000000,725.512,934.105,883.323,1082.57,
11.000000,636.016,802.103,815.247,968,
12.000000,608.368,741.064,751.2,778.144,
13.000000,581.461,727.865,698.991,715.919,
14.000000,597.088,644.94,656.124,687.072,
15.000000,561.998,614.612,614.984,670.063,
16.000000,590.134,638.02,615.28,668.92,
17.000000,571.098,632.878,609.518,590.08,
18.000000,569.47,606.091,574.1,612.144,
19.000000,598.012,657.104,651.644,697.92,
20.000000,624.124,718.16,766.456,794.882,
21.000000,730.166,847.005,911.784,866.24,
22.000000,790.468,985.378,1013.15,1113.88,
23.000000,838.247,1013.44,1036.29,1209.82,
24.000000,929.868,982.48,1067.71,1245.32,
25.000000,928.996,1082.7,1195.96,1209.3,
26.000000,916.885,1093.38,1052.65,1176.53,
27.000000,935.745,985.522,1035.4,1228.06,
28.000000,842.61,946.921,1011.28,1096.43,
29.000000,757.026,797.638,943.448,908.488,
30.000000,754.01,746.632,824.884,817.06,
31.000000,696.352,758.604,736.866,725.323,
32.000000,629.368,689.179,742.086,675.91,
33.000000,613.033,654.883,684.632,626.935,
34.000000,587.121,626.961,636.396,597.164,
35.000000,523.88,570.953,624.936,607.076,
36.000000,543.1,551.004,585.6,591.003,
37.000000,553.928,588.101,577.504,572.042,
38.000000,547.047,588,578.625,629.474,
39.000000,591.064,572.016,610.488,657.144,
40.000000,657.08,639.92,655.096,756.888,
41.000000,709.032,700.096,709.987,817.55,
42.000000,692.7,739.115,766.806,823.048,
43.000000,697.08,794.022,821.824,855.154,
44.000000,687.376,768.13,816.048,879.82,
45.000000,671.412,771.1,772.936,936.718,
46.000000,707.52,754.896,853.85,925.528,
47.000000,654.495,704.084,816.772,902.202,
48.000000,669.112,684.06,821.021,832.76,
49.000000,641.016,665.344,809.5,802.74,
50.000000,638.484,608.041,730.516,738.52,
51.000000,587.52,689.026,699.18,702.98,
52.000000,598.008,662.1,685.882,630.544,
53.000000,579.4,619.95,648.574,589.96,
54.000000,575.453,610.072,651.872,592.52,
55.000000,584.008,583.088,592.92,582.525,
56.000000,544.995,568.01,573.424,591.01,
57.000000,578.478,579.026,578.475,545.5,
58.000000,574.12,555.121,593.44,577.962,
59.000000,601.088,622.052,588.963,598.526,
60.000000,662.928,649.526,618.85,687.975,
61.000000,655.052,704.821,705.13,740.864,
62.000000,635.448,655.856,701.066,760.642,
63.000000,655.296,800.92,769.512,733.25,
64.000000,644.936,748.867,709.12,738.026,
65.000000,599.144,720.014,684.548,753.6,
66.000000,593.412,693.923,655.312,693.112,
67.000000,581.95,641.022,661.6,703.1,
68.000000,560.068,606.758,631.48,662.53,
69.000000,535.548,597.065,609.56,637.992,
70.000000,533.574,563.938,600.436,606.5,
71.000000,555.072,565.91,587.092,586.1,
72.000000,534.98,540.97,587.96,598.552,
73.000000,528.96,551.92,594.976,523.432,
74.000000,504.456,547.09,606.88,532.564,
75.000000,508.392,545.971,559.826,525.94,
76.000000,505.992,522.102,527.058,543.492,
77.000000,492.516,522.018,542.026,518.9,
78.000000,535.068,521.103,553.057,534.92,
79.000000,568.024,564.94,559.048,559.015,
80.000000,592.51,600.892,557.916,572.549,
81.000000,599.972,628.14,618.094,611.072,
82.000000,612.568,624.75,620.94,619.06,
83.000000,630.444,613.251,673.032,618.944,
84.000000,630.216,698.903,654.208,652.176,
85.000000,613.208,671.016,635.946,667.416,
86.000000,582.198,627.108,645.772,635.68,
87.000000,567.11,632.96,624.112,609.988,
88.000000,534.058,607,593.932,593.605,
89.000000,513.912,582.597,580.01,553.036,
90.000000,505.956,551.6,603.87,548.108,
91.000000,504.04,556.936,587.882,527.52,
92.000000,505.924,529.01,568.005,511.548,
93.000000,497.016,509.972,532.99,512.952,
94.000000,486.987,498.08,524.04,500.09,
95.000000,471.968,496.9,512.05,488.536,
