Frame number,1000000000,1000000001,1000000002,1000000003,1000000004,
0.000000,540.998,602.992,697.16,705.104,573.968,
1.000000,578.008,558.502,644.04,669.088,591.955,
2.000000,537.01,566.98,638.991,640.12,598.945,
3.000000,533.072,550.032,618.96,606.12,599.056,
4.000000,516.936,541.976,585,597.928,543.021,
5.000000,488.964,512.98,563.984,549.516,558.5,
6.000000,488.98,490.96,530.975,523.976,523.05,
7.000000,469.024,480.492,501.486,518.09,508.97,
8.000000,465.504,473.484,487.496,492.04,514.05,
9.000000,449.494,464.004,491.048,484.52,482.968,
10.000000,449.488,456.484,470.528,475.472,495.492,
11.000000,436.99,459.052,466.013,476,469.504,
12.000000,444.97,454.013,449.983,456.992,481.005,
13.000000,446,434.024,456.004,457,466.986,
14.000000,448.004,449.528,458.04,455.026,481.992,
15.000000,447.999,443.044,444.981,461.045,469.05,
16.000000,451.965,463.988,472.974,480.996,486.995,
17.000000,452.978,475.984,470.04,483.976,486.03,
18.000000,461.022,476.032,516.988,504.04,502.033,
19.000000,467.006,481.496,519.086,509.078,495.004,
20.000000,465.984,482.48,488.98,493.95,512.024,
21.000000,460.504,473.992,503.974,501.006,486.55,
22.000000,458.512,468.52,503.032,490.5,496,
23.000000,450,467.951,482.969,487.004,490.004,
24.000000,453.009,469,480.984,469.99,475.018,
25.000000,440.976,461.016,475.018,474.024,464.485,
26.000000,432.008,450.948,462.968,456.977,451.976,
27.000000,436.016,446.994,465.06,458.992,451.013,
28.000000,438.98,449.99,451.044,454.512,441.98,
29.000000,430.982,433.48,450.044,447.996,443.52,
30.000000,438.968,445.552,449.96,445.52,448.988,
31.000000,434.025,450.084,454.998,452.992,460.508,
32.000000,439.008,448.043,466.964,464.52,468.976,
33.000000,446.02,455.976,479.016,466.98,458.99,
34.000000,447.996,455.472,476.988,477.496,457.983,
35.000000,441.996,462.508,472.058,463,470,
36.000000,442.999,462.468,474.016,481.013,459.982,
37.000000,447.024,454.532,473,482.962,463.042,
38.000000,434.018,458.464,472.025,469.021,469.035,
39.000000,440.992,455.989,464.035,471.002,474.988,
40.000000,442,451.99,475,459.962,458.03,
41.000000,439.984,446.046,470.025,451.993,455,
42.000000,435,446.987,457.994,462.98,461.992,
43.000000,435.024,436.52,459.002,451.995,455.024,
44.000000,428.008,435.492,444.017,448.996,442.986,
45.000000,421.003,431.996,460.978,436.96,446.992,
46.000000,433.995,437.97,453.96,452.988,433.996,
47.000000,435.038,451.996,459.982,457.964,446.013,
48.000000,442.029,451.51,470.988,470.962,450.968,
49.000000,442.996,449.008,463,469.96,448.024,
50.000000,433.993,445.52,468.94,469.012,451,
51.000000,433.977,454.448,454.04,471,463.99,
52.000000,441.005,447.005,453.032,462.025,457,
53.000000,435.02,446.978,456.952,464.977,454.02,
54.000000,435.01,448.028,457.968,441.017,457.016,
55.000000,440.999,445.986,453,449.99,468.04,
56.000000,429.976,449.974,445.964,447.046,451.967,
57.000000,438.032,447.96,455.016,456.974,445,
58.000000,443.014,444.012,456.024,451.992,447.994,
59.000000,429.992,444.048,443.992,449.969,445.504,
60.000000,438.036,439.974,453.013,452.992,442.517,
61.000000,434,445.016,450.004,455.981,436,
62.000000,434.993,443,453.02,458,434.952,
63.000000,436.01,445.528,463.984,457.02,457.988,
64.000000,434.016,444.511,456.5,468.984,455.984,
65.000000,438.01,441.503,467.015,467.989,448,
66.000000,439.004,449.996,461.02,461.018,449,
67.000000,436.995,451.5,457.012,460.98,449.994,
68.000000,437.027,447.02,455.998,462.98,446.517,
69.000000,430,442,449.99,446.023,442.016,
70.000000,429.52,447.047,449.998,444.045,452.496,
71.000000,421.001,435,441.984,452.015,435.508,
72.000000,434.02,439.968,446,448.984,452.5,
73.000000,422.012,434.97,447.985,446.994,439.992,
74.000000,437.02,433.992,451.98,440,438.51,
75.000000,430.011,442.036,453,443.988,447.496,
76.000000,432.956,447.032,443.961,453.996,440.464,
77.000000,442.99,446.02,446.982,455.002,442,
78.000000,443.016,437.024,446.032,472.026,448.48,
79.000000,438.024,441.06,460.97,472,453.479,
80.000000,443.008,445.018,458.034,464,447.51,
81.000000,427.002,440.024,451,466.96,449.488,
82.000000,437.025,447.01,460.514,463.974,447.016,
83.000000,435.996,448.023,458.012,458.03,455.963,
84.000000,437.978,434,453.984,454,443.004,
85.000000,413.055,451.99,454,459.004,449.976,
86.000000,438.984,437.044,451.006,447.028,439.024,
87.000000,436.988,435.986,437.978,431.974,443.98,
88.000000,434.974,439.02,443.976,441,446.02,
89.000000,431.991,434.018,442.006,443.018,448.008,
90.000000,432.993,431.002,441.952,440.972,449.512,
91.000000,438.008,433.99,448.98,444.984,437.488,
92.000000,431.008,440.02,447,452.993,446.974,
93.000000,437.981,435,459.952,460.013,452.008,
94.000000,423.002,448.022,451.048,467.978,463.484,
