Time [ms],1000000000,1000000001,1000000002,1000000003,1000000004,1000000005,
0,1341.19,1154,857.182,1237.82,798.98,967.016,
1000000000,813.46,731.48,581.975,768.936,580.07,833.016,
2000000000,711.416,600.48,497.96,660.024,520.04,798.048,
3000000000,678.027,571.945,481,606.038,465.996,837.169,
4000000000,701.042,573.905,476.996,605.015,481,847.008,
5000000000,676.964,566.977,459.492,583.02,482.024,845.596,
6000000000,662.944,592.02,459.988,583.504,466.998,830,
7000000000,659.008,596.584,456.977,578.056,453.992,881.018,
8000000000,691.5,614.452,447,607.012,456.004,891.156,
9000000000,644.98,731.146,450.494,574.584,473.032,958.091,
10000000000,642.896,740.528,451.512,666.12,474.002,969.094,
11000000000,670.004,735.186,462.984,737.976,484.971,1070.2,
12000000000,680.96,765.23,494.975,787.982,508.024,1107.03,
13000000000,698.96,745.096,529.008,716.924,537.015,1132.8,
14000000000,715.984,790.034,534.018,708.104,551,1146,
15000000000,664.504,737.494,513.485,746.93,546.008,989.888,
16000000000,691.98,768.98,526.94,743.86,566.96,963.165,
17000000000,694.02,755.998,544.52,791.104,595.99,989.906,
18000000000,702.54,714.988,542.496,841.016,596.048,1040.96,
19000000000,762.533,757.937,557.016,768.844,598.096,1079.52,
20000000000,807.544,815.13,561.982,827,585.016,1124.91,
21000000000,822.016,756.71,578.98,830.02,637.092,1093.04,
22000000000,878.542,809.262,594.994,854.08,664.968,1221.51,
23000000000,817.916,818.076,573.992,822.099,662.46,1235.08,
24000000000,870.508,751.03,583.068,812.016,649.024,1271.11,
25000000000,851.512,756.962,581.96,854.432,661.135,1327.93,
26000000000,833.467,753.867,599.05,790.832,660.952,1399.83,
27000000000,843.084,723.079,580.02,817.94,629.944,1432.01,
28000000000,839.138,759.085,564.496,771.11,641.962,1436,
29000000000,828.004,770.908,582.964,805.216,614.512,1420.99,
30000000000,815.89,714.636,566.472,757.11,632.011,1351.07,
31000000000,801.076,758.95,577.023,780.004,632.528,1346.19,
32000000000,812.864,749.96,588.05,748.048,600.128,1290.08,
33000000000,810.16,736.92,582.98,722.088,620.1,1207.54,
34000000000,819.476,692.914,597,738.002,615.472,1200.44,
35000000000,852.52,729.482,603.544,714.92,621.52,1136.94,
36000000000,851.976,743.488,628.984,751.464,673.452,1109.08,
37000000000,837.939,734.456,615.456,741.92,671.44,1077.99,
38000000000,831.04,704.944,630.512,809.92,649.904,1059.9,
39000000000,856.52,723.925,627.95,745.085,655.064,1067,
40000000000,808.51,732.038,656.512,748.98,691,1074.06,
41000000000,806.96,711.616,650.036,743.962,663.062,1082.08,
42000000000,815.942,717.05,646.016,753.996,641.976,1038,
43000000000,837.072,720.03,646.514,752.94,664.052,1077.86,
44000000000,829.942,697.036,628.984,777.008,658.004,1095.94,
45000000000,840.052,707.066,642.92,734.04,664.901,1127.6,
46000000000,837.604,677.972,633.52,732.9,632.952,1162.08,
47000000000,834.532,673.052,616.018,762.88,642.098,1170.56,
48000000000,829.92,678.968,619.536,786.93,636.98,1224,
49000000000,823.07,662.496,620.044,733.036,603.05,1223.93,
50000000000,814.5,647.96,610.936,741.18,625.017,1198,
51000000000,791.636,636.936,616.968,726.208,622.02,1172.02,
52000000000,794.05,646.002,606.968,709.88,651.94,1217.53,
53000000000,793.072,646.538,607.012,711,627.048,1114.97,
54000000000,783.53,632.96,593.982,799.05,637.924,1142.83,
55000000000,783.456,637.066,605.987,762.96,632.04,1080.01,
56000000000,784.052,620.096,587.02,786.08,629.076,1055.9,
57000000000,782.052,647.008,610,746.94,618.972,1005.09,
58000000000,798.04,626.536,585.02,755.02,628.872,1011,
59000000000,809.512,632,585,754.067,618.964,983.048,
60000000000,810.624,625.536,612.946,739.9,621.944,958.972,
61000000000,790.5,606.938,592.05,748.05,647,941,
62000000000,791.648,599.068,605.963,779.948,640.04,948.984,
63000000000,815.554,618,584.034,746.051,642.956,934.096,
64000000000,812.422,589.906,591.984,801.098,618.96,967.93,
65000000000,802.496,594,576.044,783.228,619,959.987,
66000000000,795.976,601.512,547.936,817.928,628.5,954.1,
67000000000,776.5,596.985,558.058,783.12,607.966,983.091,
68000000000,804.5,607.5,563.96,816.9,595.992,976.1,
69000000000,815.048,581.484,556.495,803.042,598.981,986.972,
70000000000,793.936,592.5,562.496,793.944,590.021,997.856,
71000000000,763.488,594.996,557.952,768.06,606.98,980.92,
72000000000,798.908,594.532,557.512,782.096,572.06,950.957,
73000000000,805.432,579.448,547.014,787.172,583.888,968.997,
74000000000,756.504,576.992,541.984,754.276,571.007,925.904,
75000000000,753.888,594,537.016,722.896,597.004,916.848,
76000000000,760.552,578.098,541.5,754.936,574.024,883.96,
77000000000,746,584.012,534.012,704.024,562.918,916.958,
78000000000,743.024,585.012,539.96,746.168,569.036,884.89,
79000000000,738.5,559.036,539.012,744.877,572.99,874.048,
80000000000,759.654,589.024,561.967,751.08,570.512,859.92,
81000000000,733.468,573.02,541.956,717.04,573.04,836.923,
82000000000,748,563.948,546.002,749.088,576.016,833.08,
83000000000,722.544,574.102,555.952,745.98,562.53,828.04,
84000000000,763.96,595.508,536.958,714.03,586.505,844.88,
85000000000,744.548,575.456,562.001,747.148,573.52,858.944,
86000000000,746.532,569.504,535.958,720.92,576.492,843.016,
87000000000,721.872,562.476,542.988,760.117,558.016,863.968,
88000000000,740.068,556.952,534.924,729.052,550.992,828.972,
89000000000,736.044,566.512,521,718.014,552.042,855.952,
90000000000,730.064,560.48,523.912,691.892,563.96,860.095,
91000000000,732.912,570.024,529.06,709.88,568.036,852.966,
92000000000,719.896,534.96,524.978,695.08,554.968,847.964,
93000000000,734.96,554.01,532.072,681.144,550.976,841.97,
94000000000,715.404,524.96,517.003,716.176,555.992,818.05,
95000000000,708.002,549.916,532.016,709.936,546.988,824.104,
