Time [ms],1000000000,1000000001,1000000002,1000000003,
0,4628.4,1954.08,1295.62,5954.18,
1000000000,3432.42,1603.05,1964.7,2580.9,
2000000000,3471.7,1574,1911.92,2705.88,
3000000000,4695.15,1923.09,3147.02,4967.37,
4000000000,6960.2,3089.91,2038.62,7389.85,
5000000000,8610.54,3817.65,2528.58,9210.38,
6000000000,9740.39,3909.65,3157.36,4679.02,
7000000000,8274.16,3871.66,4459.58,7526.34,
8000000000,8173.76,3933.74,4355.84,2685.5,
9000000000,7932.06,3882.49,4312.17,4845.8,
10000000000,7012.45,3591.38,4987.14,5782.06,
11000000000,6576.01,3470.96,3736.36,5538.23,
12000000000,6008.5,3351.09,3608.27,5013.16,
13000000000,5633.5,3563.22,3924.34,4756.74,
14000000000,4894.01,3029.18,5342.71,4275.32,
15000000000,4068.8,2975.75,5375.17,3916.9,
16000000000,4158.83,2679.91,4188.69,3940.51,
17000000000,3709.2,2382.98,4054.71,3657.42,
18000000000,3769,2535.75,4465.54,3607.03,
19000000000,2902.22,2436.03,4243.28,3752,
20000000000,3998.26,2456.8,4555.01,4377.25,
21000000000,4079.66,2463.34,4710.76,5304.44,
22000000000,4831.76,2928.94,4898.64,5933.69,
23000000000,5087.41,3065.88,5255.92,6221.63,
24000000000,4704.21,3097.09,4993.96,4699.44,
25000000000,3863.28,3160.05,4075.06,6055.8,
26000000000,3366,3129,2985.74,5958.2,
27000000000,3933.08,3039,4884.37,5223.21,
28000000000,4382.03,3056.07,4700.33,3607.9,
29000000000,3922.57,2955.49,4559.39,4121.38,
30000000000,4318.34,2855.77,4390.26,4269.08,
31000000000,3926.38,2943.15,4788.9,4193.68,
32000000000,2628.92,2797.24,4987.96,3578.72,
33000000000,2962.25,2552.29,5874.17,3651.19,
34000000000,3498.21,2376.78,5149.56,3476.6,
35000000000,2226.38,2398.42,4739.63,3131.18,
36000000000,2992.13,2294.38,4548.11,3165.7,
37000000000,2418.2,2276.98,3465.6,3007.71,
38000000000,3186.65,2290.51,3936.6,2830.24,
39000000000,2607.92,2219.11,3169.17,3182.85,
40000000000,2810.23,2233.65,3314.54,3401.49,
41000000000,3426.83,2188.88,3306.74,3680.64,
42000000000,3765.55,2267.25,3452.17,3874.29,
43000000000,3656.9,2260.47,3079.99,4038.37,
44000000000,3297.06,2359.21,3327.07,3842.19,
45000000000,2423.63,2410.29,3037.08,3879.99,
46000000000,3199.99,2290.85,3383.61,3910.3,
47000000000,2961.34,2284.95,3417.96,3966.33,
48000000000,3168.26,2255.22,3553.12,3902.19,
49000000000,3109.75,2189.85,3693.04,3832.3,
50000000000,2865.47,2762.31,3433.92,2707.52,
51000000000,3181.55,3043.97,3397.9,2668.66,
52000000000,2809.89,2375.07,3429.98,2016.52,
53000000000,2637.89,2263.94,3271.46,2243.44,
54000000000,2633.45,2117.8,3384.15,2305.02,
55000000000,2415.04,2138.27,3145.04,2371.75,
56000000000,2535.14,2087.84,2825.44,2139.74,
57000000000,2434.97,2076.12,2819.92,2242.75,
58000000000,2456.21,1974.39,2843.16,2356.79,
59000000000,2640.34,1949.95,2719.32,2479.02,
60000000000,2735.69,2338.24,2404.73,2505.35,
61000000000,2791.8,2221.25,2351.23,2373.1,
62000000000,2979.28,2212.65,2422.92,2548.73,
63000000000,3045.62,2296.95,2515.72,2786.79,
64000000000,3149.42,2391.05,2513.57,2628.37,
65000000000,2705.77,2886.53,2505.99,2683.66,
66000000000,2828.38,2816.38,2510.37,2670,
67000000000,2965.72,2497.67,2412.63,2367.36,
68000000000,2450.61,2333.55,2473.06,2328.84,
69000000000,2568,2742.1,2477.19,2334.65,
70000000000,2390.45,2514.15,2584.8,2230.62,
71000000000,2193.57,2406.91,2647.11,2333.6,
72000000000,2167.64,2400.32,2551.04,2063.04,
73000000000,2108.99,2438.88,2497,2069.38,
74000000000,2167.07,2447.08,2388.45,2150.2,
75000000000,2029.51,2316.2,2338.42,2095.83,
76000000000,1989.38,3036.13,2261.06,2072.91,
77000000000,2115.72,2960.82,2336.98,2237.55,
78000000000,2199.6,2826.92,2118.03,2185.1,
79000000000,2221.92,2855.12,2158.16,2417.37,
80000000000,2470.09,2658.12,2083.02,2546.96,
81000000000,2401.08,2643.47,2085.44,2718.29,
82000000000,2404.66,2651.88,2065.02,2767.16,
83000000000,2216.42,2641.35,2102.94,2877.63,
84000000000,2325.39,2856.41,2106.59,2832.08,
85000000000,2272.8,2815.22,2153.25,2960.28,
86000000000,2373.68,2891.42,2109,2815.15,
87000000000,1702.78,2831.22,2047.07,2773.5,
88000000000,1827,2789.68,2215.11,2639.28,
89000000000,1862.61,2973.94,2219.18,2631.84,
90000000000,1750.3,2883.2,2272.96,2799.58,
91000000000,1869.19,2883.12,2276.04,2548.23,
92000000000,1691.98,2760.84,2277.08,2515.47,
93000000000,1903.9,2810.15,2255.1,2597.28,
94000000000,1887.61,2800.12,2017.88,2560.27,
95000000000,1786.22,2829.87,2029.44,2494.54,
