Frame number,1000000000,1000000001,1000000002,1000000003,
0.000000,930.144,1088.14,1039.89,1036.24,
1.000000,1114.2,1958.96,1791.97,1666.54,
2.000000,1321.84,2104.76,2020.11,1935,
3.000000,1312.16,2206.47,2080.11,1939.6,
4.000000,1362.89,2175.03,2168.87,1875,
5.000000,1438.06,2053.01,2088.06,1743.59,
6.000000,1267.94,1960,1977.89,1587.64,
7.000000,1187.11,1774.93,1825.88,1471.13,
8.000000,1151.02,1688.23,1770.81,1256.21,
9.000000,1133.06,1618.02,1645.9,1245,
10.000000,1084.97,1484.7,1477.46,1169,
11.000000,1040.1,1443,1386.08,1104.06,
12.000000,1065.88,1418.8,1367.96,1117,
13.000000,957.884,1372,1341.91,1043.17,
14.000000,964.992,1360.19,1331.22,1005.21,
15.000000,985.88,1399.17,1329.19,986.088,
16.000000,1013.92,1416.51,1349.86,1061,
17.000000,1109.04,1513.28,1428.05,1132,
18.000000,1173.08,1627.18,1508.02,1117.12,
19.000000,1196.14,1664.97,1593.7,1270,
20.000000,1179.88,1672.96,1622.14,1158.28,
21.000000,1185.96,1650.18,1522.96,1195.1,
22.000000,1238.97,1583.93,1550.28,1203,
23.000000,1208.52,1599.08,1584.82,1160.72,
24.000000,1222.55,1620.06,1583.75,1261.85,
25.000000,1197.11,1606.1,1547.05,1249,
26.000000,1155.74,1534,1574.12,1130.86,
27.000000,1120.03,1511,1518.88,1045.8,
28.000000,1080.52,1437.08,1421.17,1026.25,
29.000000,1041,1370.11,1301.93,1022.12,
30.000000,1041.03,1324.05,1322.13,970.936,
31.000000,986.512,1268.08,1312,975.056,
32.000000,1042.09,1331,1224.98,961.04,
33.000000,1047.95,1280.88,1293.34,1040.18,
34.000000,1093.55,1354.66,1269.68,1126.12,
35.000000,1100.14,1398.05,1311.41,1207,
36.000000,1098.04,1380.6,1363.15,1117.2,
37.000000,1056.12,1359.58,1336.99,1140.14,
38.000000,1060.09,1355.92,1297.52,1081.1,
39.000000,1074.98,1418.2,1316.85,1077.22,
40.000000,1080.9,1382.04,1404.49,1143.83,
41.000000,1087.98,1372,1289,1071.02,
42.000000,1065.16,1354.01,1292.01,1054.34,
43.000000,995.856,1260.07,1254.17,1055.28,
44.000000,953,1243.94,1187.09,945,
45.000000,924.024,1146.16,1146.11,901.04,
46.000000,904.096,1070.82,1039.08,895,
47.000000,903,1013.06,1024.05,878.76,
48.000000,906,981.148,993.3,871.968,
49.000000,903,984.928,1018.46,838.916,
50.000000,928.92,963.98,956.032,896.046,
51.000000,943.88,964.056,991.032,910.18,
52.000000,970.102,956.138,1004.56,937.2,
53.000000,920.92,989.586,1034,892.254,
54.000000,915.92,1029.04,1011.09,958,
55.000000,954.888,1016.04,1022.04,928,
56.000000,924.036,973.41,990.925,921.916,
57.000000,880.068,989.552,1005.92,883.18,
58.000000,859.033,947.516,954.556,881,
59.000000,837.05,927.908,905.1,838.084,
60.000000,815.114,917,878.99,820.16,
61.000000,783.134,872.029,809.04,786.924,
62.000000,781.027,849.898,794.014,764,
63.000000,782.03,811.96,767.984,739.098,
64.000000,765.004,785.982,733.976,751.98,
65.000000,788.052,790.046,735.032,723.012,
66.000000,796,784.026,735.056,755.796,
67.000000,796.108,803.05,719.934,740.128,
68.000000,781.064,793.96,734.46,755.08,
69.000000,777.064,847.007,688.992,739.9,
70.000000,781.072,855.032,696.992,737.1,
71.000000,800.156,852.973,694.16,759.936,
72.000000,807.092,820.039,729.964,793.87,
73.000000,796.9,797.985,711.852,745.964,
74.000000,744.928,815.95,738.92,744,
75.000000,749.966,828.025,705.016,731,
76.000000,717.924,813.954,677.972,734,
77.000000,729.504,788.98,657.942,705,
78.000000,695.976,747.012,651.01,691,
79.000000,684.944,731.025,650.054,656.08,
80.000000,687.919,732.021,631.048,667.076,
81.000000,677.006,720.028,633.072,652.92,
82.000000,668,714,627.972,647.884,
83.000000,691.056,720.019,634.976,649.084,
84.000000,681.976,738.01,641.98,643,
85.000000,676.912,726.052,608.952,640.054,
86.000000,670.944,713.072,643.006,694.036,
87.000000,671.064,756.896,631,650.14,
88.000000,689.058,783.99,642.967,689.096,
89.000000,701.996,733.924,633.944,678.164,
90.000000,661.96,728.06,640.02,707.924,
91.000000,651.06,729.04,631.052,669.928,
92.000000,633.95,756.92,648.952,654,
93.000000,630.92,748,610.064,619.088,
94.000000,611.052,728,601.996,621.04,
