Time [s],1000000000,1000000001,1000000002,1000000003,
0.000000,2183.77,2730.81,2830.82,2892.08,
1.000000,2941.99,3735.21,4052.07,4660.77,
2.000000,2071.04,2746.34,3111.35,2953.45,
3.000000,1492.73,2167.16,2328.77,2100.99,
4.000000,1345.84,1773.2,1823.23,1620.55,
5.000000,1200.65,1472.44,1642.44,1402.57,
6.000000,1148.94,1362.29,1463.78,1141.09,
7.000000,1096.64,1221.97,1359.28,1081.6,
8.000000,978.088,1144.07,1291.07,1113.14,
9.000000,1051.38,1272.36,1444.35,1070.25,
10.000000,1041.22,1332.69,1455.16,1284.97,
11.000000,1114.93,1455.1,1393.99,1581.76,
12.000000,1392.05,1920.27,1613.95,2152.9,
13.000000,1859.82,2572.18,2074.9,2902.65,
14.000000,2301.03,2991.58,2790.51,3404.84,
15.000000,2415.81,3178.71,2972.3,3354.56,
16.000000,2363.29,2666.06,3034.2,3016.87,
17.000000,1750.01,1919.98,2243.6,1942.64,
18.000000,1400.06,1518.84,1751.27,1481.82,
19.000000,1281.43,1380.3,1553.3,1425.42,
20.000000,1172.9,1216.89,1456.46,1401.83,
21.000000,1135.86,1195.87,1371.22,1285.65,
22.000000,1062.5,1151.86,1257.08,1192.8,
23.000000,947.8,1077.92,1207.53,1083.77,
24.000000,990.04,996.976,1138.67,991.898,
25.000000,1084.96,1125.94,1135.7,1174.01,
26.000000,1108.88,1208.37,1232.22,1200.11,
27.000000,1080.93,1142.7,1194.3,1176,
28.000000,1121.95,1347.74,1324.08,1395.29,
29.000000,1358.4,1818.88,1682.79,2069.95,
30.000000,1695.83,2074.4,2109.87,2350.4,
31.000000,1864.13,2240.93,2140.03,2281.84,
32.000000,1827.44,2083.39,2233.21,1918.45,
33.000000,1461.34,1576.76,1839.55,1415.49,
34.000000,1268.2,1329.89,1462.75,1182.8,
35.000000,1106.41,1194.71,1289.84,1074.86,
36.000000,1049.06,1062.09,1145.33,978.514,
37.000000,999.556,1060.73,1025.24,995.962,
38.000000,966.16,986.391,1057.05,962.09,
39.000000,920.428,883.083,903.745,892.915,
40.000000,863.1,840.165,891.138,875.284,
41.000000,920.113,935.09,955.17,942.58,
42.000000,994.969,1010.48,1038.09,1073.23,
43.000000,1019.23,1019.46,1046.72,1055.41,
44.000000,1141.37,1185.54,1163.8,1197.29,
45.000000,1359.54,1587,1401.62,1507.86,
46.000000,1562.14,1951.25,1838.65,1771.29,
47.000000,1655.58,2011.79,1972.55,1892.12,
48.000000,1713.19,2132.62,2032.42,1921.69,
49.000000,1351.31,1628.09,1644.64,1541.08,
50.000000,1149.51,1198.69,1288.34,1114.21,
51.000000,999.088,1082.21,1120.7,993.885,
52.000000,934.964,997.89,1015.33,982.225,
53.000000,892.2,861.224,904.11,956.12,
54.000000,860.712,852.504,851.122,900.19,
55.000000,804.075,887.992,782.036,851.086,
56.000000,766.08,764.5,750.552,799.904,
57.000000,775.48,837.44,800.503,859.04,
58.000000,976.772,940.504,893.856,1041.24,
59.000000,946.93,900.596,891.696,937.696,
60.000000,1128.48,1046.34,1012.58,1029.35,
61.000000,1363,1387.98,1256.4,1347.1,
62.000000,1676.35,1744.54,1585.17,1644.82,
63.000000,1587,1968.26,1834.96,1815.03,
64.000000,1662.44,1864.81,1889.56,1798.56,
65.000000,1359.47,1465.98,1518.94,1435.91,
66.000000,1087.79,1152.64,1177.92,1174.98,
67.000000,942.05,994.1,1041.9,947.827,
68.000000,854.83,936.682,953.36,873.969,
69.000000,827.952,854.08,867.175,842.869,
70.000000,781.914,805.105,815.348,788.13,
71.000000,714.948,760.926,752.79,741.125,
72.000000,695.952,719.07,700.196,706.03,
73.000000,733.008,783.07,726.018,777.981,
74.000000,823.835,852.969,838.066,945.318,
75.000000,819,846.06,848.125,920.4,
76.000000,913.864,1094.98,923.12,1002.16,
77.000000,1152.8,1476.72,1213.19,1371.16,
78.000000,1415,1932.59,1569.02,1595.85,
79.000000,1455.32,2067.58,1789.59,1781.05,
80.000000,1494.76,1868.85,1681.13,1727.41,
81.000000,1206.86,1468.34,1528.9,1390.66,
82.000000,926.952,1148.4,1151.53,1067.81,
83.000000,889.872,1023.8,961.386,891.036,
84.000000,804.9,941.952,913.99,817.2,
85.000000,747.875,868.046,813.045,791.905,
86.000000,702.968,782.08,757.41,730.09,
87.000000,662.1,708.888,717.131,723.4,
88.000000,651.04,652.22,699.925,667.5,
89.000000,703.104,697.906,770.26,690.005,
