Frame number,1000000000,1000000001,
0.000000,712.432,618.958,
1.000000,662.476,678.865,
2.000000,745,729.576,
3.000000,876.507,819.425,
4.000000,857.862,854.87,
5.000000,794.99,819.997,
6.000000,684.085,764.168,
7.000000,673.012,660.452,
8.000000,629.56,590.664,
9.000000,568.012,555.6,
10.000000,539,549.998,
11.000000,513.016,515.984,
12.000000,510.106,506.86,
13.000000,500.988,514.984,
14.000000,488.488,484.072,
15.000000,497.544,482.444,
16.000000,493.512,477.008,
17.000000,507.968,468.068,
18.000000,541.12,488.974,
19.000000,572.073,514.538,
20.000000,626.901,571.912,
21.000000,676.884,578.091,
22.000000,688.246,613.85,
23.000000,680.111,626.927,
24.000000,659.116,602.928,
25.000000,617.016,586.038,
26.000000,551,568.88,
27.000000,508.984,554.553,
28.000000,512.048,521.08,
29.000000,514.04,491.09,
30.000000,496.955,483.973,
31.000000,476.024,480.008,
32.000000,469.934,462.987,
33.000000,470,450.044,
34.000000,458.963,455.073,
35.000000,476.018,462.976,
36.000000,484.008,481.01,
37.000000,503.973,473.044,
38.000000,513.056,492.1,
39.000000,561.944,496.02,
40.000000,600.964,500.975,
41.000000,616.108,534.07,
42.000000,613.008,550.939,
43.000000,596.017,564.956,
44.000000,554.973,524.99,
45.000000,525.08,522.012,
46.000000,536.031,500.114,
47.000000,515.971,492.05,
48.000000,493.964,473.92,
49.000000,488.002,468.024,
50.000000,475.966,450.017,
51.000000,474.974,450.948,
52.000000,457.036,452,
53.000000,468.054,456.976,
54.000000,465.024,442.958,
55.000000,467.05,448.096,
56.000000,488.05,466.012,
57.000000,484.98,469.991,
58.000000,524.006,461.874,
59.000000,543.95,491.1,
60.000000,532.047,506.83,
61.000000,533.09,514.015,
62.000000,531.005,494.079,
63.000000,533.04,513.952,
64.000000,509.928,496.12,
65.000000,481.013,483.965,
66.000000,482.995,475.92,
67.000000,476.968,465.052,
68.000000,463.028,449.024,
69.000000,451.084,448.112,
70.000000,445.97,442.036,
71.000000,446.04,433.96,
72.000000,445.06,435.976,
73.000000,452.042,446.077,
74.000000,440.99,451.975,
75.000000,467.998,451.466,
76.000000,460.976,447.51,
77.000000,458.956,443.99,
78.000000,474.99,466.978,
79.000000,502.944,471,
80.000000,497.064,484.046,
81.000000,510.96,471.024,
82.000000,499.98,474.044,
83.000000,481.017,466.92,
84.000000,471,458.96,
85.000000,467.036,462.988,
86.000000,454.48,443.024,
87.000000,444.928,445.992,
88.000000,452.002,440.981,
89.000000,440.487,449.964,
90.000000,438.992,442.999,
91.000000,438.524,438.048,
92.000000,444.033,438.992,
93.000000,446.5,444.998,
94.000000,440,431.006,
