Frame number,1000000000,1000000001,1000000002,
0.000000,4104.87,6504.74,9272.63,
1.000000,2823.57,3157.35,4736.07,
2.000000,2856.71,3537.64,3304.26,
3.000000,3665.75,4773.97,3797.38,
4.000000,4879.31,6317.95,4707.84,
5.000000,6101.03,7012.32,4955.36,
6.000000,6223.77,6003.89,4489.81,
7.000000,5095.24,4773.3,4111.33,
8.000000,4405.47,3998.88,3775.25,
9.000000,3634.97,3154.75,3137.59,
10.000000,3011.52,2517.69,2437.21,
11.000000,2664.5,2146.44,2091.02,
12.000000,2262.91,1869.35,1777.25,
13.000000,2090.56,1550.22,1564.29,
14.000000,1782.85,1440.73,1472.13,
15.000000,1750,1347.07,1439.33,
16.000000,1501.2,1273.92,1223.76,
17.000000,1458.12,1196,1074.15,
18.000000,1374.47,1144.14,1034.18,
19.000000,1467.33,1222.8,1084.86,
20.000000,1627.65,1334.86,1081.07,
21.000000,1945.55,1618.7,1385.11,
22.000000,2458.12,1917.94,1749.35,
23.000000,2897.41,2449.02,2228.46,
24.000000,3208.62,2634.08,2371.41,
25.000000,2877.19,2391.33,2404.25,
26.000000,2612.23,2038.72,2168.47,
27.000000,2211.4,1814.88,1958.43,
28.000000,1880.31,1648.82,1614.78,
29.000000,1634.27,1437.42,1396.8,
30.000000,1483.79,1271,1264.02,
31.000000,1348.57,1195,1152.08,
32.000000,1224,1036.14,1057.02,
33.000000,1093.86,1012.3,1069.06,
34.000000,1056.08,968.474,916.178,
35.000000,962.943,911.384,999.801,
36.000000,1118.15,829.09,928.891,
37.000000,978.152,826,944.042,
38.000000,1109.35,918.452,950.119,
39.000000,1314.14,986,1033.14,
40.000000,1442.5,1359.12,1174.91,
41.000000,1702.12,1525.82,1334.81,
42.000000,1823.96,1702.71,1542.51,
43.000000,1856.94,1829.03,2016.92,
44.000000,1750.64,1743.49,1869.27,
45.000000,1740.57,1631.53,1790.47,
46.000000,1550.99,1409.96,1474.67,
47.000000,1392,1264.2,1283.86,
48.000000,1223.9,1171,1191.02,
49.000000,1158.04,1118.82,1028.89,
50.000000,987.81,1036.03,1036.96,
51.000000,1014.19,1002.75,965.198,
52.000000,927.969,915.416,986.818,
53.000000,840.086,860.208,924,
54.000000,905.02,801.34,931.248,
55.000000,896,858.128,879.084,
56.000000,975.996,879.892,898.286,
57.000000,1119.11,992.58,946.002,
58.000000,1149.09,1100,973.912,
59.000000,1247.82,1159.01,1120.72,
60.000000,1303.9,1273,1245.62,
61.000000,1352.08,1267.46,1273.29,
62.000000,1378.85,1261.97,1327.62,
63.000000,1399.05,1293.17,1243,
64.000000,1428.95,1268.58,1155.06,
65.000000,1284.92,1198,1063.81,
66.000000,1265.16,1197.14,1038.05,
67.000000,1169.29,1042,1012.14,
68.000000,1025,1054,988.296,
69.000000,1023.22,978.944,920.032,
70.000000,891.168,888.832,946.132,
71.000000,896.496,873.039,837.9,
72.000000,863.552,830,887.18,
73.000000,880.598,859.132,782.124,
74.000000,917.54,893.872,822.971,
75.000000,918.153,937.172,855.135,
76.000000,1012.74,1044.66,827.772,
77.000000,1040.19,1118.84,938.128,
78.000000,1030.87,1138.02,932.947,
79.000000,1028.16,1139.76,935.235,
80.000000,1045,1101.85,905.977,
81.000000,1033.97,1106.9,893.015,
82.000000,932.128,1056.07,963.89,
83.000000,1012.92,1038.88,989.183,
84.000000,969.99,1001.07,946.994,
85.000000,978.959,875.2,966.024,
86.000000,836.12,957.952,980.54,
87.000000,831.98,901.83,907.959,
88.000000,763.03,875.08,835.404,
89.000000,769.901,827.552,803.096,
90.000000,852.06,787.06,784.956,
91.000000,759.208,812.182,752.95,
92.000000,786.144,878.028,751,
93.000000,847.06,906.152,743.875,
94.000000,810.13,854.078,793.491,
95.000000,791.584,865.06,819.88,
