
Intensity Median
 ==================== 
Time [s],1000000000,1000000001,1000000002,1000000003,1000000004,1000000005,1000000006,
0.000000,686.104,716.96,736.208,948.817,835,807.04,667.016,
1.000000,761.988,708.072,737.5,1049.8,851.024,808.031,661.544,
2.000000,679.956,693.898,632.81,937.12,807.094,793.07,654.038,
3.000000,627.55,663.921,574.448,946.486,819.128,762.974,725.452,
4.000000,676,737.992,605.549,987.004,840.196,915.876,906.512,
5.000000,804.968,973.51,679.88,1060.28,1145.03,1158,1167.52,
6.000000,874.952,1170.09,796.252,1217.78,1435.45,1262.95,1342.33,
7.000000,921.88,1237.98,843,1294.16,1626.91,1294.49,1588,
8.000000,1046.95,1256.73,937.782,1293.76,1643.05,1490.25,1865.7,
9.000000,1022.95,1252.13,893.354,1331.28,1771,1454.22,1831.2,
10.000000,1039.1,1194.96,994.808,1371.46,1707.47,1456.76,1763,
11.000000,1038.16,1143.28,919.88,1394,1591.78,1424.38,1809.74,
12.000000,1057.1,1045.96,928.328,1302.76,1516.14,1358.16,1648.08,
13.000000,978.056,1034.46,938.672,1197.29,1361.18,1278.98,1499.11,
14.000000,951.846,1002.26,920.97,1168.31,1309.26,1190.01,1448.67,
15.000000,898.936,897,787.944,1039.12,1106.8,1079.83,1192.01,
16.000000,832.984,875.28,785,938.62,1119.95,999.928,1157.34,
17.000000,802.116,832.586,740,921.144,979,995,1016.94,
18.000000,773.908,847.084,717.978,913,921.044,915.956,987.85,
19.000000,751.108,797,759.085,843,840.094,877.973,891.915,
20.000000,716.97,786.112,676.988,870,777.2,822.982,884.846,
21.000000,683.088,796.07,694.216,821.19,778.9,821,856.122,
22.000000,656.05,751.122,660,789.96,762.96,732.988,814.96,
23.000000,637.04,689.06,691.007,831.736,731.95,749.021,845.246,
24.000000,621.039,723.982,679.091,843.96,781.136,750.97,889.88,
25.000000,645.032,758.082,682.152,865.144,897.15,809.007,1039.93,
26.000000,723.482,761.996,764.14,960.064,1067.85,906.6,1107.29,
27.000000,748.984,868.111,728.926,998.272,1070.2,961.99,1145.95,
28.000000,744.52,874.092,776.076,953.96,1117.84,1009.86,1141.33,
29.000000,751.888,880.96,868.192,933.24,1089.85,1017.19,1067.22,
30.000000,758.092,826.976,855.17,963.244,1071.26,946.564,1117.84,
31.000000,772.472,890.996,804.175,921.806,992.242,950.608,1096.92,
32.000000,744.096,887.968,790.2,858.088,1051,953.272,1005.94,
33.000000,750.96,843.972,822.2,819.24,1005.2,932.096,987.172,
34.000000,725.148,812,735.198,839.148,959.1,885.882,956.959,
35.000000,696.984,787.916,721.157,797.98,902.154,861.509,910.88,
36.000000,644.952,720.974,706.724,733.898,827.041,780.924,835.1,
37.000000,614.968,672.88,728.118,694.06,760.186,721.992,805.098,
38.000000,605.96,663.02,649.14,672.904,704.15,680.059,678.784,
39.000000,577.024,598,647.104,706.98,695.15,675.932,682.842,
40.000000,572.016,614.932,639.05,650.04,691.96,646.99,680.063,
41.000000,565.942,614.12,646.975,642.02,646.936,659.032,654.005,
42.000000,540.048,608.12,610.932,633.08,632.872,627.104,664.973,
43.000000,554.993,597.04,596.992,677.86,635.052,632.072,669.984,
44.000000,550.034,627,630.2,696.524,693.066,622.08,682.096,
45.000000,567.025,652.468,651.984,731.056,749.048,693.112,746.935,
46.000000,586.008,668.976,606.99,727.98,727.08,693.11,780.15,
47.000000,596.93,644.04,685.084,676.888,729.94,734.496,781,
48.000000,584.054,674.936,667.984,724.976,752.948,757.002,901.34,
49.000000,571.95,659.874,628.944,674,771,716.012,845.128,
50.000000,588,690.929,648.084,678.96,784.896,748.024,793.1,
51.000000,583.932,673.06,691.064,645.002,745.896,781.928,769.414,
52.000000,562.064,638.062,652.092,630,698.866,758.896,756.96,
53.000000,547.976,614.986,678.987,622.045,716.944,724.96,728.088,
54.000000,540.08,635.914,618.122,576.01,681.956,738.103,673.06,
55.000000,540.97,618.065,606.104,593.028,621.024,663.904,636.068,
56.000000,519.05,581.034,584.085,576,601,617.996,603,
57.000000,531.012,577.032,589.018,557.076,598.968,633.14,618.938,
58.000000,513.002,540.947,532.056,558.016,596,590.896,584.98,
59.000000,511.52,562.024,540.54,558.93,566.872,584.06,586.984,
60.000000,516.968,531.945,544.012,531.96,590.464,577.06,581,
61.000000,507.944,545.008,549.04,536.046,597,585.496,578.066,
62.000000,515.482,530,561.964,553.056,598,582.552,574.988,
63.000000,518.064,524.007,558.112,546.992,605.032,586.064,596.04,
64.000000,492.008,528.04,553,553,622.44,581.944,586.031,
65.000000,501.022,539.021,567.934,537.024,641.904,581.12,565.021,
66.000000,514.98,523.488,576.066,559.94,644.012,631,565.008,
67.000000,509.964,541.962,591.038,555.041,638.528,599.488,536.058,
68.000000,508.02,533.03,606.88,533.026,640,603.44,605.96,
69.000000,515.504,535.025,574.1,546,689.98,614,558.964,
70.000000,499.486,516.962,574.918,553.004,667.516,597.08,552.084,
71.000000,495.01,537.04,544.003,547.964,660.048,585,578.973,
72.000000,499.984,529,525.96,537,649.972,604.978,541.048,
73.000000,498.988,534.008,533.968,525.976,633.548,591.492,533,
74.000000,484.976,524.92,553.07,505.964,593.112,568.944,535.864,
75.000000,488.012,522.036,533.006,508.952,558.038,546.018,515.989,
76.000000,497.56,528.41,539.99,496.04,558.002,530,511.02,
77.000000,485.012,502.07,535.98,516.02,573.912,538.06,506.08,
78.000000,472.036,531.464,548.95,507.977,586.968,552.056,521.978,
79.000000,494.008,530.05,541.912,513.024,573.96,563.028,507.03,
80.000000,475.992,519.912,502.942,515.961,571.05,539.05,516.951,
81.000000,484.996,506.008,508,508.01,568.984,530.972,523.032,
82.000000,470.486,509.056,533.036,477.975,567.052,549.004,520.08,
83.000000,479.024,512.04,523.996,497.07,564.96,534.968,499.96,
84.000000,483.474,503.032,517.015,493.964,563.01,530.95,466.992,
85.000000,475.536,513.032,524.044,498.052,581.996,546.069,502.032,
86.000000,466.965,511.97,527.052,500.04,572.064,540.997,512.915,
87.000000,457.514,503.928,515.052,496.052,585.968,521.96,494.987,
88.000000,464.54,502,514.052,490.99,543.978,509,504.464,
89.000000,468.984,514.046,504.97,484.03,587.945,528.894,496.008,
90.000000,460.471,505.09,502.936,479.06,574.976,526.021,499.958,
91.000000,468.019,491.021,496.884,479.04,550.974,511.964,507.999,
92.000000,448.008,505.52,501.976,477.989,557.012,519.026,478.96,
93.000000,444.008,520.044,484.996,485.056,543.056,526.062,489.048,
94.000000,452.04,500.971,498.024,481.504,528.992,520.97,484.926,
95.000000,467,500,500.051,480.012,529.11,516,473.96,
