Frame number,1000000000,1000000001,1000000002,
0.000000,639.046,610.288,558.161,
1.000000,632.88,664.921,599.252,
2.000000,719.979,737.744,671.152,
3.000000,858.23,799.038,727.398,
4.000000,867.256,801.997,803.055,
5.000000,840.782,777.06,758.05,
6.000000,727.04,675.022,672.057,
7.000000,629.156,579.152,570.065,
8.000000,565.958,574.992,525.994,
9.000000,553.08,526.071,485.973,
10.000000,517.03,518.016,491.076,
11.000000,513.505,503.992,493.966,
12.000000,504.968,493.932,481.06,
13.000000,483.504,478.039,477.028,
14.000000,484.012,471.008,475.972,
15.000000,481.03,478.52,456.094,
16.000000,476.54,478.035,475.01,
17.000000,486.018,480.514,458.987,
18.000000,497.52,487.039,488.98,
19.000000,514.5,514.036,507.017,
20.000000,548.968,531.03,535.008,
21.000000,574.6,575.5,574.025,
22.000000,639.088,609.544,581.984,
23.000000,643.12,625.5,611.044,
24.000000,665.054,678.984,618.424,
25.000000,628.065,633.441,611.94,
26.000000,587.923,564.94,574.996,
27.000000,528.1,530.968,521.416,
28.000000,486.972,504.44,502.448,
29.000000,498.96,492.522,478.496,
30.000000,489.052,482.012,484.512,
31.000000,474.006,482.025,484.034,
32.000000,483.464,487.508,469.515,
33.000000,483.524,486.02,477.012,
34.000000,486.54,484.984,484.06,
35.000000,489.944,473.952,485.52,
36.000000,468.024,478.998,472.512,
37.000000,482.006,484.032,474.964,
38.000000,486.976,476.04,482.01,
39.000000,491.024,482.952,486.494,
40.000000,521.016,480.944,513,
41.000000,538.984,513.982,526.022,
42.000000,550.476,525.056,550.056,
43.000000,548.468,535.05,556.563,
44.000000,561.02,552.053,585.452,
45.000000,519.96,542.975,538.52,
46.000000,498.532,518.042,531,
47.000000,505,512,483.007,
48.000000,481,491.96,489.986,
49.000000,487.04,473.965,467.488,
50.000000,477.008,478.993,472.94,
51.000000,474,476.03,467.014,
52.000000,460.032,468.03,469.516,
53.000000,465.008,463.973,464.01,
54.000000,463.052,468.992,468.532,
55.000000,473.992,462.011,469.002,
56.000000,462.512,464.988,470.516,
57.000000,469.984,472.99,478.52,
58.000000,488.501,470.95,485.476,
59.000000,489.942,481.993,493.036,
60.000000,490.948,480.994,497.984,
61.000000,498.964,487.006,483.028,
62.000000,516.944,489,501.52,
63.000000,509.02,489.978,497.05,
64.000000,517.011,488.05,504.506,
65.000000,499.528,496.995,506.506,
66.000000,505.02,491.982,489.472,
67.000000,481.991,475.028,485,
68.000000,465.009,472.52,474.028,
69.000000,471.008,470.512,471.532,
70.000000,458.02,459.52,471.004,
71.000000,463.984,459.032,470.05,
72.000000,448.968,439.992,466.04,
73.000000,454.98,466.024,455.985,
74.000000,454.992,473,467.992,
75.000000,473.024,470.502,471.03,
76.000000,480.971,471.504,473.04,
77.000000,482.008,478.55,464.046,
78.000000,486.986,468.08,468.484,
79.000000,477.92,450.501,461.476,
80.000000,473.022,467.504,465.5,
81.000000,473.976,470.536,463.52,
82.000000,477.973,469.977,471.04,
83.000000,489.015,479.016,463.511,
84.000000,475.96,466.514,475.02,
85.000000,475.02,471.026,483.972,
86.000000,471.501,465.476,488.008,
87.000000,460.48,480.008,476.976,
88.000000,453.01,477,479.018,
89.000000,458.016,473.972,470.492,
90.000000,451.99,471.975,455.032,
91.000000,456.985,466.972,463.5,
92.000000,464.034,467.977,479,
93.000000,460.008,468.987,473.52,
94.000000,474.004,468,470.888,
95.000000,469.004,470.961,475.983,
