Time [ms],1000000000,1000000001,1000000002,1000000003,
0,589.13,561.1,513.882,513.03,
1000000000,676.111,631.408,580.48,568.98,
2000000000,814.664,796.836,708.555,637.002,
3000000000,1003.83,1163.2,896.82,794.456,
4000000000,1449.43,1447.57,1021.98,976.94,
5000000000,995.384,1026.1,1021.33,1041.06,
6000000000,1512.13,961.4,936.104,940.444,
7000000000,1414.76,862.76,964.904,997.093,
8000000000,1393.41,823.28,749.106,830.228,
9000000000,1215.59,800.078,744.904,830.928,
10000000000,1190.51,748.946,741.96,786.969,
11000000000,1103.7,724.024,744.824,714.072,
12000000000,1016.21,757.84,767.072,688.968,
13000000000,752.865,600.984,714.476,713.424,
14000000000,719.802,601.08,682.491,669.914,
15000000000,633.113,610.969,606.42,593.994,
16000000000,659.924,572.204,594.97,608.883,
17000000000,604.07,534.064,576.47,611.524,
18000000000,651.1,557.902,562.064,617.174,
19000000000,711.97,580.508,602.008,648.074,
20000000000,788.905,653.62,626.004,719.062,
21000000000,897.804,749.36,633.027,763.884,
22000000000,1022.07,819.612,717.304,802.9,
23000000000,1108.58,814.008,734.07,823.964,
24000000000,1062.15,718.163,742.131,773.97,
25000000000,1070.86,688.912,717.738,828.01,
26000000000,848.772,730.86,707.075,808.93,
27000000000,842.05,705.7,678.01,729.059,
28000000000,789.776,678.14,668.043,683.948,
29000000000,680.368,648.93,638.893,676.968,
30000000000,676.306,627.09,628.125,615.072,
31000000000,636.496,614.544,586.935,603.028,
32000000000,620.572,613.104,582.021,579.006,
33000000000,605.952,600.48,545.889,577.975,
34000000000,626.096,624.504,563.89,575,
35000000000,610.944,621.946,556.093,576.98,
36000000000,596.508,587.536,553.125,573.08,
37000000000,625.02,597.49,550.993,575.041,
38000000000,646.505,620.022,608.972,622.932,
39000000000,676.15,682.904,601.943,661.992,
40000000000,751.08,726.9,660.056,698.168,
41000000000,771.125,764.752,675.05,677.036,
42000000000,800.704,787.18,688.237,668.032,
43000000000,784.752,660.031,692.163,712.518,
44000000000,789.612,608.016,679.992,671.488,
45000000000,728.919,663.024,679.158,660.448,
46000000000,699.072,646.1,661,602.042,
47000000000,670.858,606.984,619.937,604.508,
48000000000,647.088,602.105,607.603,594.052,
49000000000,662.164,584.064,613.518,601,
50000000000,680.976,599.052,564.924,604.025,
51000000000,652.002,598.923,577.888,581.038,
52000000000,652.011,554.935,536.992,554.04,
53000000000,661.95,571.97,562.109,557.041,
54000000000,600.565,584.98,573.935,579.04,
55000000000,622.505,570.05,532.025,568.012,
56000000000,671.025,612.508,569.004,581.06,
57000000000,670.954,634.04,536.96,600.952,
58000000000,671.972,675.028,536.982,607.092,
59000000000,697.02,688.984,619.952,625.974,
60000000000,689.112,662.144,566.072,615.024,
61000000000,704.044,613.033,581.956,602.899,
62000000000,663.88,625.046,609.968,563.52,
63000000000,608.54,542.066,570.904,552.09,
64000000000,604,600.918,588.928,587.025,
65000000000,656.544,624.992,583.01,555.081,
66000000000,599.52,558.942,569.98,588.994,
67000000000,599.024,599.036,571.965,545.944,
68000000000,629.94,547.016,585.074,590.85,
69000000000,627.392,577.003,560.064,534.038,
70000000000,589.048,567.985,567.104,550.022,
71000000000,591.96,558,582.1,549.032,
72000000000,592.976,570.112,545.88,541,
73000000000,588.026,581.884,532.007,584.991,
74000000000,650.1,602.056,573.986,564.012,
75000000000,642.96,549.92,544.954,585.5,
76000000000,607.093,610.09,541.966,606.088,
77000000000,651.884,609.046,563.93,559.492,
78000000000,638.078,600.012,601.96,583.006,
79000000000,644.024,602,575.94,596.058,
80000000000,643.942,590.056,571.984,557.104,
81000000000,629.125,577.98,570.992,544.952,
82000000000,586.146,589.009,553.54,562.976,
83000000000,570.2,576.003,530.1,550.977,
84000000000,569.978,562.935,542.058,530.939,
85000000000,600.922,563.945,528.978,529.044,
86000000000,560.044,526.952,573.52,522.928,
87000000000,562.028,561.947,541.064,530.965,
88000000000,575.96,529.065,517.988,518.022,
89000000000,558.037,549,519.966,547.937,
90000000000,540.916,557.09,545.968,528,
91000000000,571.944,558,516.056,505.9,
92000000000,577.88,566.945,531.1,523.008,
93000000000,567.06,545.047,534.96,505.028,
94000000000,574.03,526.855,562,515.008,
95000000000,598.932,537.444,581.956,532.596,
