Time [ms],1000000000,1000000001,1000000002,
0,49423.8,26849.1,23800.2,
1000000000,14371.5,12536.1,6630.84,
2000000000,5591.68,7333.21,3986.34,
3000000000,2814.43,6351.95,3406.26,
4000000000,1856.72,4853.93,2983.47,
5000000000,1366.72,3731.09,2752.4,
6000000000,1051,3204.58,2440,
7000000000,960.844,2768.09,2265.75,
8000000000,822.688,2458.79,2112,
9000000000,845.85,2143.26,1861.88,
10000000000,823,1769.03,1632.74,
11000000000,828.848,1669.91,1517.45,
12000000000,875,1442.31,1393.09,
13000000000,1011.98,1403.97,1283.29,
14000000000,1069.76,1500.36,1251.25,
15000000000,1353.34,1578.93,1292.14,
16000000000,1573.67,1619.51,1472.78,
17000000000,1633.68,1657.18,1660.14,
18000000000,1785.49,1810.38,1809.81,
19000000000,1673.96,1519.34,1790.96,
20000000000,1570.7,1576.82,1674.23,
21000000000,1309.82,1303.15,1469.54,
22000000000,1247.76,1222.95,1295.85,
23000000000,1180.88,1231,1168.99,
24000000000,1112.11,1168.77,1113.95,
25000000000,929.048,1083.96,1040.06,
26000000000,966.966,987.13,1080.4,
27000000000,891.06,991.442,1047.15,
28000000000,879.416,924.036,921.864,
29000000000,936.54,916.976,999,
30000000000,995.232,917.989,989.12,
31000000000,1126.02,1036.83,1005.1,
32000000000,1301.38,1130.05,1041.94,
33000000000,1267.58,1294.15,1203.05,
34000000000,1171.36,1364.18,1343.98,
35000000000,1225.96,1380.24,1477.32,
36000000000,1121.63,1419.18,1495.13,
37000000000,1200.79,1351.04,1470.86,
38000000000,1097.25,1283.04,1439.99,
39000000000,1037.81,1258,1340.96,
40000000000,1027.21,1145.9,1219.94,
41000000000,949.896,1095.82,1173.77,
42000000000,921,1076.07,1045.91,
43000000000,838.046,963.1,993.56,
44000000000,779.041,937.164,969.076,
45000000000,766.148,928.966,897.018,
46000000000,787,889.057,861.042,
47000000000,792.209,847.01,863.988,
48000000000,806.526,885,847.046,
49000000000,919.604,855,844.1,
50000000000,931.496,899.022,867.932,
51000000000,1036.05,969.086,868.516,
52000000000,994.188,1037.97,913.93,
53000000000,1060.79,1084.09,942,
54000000000,1002.11,1153.03,965.865,
55000000000,1022.12,1137.87,1080.99,
56000000000,929.725,1196.18,1099.9,
57000000000,917.595,1148.19,1044.89,
58000000000,862.92,1056.03,1007.04,
59000000000,845,1016.25,931.09,
60000000000,800.99,959.9,905.132,
61000000000,773.06,914,836.936,
62000000000,765.6,875.132,820.504,
63000000000,716.067,881.955,783.94,
64000000000,701.48,827.96,727.048,
65000000000,709.558,813.085,733.546,
66000000000,679.888,800.953,722.544,
67000000000,700.568,810.999,713.056,
68000000000,706.86,787.067,743.1,
69000000000,799,789.951,723.04,
70000000000,804.416,820.037,740.112,
71000000000,888.992,849.032,771.105,
72000000000,909.132,860.472,775.984,
73000000000,841.228,859.62,809.064,
74000000000,884.556,894.53,841.046,
75000000000,828.128,884.083,839.9,
76000000000,822.242,871.592,893.95,
77000000000,836.854,859.005,845.056,
78000000000,765.164,834,801.96,
79000000000,742.104,815.46,809.12,
80000000000,703.868,832.025,815.08,
81000000000,699.588,827.09,798.95,
82000000000,681.018,835.088,757.976,
83000000000,697.496,826.052,774.072,
84000000000,644.04,824.94,743.968,
85000000000,627.134,801.04,686.96,
86000000000,655.06,793.993,683.938,
87000000000,649.055,793,647.875,
88000000000,657.778,780.076,635.05,
89000000000,665.072,787.98,628.996,
90000000000,675.147,762.003,702.998,
91000000000,660.022,768.98,711.948,
92000000000,704.904,807.036,763.96,
93000000000,717.268,774.948,726.152,
94000000000,714.182,749.842,772.983,
95000000000,720.039,784,791.092,
