Time [ms],1000000000,
0,436.984,
1000000000,448.017,
2000000000,459.98,
3000000000,484.504,
4000000000,506.46,
5000000000,514,
6000000000,509.02,
7000000000,495.5,
8000000000,486,
9000000000,475.496,
10000000000,472.004,
11000000000,458.984,
12000000000,455.008,
13000000000,458.492,
14000000000,454.98,
15000000000,448.035,
16000000000,447.04,
17000000000,453,
18000000000,459.51,
19000000000,461.975,
20000000000,469.02,
21000000000,471.005,
22000000000,479.024,
23000000000,471.016,
24000000000,473.016,
25000000000,462.011,
26000000000,463.018,
27000000000,452.972,
28000000000,454.032,
29000000000,450.996,
30000000000,444.048,
31000000000,443.016,
32000000000,440.96,
33000000000,435,
34000000000,449.012,
35000000000,446.02,
36000000000,444.496,
37000000000,454.056,
38000000000,453.524,
39000000000,446.998,
40000000000,445.038,
41000000000,440.992,
42000000000,449.472,
43000000000,448.016,
44000000000,446.024,
45000000000,443.998,
46000000000,436.012,
47000000000,437.023,
48000000000,440.98,
49000000000,436.06,
50000000000,445.01,
51000000000,442.05,
52000000000,441.02,
53000000000,440.496,
54000000000,450.024,
55000000000,451.036,
56000000000,442.021,
57000000000,440.506,
58000000000,443.504,
59000000000,439.034,
60000000000,437.999,
61000000000,438.026,
62000000000,435.99,
63000000000,435.014,
64000000000,440.04,
65000000000,443,
66000000000,436.013,
67000000000,439.456,
68000000000,435.009,
69000000000,436.022,
70000000000,444.484,
71000000000,439.016,
72000000000,442.044,
73000000000,445.503,
74000000000,440.013,
75000000000,442.992,
76000000000,427.984,
77000000000,434.016,
78000000000,434.032,
79000000000,438.52,
80000000000,442.976,
81000000000,438.006,
82000000000,437.503,
83000000000,432.019,
84000000000,447.506,
85000000000,443.992,
86000000000,443,
87000000000,436.484,
88000000000,435.992,
89000000000,435.504,
90000000000,438.033,
91000000000,446.524,
92000000000,437,
93000000000,436.032,
94000000000,431.027,
95000000000,435.008,
