Frame number,1000000000,
0.000000,558.99,
1.000000,503.01,
2.000000,485.991,
3.000000,486.04,
4.000000,476.975,
5.000000,494.964,
6.000000,468.032,
7.000000,465.008,
8.000000,452.944,
9.000000,442.056,
10.000000,444.025,
11.000000,446.052,
12.000000,427.014,
13.000000,436.012,
14.000000,430,
15.000000,430.995,
16.000000,430.98,
17.000000,426.012,
18.000000,424.96,
19.000000,425.956,
20.000000,433.05,
21.000000,446.021,
22.000000,438.02,
23.000000,436.996,
24.000000,446.96,
25.000000,432.978,
26.000000,432.996,
27.000000,447.956,
28.000000,434.988,
29.000000,432.018,
30.000000,430.004,
31.000000,431.964,
32.000000,429.984,
33.000000,438.976,
34.000000,437.999,
35.000000,430.026,
36.000000,429.988,
37.000000,433.996,
38.000000,438,
39.000000,436.032,
40.000000,433.03,
41.000000,438.98,
42.000000,433.996,
43.000000,439.026,
44.000000,440.025,
45.000000,430.96,
46.000000,441.96,
47.000000,429.972,
48.000000,424.016,
49.000000,438.002,
50.000000,432.024,
51.000000,433,
52.000000,434.966,
53.000000,428.978,
54.000000,428.034,
55.000000,422.983,
56.000000,429.977,
57.000000,432.96,
58.000000,440.018,
59.000000,427,
60.000000,431,
61.000000,435.996,
62.000000,437.004,
63.000000,430.015,
64.000000,428.952,
65.000000,428,
66.000000,424.022,
67.000000,437.986,
68.000000,432.032,
69.000000,424.006,
70.000000,426.032,
71.000000,431.956,
72.000000,439.02,
73.000000,421.018,
74.000000,424.08,
75.000000,422.015,
76.000000,431.944,
77.000000,420.98,
78.000000,426.982,
79.000000,430.046,
80.000000,425.064,
81.000000,427.024,
82.000000,416.98,
83.000000,428.987,
84.000000,422.003,
85.000000,422.96,
86.000000,427.004,
87.000000,422.024,
88.000000,429.968,
89.000000,421.994,
90.000000,417.01,
91.000000,421.02,
92.000000,429.016,
93.000000,422.042,
94.000000,418.006,
