Frame number,1000000000,
0.000000,730.056,
1.000000,648.032,
2.000000,614.512,
3.000000,588.506,
4.000000,556.52,
5.000000,511.962,
6.000000,496.964,
7.000000,487.47,
8.000000,471.98,
9.000000,466.01,
10.000000,450.016,
11.000000,448,
12.000000,431.04,
13.000000,446.992,
14.000000,439.48,
15.000000,446.016,
16.000000,460.002,
17.000000,461.012,
18.000000,489.52,
19.000000,483.03,
20.000000,481.026,
21.000000,474.5,
22.000000,475.51,
23.000000,454.98,
24.000000,454.012,
25.000000,443.974,
26.000000,431.005,
27.000000,445,
28.000000,437.022,
29.000000,435.028,
30.000000,430.016,
31.000000,441.988,
32.000000,449,
33.000000,455.95,
34.000000,456.992,
35.000000,458,
36.000000,450.04,
37.000000,450.996,
38.000000,448.04,
39.000000,440.036,
40.000000,437.999,
41.000000,436.002,
42.000000,439.024,
43.000000,436.003,
44.000000,428.989,
45.000000,428,
46.000000,436.044,
47.000000,439.972,
48.000000,450.008,
49.000000,444.965,
50.000000,454.035,
51.000000,448.025,
52.000000,449.999,
53.000000,454,
54.000000,440.004,
55.000000,443.02,
56.000000,431.972,
57.000000,435.987,
58.000000,426.992,
59.000000,417.015,
60.000000,432,
61.000000,432.032,
62.000000,436.004,
63.000000,432,
64.000000,447.024,
65.000000,449.044,
66.000000,436.025,
67.000000,441.979,
68.000000,443.016,
69.000000,437.975,
70.000000,431.053,
71.000000,433.012,
72.000000,427.03,
73.000000,437.997,
74.000000,427.024,
75.000000,424,
76.000000,441.007,
77.000000,435.958,
78.000000,436.988,
79.000000,441.04,
80.000000,436.996,
81.000000,443.989,
82.000000,445.018,
83.000000,445.032,
84.000000,441.985,
85.000000,437.976,
86.000000,438,
87.000000,424.999,
88.000000,431.014,
89.000000,431.976,
90.000000,429.037,
91.000000,429.024,
92.000000,434.98,
93.000000,437.992,
94.000000,446.996,
