Frame number,1000000000,
0.000000,526,
1.000000,548.036,
2.000000,784.819,
3.000000,903.096,
4.000000,1141.32,
5.000000,1152.98,
6.000000,1080,
7.000000,1066.81,
8.000000,988.888,
9.000000,902.984,
10.000000,821.896,
11.000000,774.12,
12.000000,709.98,
13.000000,699.064,
14.000000,636.076,
15.000000,621.027,
16.000000,590.968,
17.000000,590.032,
18.000000,568,
19.000000,604.015,
20.000000,669.923,
21.000000,792.952,
22.000000,820.984,
23.000000,846,
24.000000,780.088,
25.000000,778.1,
26.000000,735,
27.000000,688.04,
28.000000,684.962,
29.000000,621.98,
30.000000,611.992,
31.000000,582,
32.000000,583.013,
33.000000,547.051,
34.000000,526.004,
35.000000,537.976,
36.000000,532.988,
37.000000,563.944,
38.000000,600.02,
39.000000,616.072,
40.000000,633.94,
41.000000,591.024,
42.000000,620.036,
43.000000,591.04,
44.000000,580.046,
45.000000,564.05,
46.000000,543.996,
47.000000,557.006,
48.000000,540.008,
49.000000,520.003,
50.000000,506.052,
51.000000,512.008,
52.000000,492,
53.000000,494.04,
54.000000,501.008,
55.000000,506,
56.000000,515.966,
57.000000,524.48,
58.000000,552.524,
59.000000,545.997,
60.000000,538.44,
61.000000,537.044,
62.000000,522.034,
63.000000,520.962,
64.000000,494.028,
65.000000,505,
66.000000,506.524,
67.000000,485.018,
68.000000,484.01,
69.000000,485.964,
70.000000,482.48,
71.000000,492.05,
72.000000,484,
73.000000,479,
74.000000,491.974,
75.000000,503.008,
76.000000,498.527,
77.000000,491.972,
78.000000,483.492,
79.000000,487.02,
80.000000,491.52,
81.000000,492.97,
82.000000,493.022,
83.000000,479.984,
84.000000,486.996,
85.000000,479.976,
86.000000,482,
87.000000,477.03,
88.000000,468.976,
89.000000,480.962,
90.000000,475.972,
91.000000,475.03,
92.000000,491.98,
93.000000,473.032,
94.000000,469.059,
95.000000,472.02,
