Time [ms],1000000000,1000000001,1000000002,1000000003,
0,896.055,1117.15,2261.73,1255.5,
1000000000,954.936,951.2,1383.01,1071.88,
2000000000,1053.93,1038.38,1059.02,871.348,
3000000000,1245.16,1349.73,1437.36,1244.76,
4000000000,1259.26,1187.48,1961.91,1458.01,
5000000000,1604.86,1889.29,1976.94,1908.88,
6000000000,2238.33,1838.81,3710.42,2381.48,
7000000000,1501.17,2312.28,2881.91,2132.01,
8000000000,1585.19,2478.92,2830.7,2222.93,
9000000000,1123.04,2144.34,1481.95,1771.6,
10000000000,1197.67,2649.16,1984.69,1758.16,
11000000000,1232.52,2739.46,2281.67,1138.19,
12000000000,1675.49,1668.64,2891.34,1048.9,
13000000000,1612.54,2138.32,2478.65,1009.48,
14000000000,1096.58,2126.63,2335.9,1314.13,
15000000000,1030.36,1712.93,3138.16,1336.5,
16000000000,909.471,1761.49,2870.1,1326.54,
17000000000,938.848,1934.25,2203.72,1586.78,
18000000000,1067.83,2236.5,2352.53,1185.76,
19000000000,1000.28,2249.2,1896.92,1223.6,
20000000000,1079.9,2357.98,1903.29,1262.58,
21000000000,1221.03,2075.82,1969.51,1286.39,
22000000000,1436.82,2248.62,2157.16,1162.19,
23000000000,1576.32,1239.37,2215.26,1160.71,
24000000000,1416.4,976.489,2382.84,1183.32,
25000000000,1335.92,1261.63,2158.07,1216.52,
26000000000,1268.34,1557.74,2021.01,1257.06,
27000000000,1472.79,1802.66,2319.75,1307.41,
28000000000,1308,1724.4,2514.18,1338.42,
29000000000,1300.4,1754.87,2502.95,1433.78,
30000000000,1316.73,1780.41,2417.08,1296.73,
31000000000,1488.11,1733.73,2208.67,1282.12,
32000000000,1351.99,1692.18,2020.51,1065.39,
33000000000,1410.2,1662.82,2008.26,1139.05,
34000000000,1408.28,1581.9,2158,1094.53,
35000000000,1358.96,1678.9,2111.45,1142.95,
36000000000,1409.02,1634,1960.48,1112.53,
37000000000,1336.09,1488.78,2199.23,1068.48,
38000000000,1231.32,1566.07,2189.91,1195.24,
39000000000,1232.27,1424.7,1990.02,1445.2,
40000000000,1243.66,1466,2110.28,1498.38,
41000000000,1146.52,1531.46,2112.4,1553.79,
42000000000,972.987,1736.05,1892.65,1627.69,
43000000000,1012.62,1595.5,1817.47,1539.15,
44000000000,969.244,1480.28,1622.55,1693.28,
45000000000,1001.57,1425,1558.91,1633.79,
46000000000,1088.98,1202.6,1543.27,1734.77,
47000000000,1177.45,1380.26,1490.48,1486.02,
48000000000,1317.2,1528.72,1668.19,1702.52,
49000000000,988.883,1545.95,1794.93,1606.78,
50000000000,1000.52,1401.75,1831.72,1514,
51000000000,964.037,1083.53,1680.48,1539.73,
52000000000,1010.16,1004.89,1593.67,1429.85,
53000000000,1127.88,1044.37,1701.76,1430.32,
54000000000,1116.86,1197.4,1613.97,1443.57,
55000000000,1105,1361.01,1523.47,1338.8,
56000000000,1189.65,1381.94,1587.54,1469.16,
57000000000,979.125,1379.45,1542.29,1331.15,
58000000000,984.16,1155.06,1614.26,1296.18,
59000000000,952.878,1076.88,1594.47,1359.7,
60000000000,925.91,927.144,1597.56,1492.45,
61000000000,1007.93,1395.54,1685.87,1448.88,
62000000000,786.23,1538.41,1781.25,1490.56,
63000000000,927.287,1370.59,1603.5,1434.14,
64000000000,952.616,1358,1560,1553.4,
65000000000,913.418,1059.46,1515.7,1585.52,
66000000000,907.938,994.48,1496,1610,
67000000000,923.18,1156.33,1468,1751.42,
68000000000,1031.01,1190.87,1515.5,1514,
69000000000,972.956,1243.02,1471,1467.12,
70000000000,949.992,1286.1,1428.95,1572,
71000000000,981.853,1285.11,1532.76,1647,
72000000000,1023.16,1219.02,1399,1524.25,
73000000000,843.908,1278.28,1319.79,1559.48,
74000000000,851.725,1354,1450.12,1510.74,
75000000000,1025.39,1269.58,1476.88,1494,
76000000000,948.204,1308.64,1504,1493.39,
77000000000,893.072,1200.12,1592.65,1505.24,
78000000000,819.86,1125.24,1495.88,1295.05,
79000000000,918.031,1272.3,1483.49,1208.64,
80000000000,963.151,1239.1,1496.15,1264.82,
81000000000,1001.81,1267.73,1423.73,1204.48,
82000000000,1043.77,1323.9,1536.28,1293.61,
83000000000,1091.98,1423.68,1460.65,1336.71,
84000000000,1079.05,1466.32,1603,1519.33,
85000000000,1096.02,1327.46,1630.25,1503.82,
86000000000,1108.28,1303.89,1490.75,1285.75,
87000000000,1194,1311.68,1396.62,1307.18,
88000000000,1143.75,1295.27,1491.79,1400.78,
89000000000,1125.6,1039.95,1444.55,1451.83,
90000000000,1096.02,1354.32,1385.88,1389.14,
91000000000,1136.64,1227,1295.14,1425.72,
92000000000,1077,1255.75,1286.49,1568.85,
93000000000,1091.17,1271.29,1306.64,1438.99,
94000000000,1096.27,1233.31,1257,1470.17,
95000000000,1019.32,1358.35,1267.57,1419.31,
