Time [ms],1000000000,1000000001,1000000002,1000000003,
0,482.936,585.5,531.909,566.994,
1000000000,486.102,619.96,557.986,660.95,
2000000000,559.125,819.476,684.284,981.276,
3000000000,742.183,1159.99,1019.52,1514.48,
4000000000,805.617,1337.04,1356.61,1853.08,
5000000000,783.208,1396.83,1306.38,1960.76,
6000000000,734.471,1261.25,1317.62,1799.56,
7000000000,750.136,1149.57,1376.1,1646.43,
8000000000,704.916,1139.36,1125.37,1194,
9000000000,709.192,1106.94,1042.05,1134.28,
10000000000,625.04,1046.13,1139.21,991.764,
11000000000,601.94,1003.65,1044.75,918.176,
12000000000,621.038,868.091,999.048,926.82,
13000000000,660.13,780.064,947.944,830.852,
14000000000,618.062,789.206,868.84,823.922,
15000000000,601.984,754.111,772.882,756,
16000000000,571.092,724.912,739.08,698.992,
17000000000,557,654.02,670.062,638.988,
18000000000,566.01,656.132,710.024,690.904,
19000000000,576.03,735.032,708.084,711.92,
20000000000,696.013,800.702,795.09,853.18,
21000000000,714.15,851.85,858.04,935.176,
22000000000,754.122,878.292,925.162,1019.62,
23000000000,811.24,934.864,974.066,994.45,
24000000000,709.826,853.052,929.007,978.82,
25000000000,700.05,814.902,899.124,950.125,
26000000000,679.14,752.86,874.124,886.155,
27000000000,624.93,733.052,803.01,833.922,
28000000000,605.03,694.045,714.96,743.014,
29000000000,573.945,670.984,593.911,676,
30000000000,567.87,605.066,566.063,645.512,
31000000000,535.08,629.988,643.018,652.1,
32000000000,499.005,576.932,600.99,603.48,
33000000000,530.088,554.032,608.055,562.94,
34000000000,518.064,551.988,568.974,559.554,
35000000000,504,553.964,556.996,566.92,
36000000000,512.996,579.956,579.99,586.02,
37000000000,527.494,577.952,595.083,613.988,
38000000000,527.456,579.104,654.88,623.08,
39000000000,559.984,640.084,630.128,699.56,
40000000000,547.08,645.254,623.919,671.096,
41000000000,574.054,640.888,686.076,738.576,
42000000000,588,623.94,686.932,708.88,
43000000000,558.918,633,659.914,685.954,
44000000000,549.954,625,643.049,658.832,
45000000000,546.1,577.1,617.936,624.104,
46000000000,533.054,614.85,629.975,603.982,
47000000000,506.042,564.996,588.004,593.016,
48000000000,491.04,577.038,575.896,552.966,
49000000000,515,539.99,564,563.01,
50000000000,505.021,530.032,562.941,534.08,
51000000000,505.062,521.504,524.942,544,
52000000000,492.051,534.524,554.05,531.98,
53000000000,515.98,538.976,530.056,534.968,
54000000000,492.968,521.984,549.956,534.96,
55000000000,499.066,533,569.88,514.024,
56000000000,501.062,530.96,568.068,531.888,
57000000000,523.012,566.096,551.952,561.984,
58000000000,542.964,596.496,609.916,560.934,
59000000000,532,575.546,594.976,540.03,
60000000000,525,558.02,612.048,551.968,
61000000000,504.504,568.972,567.94,548.034,
62000000000,539.02,547.938,614.964,532.024,
63000000000,517.514,545.04,558.04,554.04,
64000000000,506,536.996,564,554.98,
65000000000,514.48,543.55,533.999,516.926,
66000000000,502.476,520.034,530.026,505.968,
67000000000,484.968,506,544.013,516.985,
68000000000,485.024,523.98,545.018,512.968,
69000000000,492.472,500,506.936,498.04,
70000000000,467.079,515.444,506,518.968,
71000000000,478.48,486.488,500,503.962,
72000000000,492.98,507.47,511.996,491.02,
73000000000,488.478,512.98,519.974,516.952,
74000000000,494.98,516.978,526.04,500.06,
75000000000,488.478,517.017,548.992,544.984,
76000000000,510.508,542.952,568.08,542.006,
77000000000,515.508,538.984,546.068,546.052,
78000000000,522.5,542.968,542.98,510.02,
79000000000,500.02,527.948,504.9,528,
80000000000,472.11,524.55,531.92,559.948,
81000000000,481.952,488.976,509.04,522.04,
82000000000,472.09,499.5,527.003,519.96,
83000000000,494.528,496.518,494.061,507.024,
84000000000,457.984,485,502.98,504.03,
85000000000,463.484,499.096,495.032,493.965,
86000000000,482.496,492.036,497.97,500.976,
87000000000,470.528,479.024,482.976,516.04,
88000000000,474.011,490.02,493.022,499.028,
89000000000,457.968,476.984,491.95,503.036,
90000000000,459.005,508.938,472.992,494.976,
91000000000,468,491.026,504,502.986,
92000000000,475.992,487.04,501.952,501.03,
93000000000,496.52,469.974,516.003,503.977,
94000000000,496.516,502.043,520.952,492.05,
95000000000,496.984,487.045,489.99,518.991,
