Time [ms],1000000000,1000000001,1000000002,1000000003,
0,3578.85,3280.23,2307.07,2361.83,
1000000000,2289.72,2202.94,1149.54,1350.99,
2000000000,1880.58,1926.52,1164.11,1296.72,
3000000000,1721.99,1688.77,1131.4,1192.96,
4000000000,1387.72,1724.93,1232.4,1121.38,
5000000000,1301.82,1672.67,1057.6,1177.01,
6000000000,1242.82,1491.42,866.776,887.705,
7000000000,1175.09,1386.47,891.584,764.67,
8000000000,1090.84,1160.97,913.014,859.035,
9000000000,887.184,998.152,753.94,719.942,
10000000000,827.074,924.004,686.896,713.8,
11000000000,801.048,864.13,694.932,646.036,
12000000000,759.15,758.04,709,703.184,
13000000000,707.04,727.912,682,716.025,
14000000000,677.56,675.986,655.078,632.956,
15000000000,647.074,604.92,542.088,585.96,
16000000000,612.98,639.12,582.065,585.104,
17000000000,619.94,637.065,588.909,578.52,
18000000000,661.052,640.944,646.985,621.022,
19000000000,691.105,705.07,707.416,643.099,
20000000000,758.15,739.108,730.524,691.972,
21000000000,775.188,792.293,758.131,721.6,
22000000000,887.196,805.978,784.228,759.874,
23000000000,874.978,834.448,788.826,695.684,
24000000000,872.076,831.944,836.112,723.32,
25000000000,800.99,791.504,776.913,699.052,
26000000000,740.28,719.484,701.176,623.588,
27000000000,682.032,634.092,729.994,614.977,
28000000000,631.008,626.06,643.524,613.024,
29000000000,617.08,589.952,626.202,543.996,
30000000000,553.488,570.092,582.049,567.89,
31000000000,550.52,530.424,570.008,532.045,
32000000000,523.904,527.016,515.946,524.996,
33000000000,510.006,521.984,520.06,529.017,
34000000000,507.016,531.02,595.94,557.055,
35000000000,564.069,565.51,641.132,611.996,
36000000000,675.9,589.006,679.79,611.988,
37000000000,774.968,677.06,753.176,630.96,
38000000000,796.01,661.001,727.757,724.828,
39000000000,950,668.188,747.127,671.899,
40000000000,817.372,638.108,742.896,683.836,
41000000000,884.97,660.188,700.932,659.84,
42000000000,811.888,762.013,703.89,652.92,
43000000000,707.008,644.272,632.074,610.072,
44000000000,634.018,604.2,617.94,575.927,
45000000000,593.48,574.936,607.005,557.948,
46000000000,549.48,533.042,560.018,533.947,
47000000000,537.517,511.95,548.096,503.974,
48000000000,509.99,498.94,534.96,482.008,
49000000000,488.522,484.996,535.996,484.03,
50000000000,497.52,506.045,553.46,504.06,
51000000000,532.976,520.945,615.984,546.988,
52000000000,577.528,561.032,630,622.99,
53000000000,694.424,663.008,688.752,750.812,
54000000000,827.985,744.12,739.912,821.152,
55000000000,939.922,833.14,774.856,908,
56000000000,970.98,924.27,809.096,946.06,
57000000000,917.156,868.096,704.922,829.82,
58000000000,846.004,826.994,726.052,797.24,
59000000000,781.942,771.98,625.145,729.968,
60000000000,650.086,712.846,657.856,654.08,
61000000000,601.129,657.074,594.99,609.892,
62000000000,578.95,620.102,531.499,532.956,
63000000000,549.033,574.94,529.52,507.992,
64000000000,510,542.016,521.04,486,
65000000000,495.006,529.968,511.948,471.002,
66000000000,495.048,527.975,541.56,485.971,
67000000000,501.93,521.005,574.544,528.048,
68000000000,562.088,552.99,578.584,574.952,
69000000000,659.092,634.952,640.918,616.946,
70000000000,747.055,697.04,693.002,706.5,
71000000000,880.128,753.026,712.073,824.424,
72000000000,922.134,780.952,741.958,852.968,
73000000000,876.107,784.035,673.04,809.926,
74000000000,839.042,814.912,644.142,886.137,
75000000000,767.03,766.92,611.876,688.977,
76000000000,720.036,703.956,644.123,668.999,
77000000000,651.996,679.01,584.936,593.95,
78000000000,600.2,616.006,579.262,562.1,
79000000000,548.133,587.06,531.899,531.078,
80000000000,535.072,547.854,522.86,508.48,
81000000000,503.061,561.04,556.92,500.036,
82000000000,485.958,540.056,552.02,487.959,
83000000000,516.972,548.038,555.916,523.027,
84000000000,570,568.908,577.948,556.013,
85000000000,641.976,599.146,588.095,636.14,
86000000000,679.063,661.022,627.04,661.85,
87000000000,739.93,721.18,646.412,680.08,
88000000000,793.172,756.919,657.02,686.108,
89000000000,800.098,803.14,677.019,610.978,
90000000000,769.062,787.832,631.512,647.104,
91000000000,737.98,768.772,675.096,599.008,
92000000000,736.074,761.152,610.077,594.932,
93000000000,649.978,664.532,598.064,555.11,
94000000000,644.915,644.996,623.896,569.92,
95000000000,604.005,646.438,640.561,542.989,
