Time [ms],1000000000,1000000001,1000000002,
0,1349.32,1979.41,2187.11,
1000000000,1804.5,2307,2783.52,
2000000000,2871.14,3663.57,3681.06,
3000000000,3727.38,5198.29,4503.37,
4000000000,4627.06,5507.38,4305,
5000000000,4477.65,4900.89,4001.19,
6000000000,3811.89,4284.28,3469.64,
7000000000,3687.53,3818.74,3014.9,
8000000000,3210.37,3210.27,2592.05,
9000000000,2708.63,2665.54,2254.44,
10000000000,2359.55,2324.92,2035.45,
11000000000,1920.92,2069.56,1787.98,
12000000000,1693.09,1845.21,1840,
13000000000,1455.79,1537.28,1535,
14000000000,1342.14,1453.17,1447.22,
15000000000,1132.93,1288,1371,
16000000000,1101.6,1252.11,1266.38,
17000000000,1038.18,1131.91,1305,
18000000000,984.178,1188.22,1221.17,
19000000000,1186.99,1352.32,1313,
20000000000,1308.15,1490,1581,
21000000000,1659.51,1900.34,1702,
22000000000,1905.05,2154,1792.66,
23000000000,2039.74,2108.61,1900,
24000000000,2064.64,2024.07,1940,
25000000000,1779.75,1901,1666,
26000000000,1656,1723.3,1661.57,
27000000000,1553.46,1440.94,1397.69,
28000000000,1363.53,1325.9,1335.74,
29000000000,1248,1164.88,1262.13,
30000000000,1168.38,1140.36,1205,
31000000000,1094.48,1010.93,1173,
32000000000,933.724,997.025,1173.23,
33000000000,947.652,1023.87,1066.7,
34000000000,980.378,855.052,1122.4,
35000000000,851.724,931.09,1093,
36000000000,854,947.065,1067.72,
37000000000,956.852,1062.93,1099.76,
38000000000,1096.34,1007.07,1354.49,
39000000000,1063.85,1030.78,1216.12,
40000000000,1230.29,1136.8,1298.84,
41000000000,1340.47,1101.19,1189.67,
42000000000,1343.37,1143.47,1163.81,
43000000000,1279.4,1060.94,1200.97,
44000000000,1190.23,984.943,1099.23,
45000000000,1101.5,938.935,1029,
46000000000,1014.68,900.94,1023.26,
47000000000,972,852.87,953.102,
48000000000,896.28,881.106,937.896,
49000000000,859,822.018,912.792,
50000000000,848.304,819.348,859.9,
51000000000,851.17,796.856,904.96,
52000000000,870.432,774.055,853.048,
53000000000,838.817,806.936,932.248,
54000000000,866.05,821.316,886.996,
55000000000,913.261,817.248,926.348,
56000000000,895.328,824.3,899.9,
57000000000,1053.34,827.968,950.048,
58000000000,1007.54,789.14,918.36,
59000000000,965.732,815.867,880,
60000000000,966.899,743.866,873.808,
61000000000,956.747,776.96,863.02,
62000000000,938.295,789.105,816.48,
63000000000,818.824,770.112,768.144,
64000000000,968.728,701.118,762,
65000000000,871.308,728.666,787.008,
66000000000,845.208,728.203,753.428,
67000000000,835.899,748.536,743.456,
68000000000,788.744,754.12,719.464,
69000000000,815.965,670.1,742.496,
70000000000,806.2,698.008,739.5,
71000000000,808.456,683.908,712.096,
72000000000,831.219,690.093,757.976,
73000000000,854.916,667.035,723.504,
74000000000,837,707.902,714.84,
75000000000,830.978,696.846,747.996,
76000000000,794.624,692.92,730.041,
77000000000,847.155,705.168,703.5,
78000000000,836.228,687.064,704.04,
79000000000,809.6,689.892,689.98,
80000000000,832.881,655.965,658.064,
81000000000,797.366,615.997,690.115,
82000000000,767.81,653.943,669.078,
83000000000,746.68,630.937,673.056,
84000000000,710.96,667.03,643.912,
85000000000,769.208,647.062,658.036,
86000000000,732.956,675.008,651.131,
87000000000,766.576,672.062,626,
88000000000,752,659.003,625.864,
89000000000,751.012,643.148,639,
90000000000,732.15,651.954,597.036,
91000000000,715.264,643.954,650.075,
92000000000,733.248,634,613.02,
93000000000,741.078,617.068,626.072,
94000000000,709.933,600.04,610,
