Frame number,1000000000,1000000001,1000000002,1000000003,
0.000000,1935.89,3405.2,2282.23,1951.07,
1.000000,1740.98,2783.53,1596.93,2199.79,
2.000000,2311.16,3493.35,1517.21,2437.8,
3.000000,2644.48,4149.83,1809.96,2700.94,
4.000000,2872.62,5075.58,2066.96,2965.65,
5.000000,2638.38,4251.6,1977.15,2960.31,
6.000000,2594.49,3961.95,2033.64,3300.31,
7.000000,2330.79,3164.12,1912.63,2658,
8.000000,2003.68,2799.63,1905.88,2489.25,
9.000000,1803.48,2360.7,1786.69,2815.45,
10.000000,1727.84,2317.22,1742.23,1953.28,
11.000000,1555.97,2172.98,1489.68,1955.15,
12.000000,1497.05,1870.61,1411.54,2205.09,
13.000000,1455.47,1778.01,1341.12,1951.58,
14.000000,1449,1654.17,1301.59,1733.7,
15.000000,1323.05,1708.29,1246.21,1565.18,
16.000000,1308.55,1487.98,1141.12,1590.74,
17.000000,1299.07,1428.02,1164.91,1626.5,
18.000000,1391.92,1442.07,1216.96,1615,
19.000000,1459.17,1501,1302.64,1665.17,
20.000000,1533.78,1679.08,1387,1857.24,
21.000000,1615.85,2058.34,1484,1865.7,
22.000000,1700,2315.76,1587.82,1976,
23.000000,1706.93,2550.58,1674.64,1918.5,
24.000000,1665.86,2591.23,1615.88,1884.28,
25.000000,1553.8,2609.83,1536.12,1850.95,
26.000000,1508.02,2227,1526.13,1782.38,
27.000000,1434.88,2099.08,1464.27,1640.58,
28.000000,1374.14,1942,1382.12,1607.82,
29.000000,1211.86,1810.8,1292.65,1553.83,
30.000000,1197.86,1666.15,1183.08,1551.79,
31.000000,1128.87,1562.12,1113.76,1410.39,
32.000000,1079.96,1508.88,1117.11,1454.6,
33.000000,1104.09,1365.88,1020.63,1452.42,
34.000000,1079.98,1245.06,1005.69,1397,
35.000000,1013.11,1263.74,982.952,1398.75,
36.000000,1010.87,1252.72,988.432,1454.08,
37.000000,1059.05,1301.04,997.308,1440.62,
38.000000,1058.97,1375.88,1010.32,1421,
39.000000,1117.85,1520.15,1111.96,1554.22,
40.000000,1135.12,1625.04,1191.85,1608.36,
41.000000,1147.94,1730.31,1195.38,1601.34,
42.000000,1141.46,1733.3,1330.45,1515.59,
43.000000,1144.44,1649.72,1252.35,1467.24,
44.000000,1150.47,1706.82,1283.21,1492.9,
45.000000,1118.99,1580.23,1288.3,1540.16,
46.000000,1103.52,1521.41,1242.11,1428.2,
47.000000,1111.48,1432.11,1171.1,1423.21,
48.000000,1094.52,1238.82,1159.85,1371.32,
49.000000,1015.96,1246.25,1098.71,1251.88,
50.000000,1053.45,1135.81,1059.2,1247,
51.000000,985.024,1073.15,938.072,1188.97,
52.000000,971.836,1040.14,880.832,1137.79,
53.000000,978.072,1038.79,906.04,1142.33,
54.000000,946.072,983.832,884.92,1110.12,
55.000000,946.03,999.928,850.872,1127.54,
56.000000,956.096,1060.85,880.104,1114,
57.000000,957.968,1078.09,844.776,1146.92,
58.000000,899.973,1071.1,868,1107.86,
59.000000,909.98,1144.98,853,1165.6,
60.000000,925.09,1155.9,873.74,1154.1,
61.000000,959.06,1182.94,880.53,1190.14,
62.000000,973.976,1217.97,889.258,1213.04,
63.000000,987.91,1209.15,897.184,1207.11,
64.000000,966.031,1122.06,913.096,1226.95,
65.000000,958.096,1099.79,862.576,1182.58,
66.000000,1006.06,1020.09,882.152,1283.87,
67.000000,981.024,1011.94,897.972,1151,
68.000000,974.943,1006.89,867.964,1196.26,
69.000000,929.072,990.852,807.04,1105.5,
70.000000,929.96,1006.01,757.788,1099.57,
71.000000,935.028,989.958,861.104,1123.56,
72.000000,916.996,953.05,794,1037.58,
73.000000,935.48,979.934,879.088,1055.73,
74.000000,904.024,978.926,810.172,1042.02,
75.000000,920.492,1013.12,806.164,993.231,
76.000000,901.576,1020.13,872.229,1001.89,
77.000000,866.984,1101,853.972,1005.43,
78.000000,887.016,1140.91,836.5,1015.06,
79.000000,902.911,1125.91,837,1001.6,
80.000000,851.96,1176.06,836.312,969,
81.000000,846.04,1147.87,815.98,1001.39,
82.000000,859.04,1087.06,882.48,997.114,
83.000000,876.02,1052.9,909.24,989.124,
84.000000,854.04,1033.05,878.608,995.21,
85.000000,855.88,942.882,831.888,988.16,
86.000000,843.01,962.96,858.276,990.356,
87.000000,821.92,935.096,874.268,996.82,
88.000000,849.03,928.866,844.016,974.012,
89.000000,818.15,939.099,801.246,977.208,
90.000000,825.916,881.944,771,1003.5,
91.000000,803.04,896.004,773.007,1024.84,
92.000000,825.072,858.106,795,1002.07,
93.000000,825.98,884,738.164,995.596,
94.000000,823.075,885.056,843.189,958.314,
95.000000,809.98,950.09,850.939,959.058,
