Time [ms],1000000000,1000000001,1000000002,
0,8616.61,20564.4,20996,
1000000000,18057.1,18989.3,14676.7,
2000000000,20398,17492.7,10838.5,
3000000000,29615.4,19461.1,10711.5,
4000000000,31531.7,19660.7,10671.7,
5000000000,30199.9,18749.1,10055.3,
6000000000,30140.6,19947.3,9900.24,
7000000000,28692.7,19730.6,10501.6,
8000000000,25967.5,18081,10256.9,
9000000000,22163.8,16625.8,9732,
10000000000,18753.4,14805.9,8821,
11000000000,15703.4,14052.7,7907.18,
12000000000,13436.3,13260,7449.84,
13000000000,11757.5,11866.7,6894.98,
14000000000,10435.8,10607.7,6071.41,
15000000000,9979.89,9942.12,5706.32,
16000000000,11634.4,9943.59,5653.05,
17000000000,13283.4,10445.4,5469.25,
18000000000,16461.8,10521.1,5345.28,
19000000000,17049.3,10763.4,5233.9,
20000000000,16178.9,10279,5071.82,
21000000000,16913.3,10321.8,4879.82,
22000000000,16947,11318.8,5564.58,
23000000000,15152.9,11325.8,5353.68,
24000000000,13185,10912.1,5113.77,
25000000000,11360.2,10255.1,4775.36,
26000000000,9915.75,9020,4466.74,
27000000000,8822.55,8472.2,4245.01,
28000000000,8013.73,7603.1,3993.95,
29000000000,7640.63,6766.71,3822.95,
30000000000,7358.14,6124.2,3680.89,
31000000000,8026.63,6030.85,3566.1,
32000000000,9299.2,5869.95,3581.79,
33000000000,10736.6,6263.1,3557.11,
34000000000,10752,6379.95,3434.21,
35000000000,10702.5,6289.53,3454.68,
36000000000,11050.7,6537.37,3554.2,
37000000000,10396.1,6805.89,3617.65,
38000000000,9167,6448.06,3459.24,
39000000000,8174.51,6382.79,3285.77,
40000000000,7313,5914.18,2989.03,
41000000000,6353.84,5477.08,2906.84,
42000000000,5880.81,5050.78,2652.13,
43000000000,5340.74,4706.61,2614.34,
44000000000,5555.4,4349.46,2409.02,
45000000000,5415.35,4068.76,2340.9,
46000000000,5914.46,4259.78,2284.02,
47000000000,6731.32,4164.66,2227.6,
48000000000,6966.11,4168,2251.23,
49000000000,6842.95,4144.31,2299.18,
50000000000,7120.82,4407.6,2274.34,
51000000000,6977.51,4289.29,2340.51,
52000000000,6653.33,4254.5,2354.38,
53000000000,6214.2,4106.53,2278.17,
54000000000,5607.98,4110.04,2261.09,
55000000000,5471.18,3799.55,2057.21,
56000000000,5110.76,3499.74,2005.06,
57000000000,4669.34,3269.01,1942.11,
58000000000,4303.9,3171.8,1852.08,
59000000000,4386.99,3144.6,1816.15,
60000000000,4250.51,2862.84,1660.15,
61000000000,4459.18,2942.44,1665,
62000000000,4937.42,2938.29,1597.94,
63000000000,5218.43,3033.35,1563.46,
64000000000,5303.11,3006.73,1546.23,
65000000000,5331.94,3079.86,1591.42,
66000000000,5116.68,3283.25,1686,
67000000000,5091.65,3295.17,1679.68,
68000000000,4948.68,3249.38,1745.86,
69000000000,4859.13,3076.26,1756.81,
70000000000,4551.17,3012.24,1673.42,
71000000000,4326.56,2928.8,1601.14,
72000000000,4072.54,2730.08,1663.07,
73000000000,3888.7,2541.49,1571.97,
74000000000,3872.64,2601.02,1544.05,
75000000000,3853.06,2483.14,1476,
76000000000,4145.57,2344.83,1479.12,
77000000000,4353.01,2438.28,1428.1,
78000000000,4404.83,2558.89,1438.4,
79000000000,4506.87,2503.91,1445.64,
80000000000,4397.38,2572.81,1439.49,
81000000000,4361.35,2510.07,1500.1,
82000000000,4392.73,2517.24,1585.84,
83000000000,4363.29,2457,1598.96,
84000000000,4227.04,2517.86,1517.47,
85000000000,3943.18,2446.73,1500.38,
86000000000,3930.38,2333.34,1459.47,
87000000000,3732.2,2236.66,1441,
88000000000,3627.93,2197.75,1403.96,
89000000000,3509.84,2005.22,1349.92,
90000000000,3588.84,2045.89,1343.06,
91000000000,3613.09,1926.04,1323.48,
92000000000,3778.13,1938.02,1280.6,
93000000000,3916.94,2010.44,1197.12,
94000000000,3851.1,1939.96,1206.92,
