Time [ms],1000000000,1000000001,1000000002,
0,1284.96,1093.76,926.757,
1000000000,994.072,819.94,785,
2000000000,944.719,953.188,728.026,
3000000000,1113.84,765.826,1009.09,
4000000000,1372.13,986.35,811.608,
5000000000,1265.33,1037.02,1091.83,
6000000000,1132.38,1130.25,1084.28,
7000000000,1224.34,1162.08,992.928,
8000000000,1129.03,1226.73,886.088,
9000000000,1088.5,1179.99,871,
10000000000,1083.17,1052.73,987.934,
11000000000,902.704,997.227,951.641,
12000000000,897.908,1042.71,1003.18,
13000000000,917.048,994.552,959.522,
14000000000,915.072,761.204,757.244,
15000000000,813.854,669.129,760.18,
16000000000,791.16,719.893,841.927,
17000000000,757.125,727.232,819.039,
18000000000,581.1,726.046,747,
19000000000,583.054,790.394,601.03,
20000000000,586.815,817.286,708.888,
21000000000,714.879,982.956,639.875,
22000000000,879.996,974.825,701.036,
23000000000,943.104,1048.35,636.666,
24000000000,972.02,1116.69,704.082,
25000000000,954.953,1109.3,776.94,
26000000000,949.016,1181.12,680.84,
27000000000,941.992,1114.12,790.128,
28000000000,940.092,1059,693.888,
29000000000,944,721.077,746.952,
30000000000,808.855,738.023,767,
31000000000,810.878,684.881,791,
32000000000,799.104,710.374,733,
33000000000,729.94,684.384,780.41,
34000000000,790.126,732.547,747.504,
35000000000,689.975,693.991,825.136,
36000000000,796.958,724.856,855.496,
37000000000,773.873,740.483,745.262,
38000000000,781.12,832.886,816.246,
39000000000,838.226,825.677,804.688,
40000000000,976.048,866.642,851.09,
41000000000,888.179,872.55,865.158,
42000000000,958.868,878.976,892.2,
43000000000,961.777,905.029,889.827,
44000000000,979.872,878.513,825.082,
45000000000,894.152,901.982,849.242,
46000000000,878.104,844.337,762.406,
47000000000,819.194,830.4,773.26,
48000000000,853.01,838.643,684.746,
49000000000,809.454,833.466,776.9,
50000000000,756.804,843.904,690.113,
51000000000,723.124,774.66,695.208,
52000000000,710.082,793.112,651.952,
53000000000,726.556,785.66,697.209,
54000000000,759.84,793.963,693.002,
55000000000,760.95,778.622,677.924,
56000000000,770.944,861.675,653.048,
57000000000,768.6,939.068,668.122,
58000000000,855.12,966.56,677.88,
59000000000,849.48,826.792,664.56,
60000000000,853.256,975.157,673.022,
61000000000,863.072,962.317,688.04,
62000000000,882.048,815.803,692.896,
63000000000,909.136,827.136,651.854,
64000000000,836.932,747.978,610.084,
65000000000,817.032,784.172,618.95,
66000000000,800.156,790.004,625.042,
67000000000,809.838,753.72,605.888,
68000000000,752.052,782.875,591.911,
69000000000,765.164,703.144,583.043,
70000000000,740.112,753.088,612.874,
71000000000,734.84,745.112,583.936,
72000000000,735.94,781.098,600.03,
73000000000,771.044,830.788,649.982,
74000000000,809.855,827.06,630.978,
75000000000,831.966,881.056,645.976,
76000000000,903.944,791.972,679.104,
77000000000,910.092,939.336,660.84,
78000000000,920.992,922.4,608.04,
79000000000,893.14,971.936,649.141,
80000000000,910.099,949.032,630.875,
81000000000,862.132,828.848,634.125,
82000000000,837.01,847.168,583.96,
83000000000,817.906,805.136,595.14,
84000000000,801.04,806,602.88,
85000000000,757.124,792.092,597.928,
86000000000,733.668,768.94,604.056,
87000000000,716.832,774.14,570.04,
88000000000,731.82,750.16,609.92,
89000000000,746,772.584,596.996,
90000000000,759.975,822.144,581.978,
91000000000,756.824,812.28,603.98,
92000000000,824.918,816.849,590.92,
93000000000,817.816,801.624,634.88,
94000000000,849.024,848.424,634.976,
95000000000,839.878,931.2,659.78,
