Frame number,1000000000,1000000001,1000000002,
0.000000,599,653.974,631,
1.000000,611.05,678.127,598.08,
2.000000,597,741.1,651.902,
3.000000,704.039,817.856,741.042,
4.000000,695.838,825.064,746.994,
5.000000,699.896,767.528,751.958,
6.000000,675.1,755,671.166,
7.000000,584.9,625.92,621.056,
8.000000,553.931,617.084,575.93,
9.000000,526.032,546.936,540.108,
10.000000,512.99,544.985,507.1,
11.000000,503.04,517.102,493.949,
12.000000,493,505.985,499.985,
13.000000,475.96,506.976,495.96,
14.000000,479.98,494.047,474.06,
15.000000,469.525,483.973,479.92,
16.000000,469.55,478.58,473.98,
17.000000,477.52,483.002,490.008,
18.000000,468.496,504.048,487.5,
19.000000,496.016,507.492,517.482,
20.000000,515.504,534.46,561.972,
21.000000,548.484,554.506,596.992,
22.000000,599.528,594.528,638.52,
23.000000,597.957,636.036,618.96,
24.000000,606.091,634.62,602.927,
25.000000,552.967,596.032,552.05,
26.000000,515.488,564.07,516.05,
27.000000,511.984,533.976,500.004,
28.000000,477.492,492.976,484.968,
29.000000,484.5,483.036,474.013,
30.000000,477.972,479.04,470.984,
31.000000,469.992,457.972,463.039,
32.000000,471.02,466.018,461.936,
33.000000,458.036,459.03,470.98,
34.000000,458.038,464.977,462.014,
35.000000,465.003,463.024,461.019,
36.000000,455.96,467.984,457.99,
37.000000,471,470.052,479.008,
38.000000,486.035,474.96,482.01,
39.000000,499.97,481.993,506.92,
40.000000,527.972,515.077,531.986,
41.000000,534.104,522.058,546.11,
42.000000,521.055,542.088,545.102,
43.000000,515.049,515.95,514.052,
44.000000,514.966,521.055,504.932,
45.000000,486.951,504.056,483.04,
46.000000,487.958,481.05,464.023,
47.000000,469.984,473.976,467.956,
48.000000,466.04,447.064,464.011,
49.000000,463.95,452.992,446.977,
50.000000,442.992,448.984,460.034,
51.000000,461.984,450.008,445.472,
52.000000,460.06,454.044,458.52,
53.000000,460.999,465.008,471.524,
54.000000,491.005,471.008,472.016,
55.000000,467.968,477.024,476.016,
56.000000,470.025,455.942,491.048,
57.000000,494.983,479.012,505.012,
58.000000,487.9,493.04,528.978,
59.000000,508.989,501.03,533,
60.000000,518.027,509.988,531.025,
61.000000,506.972,513,501.048,
62.000000,490.965,495.964,486.964,
63.000000,490.03,478.023,481.031,
64.000000,476.972,465,473.029,
65.000000,475.068,460.008,452,
66.000000,469.988,463.01,457,
67.000000,458.988,452.967,453.012,
68.000000,457,442.004,448.968,
69.000000,465.986,460.024,459.035,
70.000000,454.02,447.5,457.008,
71.000000,453.98,449.026,456.958,
72.000000,465.984,457,464.997,
73.000000,451.974,453.016,466.984,
74.000000,477.986,458.984,478.964,
75.000000,462.978,468.485,478.024,
76.000000,482.966,463.05,487.998,
77.000000,480.956,488.02,488.048,
78.000000,489.02,468.009,488.002,
79.000000,468,455.996,477.955,
80.000000,479.033,451.96,478.952,
81.000000,470.984,448.96,470.965,
82.000000,468.004,458.988,454.982,
83.000000,461.98,452.968,448.976,
84.000000,454.972,461.492,456,
85.000000,448.98,445.525,456.965,
86.000000,462.99,455.016,453.032,
87.000000,461.021,445.514,453.014,
88.000000,454.98,452.012,455.004,
89.000000,456.023,449.028,453.99,
90.000000,467.02,457.011,470.028,
91.000000,468.986,457.502,456.988,
92.000000,469.018,462.02,464.024,
93.000000,471.004,450.528,465.064,
94.000000,479.996,460.5,476.017,
95.000000,476.992,460.004,464.02,
