Time [ms],1000000000,1000000001,1000000002,1000000003,
0,506.937,520.921,651.192,567.55,
1000000000,499.066,512.948,607.88,660.056,
2000000000,658.158,668.864,729.66,776.54,
3000000000,810.6,872.08,710.062,779.232,
4000000000,688.98,844.895,673.148,813.024,
5000000000,637,747,701.102,816.658,
6000000000,697.836,764.752,834.58,648.088,
7000000000,684.87,713.89,709.068,696.844,
8000000000,689.92,712.428,728.88,703.91,
9000000000,689.704,710.07,682.84,784.072,
10000000000,679.156,642.028,708.892,722.85,
11000000000,663.996,645.84,722.896,649.836,
12000000000,654.848,579.12,714.834,579.788,
13000000000,630.968,535.92,657.784,585.06,
14000000000,543.936,558.83,638.92,595.888,
15000000000,508.042,539,657.05,545.956,
16000000000,505.008,533.082,624.84,546.962,
17000000000,516.078,537,637.12,561.096,
18000000000,554.892,543.832,629.104,588.92,
19000000000,513.004,562.049,616.925,596.04,
20000000000,554.916,563.938,659.996,637.036,
21000000000,593.88,587.924,706.864,688,
22000000000,661.974,628.087,718.952,710.076,
23000000000,627.072,606.036,754.98,723,
24000000000,595.125,627.077,692.075,674.524,
25000000000,670.899,626.088,790.196,675.192,
26000000000,643.52,604.04,715.252,644.504,
27000000000,671.072,600.96,668.851,644.996,
28000000000,568.024,558.114,633.602,649,
29000000000,600.498,569.092,603.484,601.468,
30000000000,568.499,537,587.52,611.954,
31000000000,537.504,503.05,566.46,571.468,
32000000000,531.027,492.88,568.501,535.02,
33000000000,561.041,491.983,601.858,562.968,
34000000000,563.93,503.936,602.982,499.451,
35000000000,542.999,494.95,612.071,492.995,
36000000000,525.052,512.952,614.088,514.96,
37000000000,549.904,540.988,658.065,536.53,
38000000000,601.064,516.992,665.115,543.968,
39000000000,612.204,534.888,603.909,561.019,
40000000000,617.088,537.06,648.13,594.985,
41000000000,602.732,527.051,667.904,590.038,
42000000000,592.128,513.059,633.13,609.028,
43000000000,594.956,519.498,636.064,565.905,
44000000000,556.178,505.985,644.952,575.08,
45000000000,529.312,515.004,617.04,551.92,
46000000000,527.528,495.97,626.144,553.056,
47000000000,516.496,496.05,637.6,535.002,
48000000000,501.1,488.005,602.478,525.973,
49000000000,541.984,476.048,586.968,505.052,
50000000000,530.512,476.032,588.536,496.92,
51000000000,509.99,485.952,573.08,498.974,
52000000000,518.48,484.933,575,481.509,
53000000000,498.992,483.008,573.002,495.04,
54000000000,519.054,483,580.97,506.041,
55000000000,503.059,485.004,581.492,512.028,
56000000000,528.069,480.956,567.984,510,
57000000000,496.063,488.045,562.919,520.024,
58000000000,523.152,496.017,566.946,507.945,
59000000000,515.9,506.05,554.03,533.027,
60000000000,522.017,480.021,540.496,561.944,
61000000000,542.032,490.02,546.496,507.498,
62000000000,518.939,487.98,549.499,523.475,
63000000000,497.03,482.98,544.98,510.017,
64000000000,511.928,477.054,535.512,489.009,
65000000000,517.088,465.95,522.036,483.976,
66000000000,486.912,469.971,508,477.04,
67000000000,489.999,471.024,504.002,466.954,
68000000000,494.964,474.005,502.496,473.024,
69000000000,493.944,473.04,498.43,475.458,
70000000000,496.07,455.98,505.972,476.975,
71000000000,483.993,470.04,523.004,469.026,
72000000000,472.06,460.976,519.052,470.06,
73000000000,485.03,469,503.026,464.966,
74000000000,462.03,476.492,509.068,473.963,
75000000000,482,467.018,511.926,467.944,
76000000000,489.052,478.974,496.97,464.956,
77000000000,496.96,484.995,515,480.014,
78000000000,471.92,477.048,504,471.496,
79000000000,485.95,469.032,497.944,485.008,
80000000000,464.084,453.04,490.975,470.464,
81000000000,482.07,460.98,496.02,465.968,
82000000000,472.025,464.963,484.024,470.005,
83000000000,471.02,462.944,474.031,470.989,
84000000000,478.008,468.956,510.08,460.494,
85000000000,459.06,457.045,482.98,445.998,
86000000000,467.978,462.04,494.032,464.989,
87000000000,473.948,472.982,484.004,454.969,
88000000000,502.021,500.04,513.994,498.995,
89000000000,466.008,476.999,505.04,460.032,
90000000000,501.03,491.036,518.982,474.05,
91000000000,480,466.995,492.987,458.98,
92000000000,464.084,458.984,481.028,452.027,
93000000000,529.932,561.024,583.938,541.044,
94000000000,548.024,572.006,599.054,561.496,
