Time [ms],1000000000,1000000001,1000000002,1000000003,1000000004,1000000005,1000000006,1000000007,
0,728.04,1485.97,818.98,939.668,1029.2,1447.4,926.098,889.972,
1000000000,607.05,853.96,625.08,719.976,846.04,795.936,697.624,642.076,
2000000000,581.08,748.117,611.04,691.996,737.016,747.08,657.488,583.041,
3000000000,838.916,799.192,650.966,939.032,774.086,947.04,902.915,768.404,
4000000000,1546.96,1112.86,958.919,1723.51,1391.87,1522.26,1593.1,1218.18,
5000000000,2664.06,1345.68,1327.02,3008.74,2146.69,2280.92,2398.47,1607.71,
6000000000,3682.39,1558.91,1611.3,4074.49,2370.02,2505.68,2815.23,1744.32,
7000000000,4323.76,1586.92,1679.04,4192.92,2735.66,2782.96,3192.26,2275.36,
8000000000,4226.63,1500.5,1700.77,3780.47,2420.48,2299.51,2904.06,2418.08,
9000000000,4052.77,1491.88,1709.04,3385.46,2446.31,2125.32,2986.73,2375,
10000000000,3204.95,1458.47,1665.1,2958.27,2274.3,2032.32,2758.7,2302.17,
11000000000,2951.18,1384.67,1506.12,2802.36,2069.92,1939.51,2556.33,2089.37,
12000000000,2642.51,1394.76,1523.13,2463.29,2053.02,1929.11,2309.3,2042.38,
13000000000,2415.89,1226.88,1459.08,2250.65,1815.7,1661.18,2185.5,1955.97,
14000000000,2384.17,1330.5,1388.63,1998.62,1755.23,1523.22,2050.81,1833.12,
15000000000,2177.04,1261,1339.54,1819.11,1580.07,1463.99,1866.22,1740.38,
16000000000,1986.26,1237,1328.55,1671.92,1417.92,1308.8,1660,1611.11,
17000000000,1809.68,1156.06,1232.05,1392.98,1364.9,1220.03,1622.2,1427.1,
18000000000,1802.06,1193.07,1197.05,1337,1331.2,1177.92,1620.28,1485,
19000000000,1814.77,1135.67,1193.98,1271.91,1242.83,1232.17,1675.82,1450.71,
20000000000,1993.2,1247.86,1342.97,1409.49,1524.02,1403.15,1926.85,1632.8,
21000000000,2216,1315.64,1434.78,1586.45,1474.41,1499.1,2065.52,1767.35,
22000000000,2689.1,1370.34,1559,1824.68,1918.5,1662.2,2419.98,1886.57,
23000000000,2731.04,1370.6,1588.4,1974.16,1850.14,1730.7,2410.85,1974.87,
24000000000,2489.22,1435.03,1669.6,2183.72,1971.25,1689.88,2469.55,2133.22,
25000000000,2387.62,1427.34,1616.77,2138.58,1714.81,1657.18,2318.76,1990.98,
26000000000,2166.85,1363.31,1565,2156,1781.08,1602.02,2255.53,1915.22,
27000000000,2338.94,1347.16,1519.83,2063.21,1611.63,1484.12,2075.31,1844.78,
28000000000,2112.42,1339.22,1482.05,1992.81,1631.51,1464.12,2009.94,1762.08,
29000000000,1993.76,1200.45,1390.84,1779.07,1492.72,1348.42,1937.87,1689.81,
30000000000,1864.93,1291.85,1338.04,1660.08,1490.96,1335.5,1841.93,1614,
31000000000,1614.1,1169.08,1289.1,1531.92,1345.75,1242.95,1781.73,1556.18,
32000000000,1588.56,1214.22,1235.12,1487.89,1383.88,1170.13,1691.22,1510.95,
33000000000,1441.4,1159.04,1155.93,1340.88,1194.94,1036.05,1580.93,1365,
34000000000,1359.67,1077.86,1116.97,1254,1261.1,990.928,1493.87,1344.01,
35000000000,1343.07,999.026,1087.34,1156,1141.89,1001.12,1384.77,1242.93,
36000000000,1379.06,1023.22,1080.46,1129.11,1193.25,1030.92,1424.21,1286.08,
37000000000,1425.05,1013.1,1132.47,1162.04,1252.39,1080.11,1589.16,1320.18,
38000000000,1597.94,1035.75,1172.1,1252.48,1305.74,1199.84,1757.47,1332.98,
39000000000,1739.15,1035.6,1267.06,1441.11,1316.25,1239,1741.09,1427,
40000000000,1807.13,1158.06,1281,1549.1,1391.57,1290.93,1760.99,1499.04,
41000000000,1734.74,1146.9,1275.97,1575.95,1474.79,1267.94,1737.07,1542.09,
42000000000,1773.14,1157.69,1258.07,1630.82,1471.68,1246.54,1805.91,1506.25,
43000000000,1540.13,1155.01,1226.94,1683.93,1424.86,1251.42,1814.02,1467.13,
44000000000,1513.54,1072.32,1241.86,1620.11,1429.02,1141,1756.14,1412.88,
45000000000,1471.54,1107.71,1177.05,1564.84,1331.85,1147.06,1705.34,1367,
46000000000,1372,1049.74,1204.95,1404.13,1355.05,1149.46,1641.46,1333.85,
47000000000,1320,1034.25,1131.01,1350.61,1290.98,1114.96,1540.96,1259.08,
48000000000,1251.1,1022.37,1107.05,1304,1316.76,1085.06,1446.14,1239.2,
49000000000,1175.01,1034.42,1041.03,1239.93,1270.68,1010.08,1366.9,1190.98,
50000000000,1084.78,990.961,1010.88,1125.46,1210.57,977.128,1404.61,1175.2,
51000000000,1040.88,950.19,998.126,1037.47,1073.54,954.998,1330.98,1113.12,
52000000000,1094.81,932.674,970.028,1010.01,1098.51,950.848,1290.42,1128.81,
53000000000,1127.94,903.91,994.086,980.09,1055,943.07,1268.15,1105.05,
54000000000,1223.12,960.114,1066.91,1047.99,1056.06,959.226,1307.03,1193,
55000000000,1283.17,928.816,1080.86,1132.45,1160.86,1072.16,1457.43,1205.95,
56000000000,1283.92,972.788,1107.9,1253.54,1153.89,1058.57,1532.08,1261.98,
57000000000,1356.15,1035.27,1078.9,1303.49,1185,1147.15,1535.99,1305.06,
58000000000,1343.74,1011.6,1099.1,1355.01,1276.1,1115.99,1590.17,1267.85,
59000000000,1302.73,1023.31,1074.01,1368.01,1210.78,1150.96,1428.09,1264.03,
60000000000,1259.99,1006.01,1084.04,1297.34,1171.18,1133.06,1457.22,1276.89,
61000000000,1237.9,950.71,1065.99,1252.06,1230.36,1064.9,1357.54,1207.2,
62000000000,1184,951.704,1014.47,1232.86,1211.97,1048,1314.42,1142.1,
63000000000,1205.81,1025.74,980.114,1139.09,1134.19,1055.06,1371.02,1163.98,
64000000000,1182.87,960.086,946.1,1090.07,1149.28,1009.05,1289.25,1121.97,
65000000000,1091.13,923.736,939,1050.04,1019.87,960.921,1197.15,1066.03,
66000000000,1048.09,908.06,920.028,963.95,1005.05,896.12,1179.89,1004.24,
67000000000,968.304,906.796,888.526,901.984,932.875,874.12,1146.8,1038.9,
68000000000,915.018,923,863.976,903.09,986.963,845.06,1119.95,1026.98,
69000000000,943.072,902.6,856.036,845.068,918.074,854.144,1088.04,1042.04,
70000000000,1016.16,864.214,891.04,863.956,908.23,869.816,1093.29,1094.93,
71000000000,1059.97,881.704,905.04,903.9,969.208,958.048,1213.86,1105.1,
72000000000,1106.77,926.072,944.916,989.071,981.103,988.04,1234.13,1179.1,
73000000000,1281,905.152,997.08,1063.03,1017.88,1015.94,1261.47,1211,
74000000000,1238,915.616,976.024,1063.87,1030.38,986.976,1268.2,1136.99,
75000000000,1167.96,950.582,1002.56,1106.96,1090.96,1006.38,1324.95,1133,
76000000000,1207.91,957.094,951.42,1110.1,1045.98,1001.08,1299.45,1134.06,
77000000000,1107.91,945.918,945.06,1117.97,1088.82,1001.42,1258.52,1110.07,
78000000000,1112.24,949.088,902.1,1067.08,1032.94,966.838,1242.88,1077,
79000000000,1125.97,951.758,874.956,1017,1041.1,930.032,1198.36,1026.92,
80000000000,1043.11,929.464,845.994,994.085,959.992,899.096,1097.76,1003.59,
81000000000,990.472,948.464,850.42,950.998,1005.18,892.06,1048.01,977.536,
82000000000,918.128,941.968,823.488,927.948,961.128,836.12,994.013,937.622,
83000000000,897.968,832.446,798.032,857.904,896.52,824.872,964.892,935.96,
84000000000,893.92,830.78,774.942,804.04,852.084,815.984,1004.35,904.035,
85000000000,934.92,804.36,797.1,817.52,852.944,782.978,945.246,931.442,
86000000000,948.974,792.016,814.007,793.516,790.118,811.982,978.296,998.141,
87000000000,1003,791.412,863.96,830,844.964,817.04,1067.02,1009.5,
88000000000,1034.91,744.284,862.55,847.946,824.98,797.536,1024.25,1010,
89000000000,1013.96,815.324,861.944,905.003,931.11,884.92,1133.09,1034.81,
90000000000,1074.1,792.648,878.56,944.516,878.872,867.024,1064.59,1030.14,
91000000000,1021.94,811.508,867.008,997.063,930.042,871.04,1074.1,1018.1,
92000000000,1013.9,803.916,853.961,992.033,923.848,857,1099.83,985.914,
93000000000,973.076,854.25,820.04,967,967.923,891.896,1126.97,983.07,
94000000000,990,834.044,820.524,917.948,955.312,859.932,1082.88,935.07,
95000000000,905.85,842.105,797.048,943.922,925.934,843,1076.98,913.94,
