Frame number,1000000000,1000000001,1000000002,
0.000000,668.042,989.835,747.98,
1.000000,721.965,767.168,733.814,
2.000000,844.94,690.873,689.078,
3.000000,1100.06,704.988,698.994,
4.000000,1224.98,870.246,781.901,
5.000000,1473.24,900.84,815.313,
6.000000,1556.95,950.261,916.092,
7.000000,1417,977.695,870.966,
8.000000,1351.49,928.268,897.88,
9.000000,1278.7,847.271,880.869,
10.000000,1079.1,833.156,778.022,
11.000000,863.92,734.777,747.903,
12.000000,804.885,734.812,693.845,
13.000000,774.072,811.938,671.99,
14.000000,694,740.951,650.896,
15.000000,668,645.097,603.008,
16.000000,629.944,627,583.928,
17.000000,602,632,570.016,
18.000000,590,654,534.068,
19.000000,589.984,611.094,546,
20.000000,628.964,601,572.05,
21.000000,679.884,624.93,581,
22.000000,747.05,666.588,594.112,
23.000000,799.88,703.067,624.012,
24.000000,869.1,742.086,635,
25.000000,899.12,763.1,624.075,
26.000000,919.896,767.976,668.844,
27.000000,882.999,755.88,661.912,
28.000000,857.945,732.04,626.158,
29.000000,791.952,718.92,656.086,
30.000000,762.024,681.144,628.063,
31.000000,695.991,645.043,584.121,
32.000000,650,629.976,584.075,
33.000000,621.046,611.044,572.1,
34.000000,610,584.066,540.045,
35.000000,568.974,586.05,523.024,
36.000000,566,568.04,538.047,
37.000000,530,539.98,519.944,
38.000000,549.056,547.997,539.03,
39.000000,543.994,541.015,524.01,
40.000000,565.968,549.992,543.009,
41.000000,608.945,566.952,566.043,
42.000000,614.04,592.991,563.964,
43.000000,648.08,595.018,596.08,
44.000000,695,615.955,563.963,
45.000000,727.96,612.06,612.125,
46.000000,704.058,643.088,613.088,
47.000000,703.04,627.996,590.968,
48.000000,655.04,615.06,606.99,
49.000000,649.968,590.052,594.03,
50.000000,637.054,608.04,575.992,
51.000000,620.038,571.044,553.086,
52.000000,588.96,576.961,554.08,
53.000000,567,534.034,541.016,
54.000000,555.064,549.08,514.035,
55.000000,540.96,526.52,517.994,
56.000000,535,508.99,526.988,
57.000000,530.042,522.99,519.055,
58.000000,518.992,523.06,534.05,
59.000000,522.995,519.982,537.985,
60.000000,547.976,542.92,556.088,
61.000000,548,556.99,546.987,
62.000000,573.974,573.014,599.968,
63.000000,590.99,584.04,620.136,
64.000000,625.97,566.997,594.978,
65.000000,636.504,586.964,628.984,
66.000000,635.025,589.01,583.44,
67.000000,619.504,579.05,593,
68.000000,617,580.024,594.499,
69.000000,604.994,561.056,578.49,
70.000000,585.6,564,563.528,
71.000000,566,527.04,530.004,
72.000000,539.49,531.023,530.56,
73.000000,534.01,533.018,521.944,
74.000000,520.02,521.977,519.016,
75.000000,514.992,509.006,520.014,
76.000000,532,512.003,506.514,
77.000000,515.494,511.983,528.04,
78.000000,522.516,508.983,521.05,
79.000000,534.025,512.024,512.045,
80.000000,531.998,524.016,536.045,
81.000000,531.984,536.968,545.55,
82.000000,551.96,540.044,565.12,
83.000000,563.02,572.92,575.06,
84.000000,566.017,535.974,589.04,
85.000000,591,550.038,557.016,
86.000000,560.97,534,582.096,
87.000000,551.52,525.038,551,
88.000000,560.504,537.98,535.99,
89.000000,542.008,513.984,549.988,
90.000000,538.496,519.977,525.009,
91.000000,526.024,529.993,519.99,
92.000000,528,507.018,519.008,
93.000000,505.016,499.025,510.02,
94.000000,512.016,491.992,487.008,
95.000000,515,509.01,512.008,
96.000000,505.993,509.016,507.01,
