Frame number,1000000000,1000000001,1000000002,
0.000000,740.247,758.9,1076.27,
1.000000,875.4,852.19,783.431,
2.000000,875.78,680.816,858.994,
3.000000,1337.25,902.53,919.518,
4.000000,1540.47,1313.31,1058.22,
5.000000,915.208,1479.39,1126.15,
6.000000,1462.24,1059.49,1244.71,
7.000000,1390.57,1350.91,1296.35,
8.000000,1654.09,1615.72,1331.99,
9.000000,1248.85,1145.75,1318.64,
10.000000,1200.28,1400.95,977.82,
11.000000,1434.51,1467.12,992.778,
12.000000,1611.31,1054.58,1000.04,
13.000000,1219.64,1223.03,830.557,
14.000000,1264.5,907.387,899.752,
15.000000,1171.15,888.914,905.476,
16.000000,988.103,840.147,782.378,
17.000000,899.9,850.25,687.098,
18.000000,907.788,853.905,686.78,
19.000000,934.92,934.676,596.061,
20.000000,924.84,964.016,634.845,
21.000000,993.196,1045.6,654.052,
22.000000,1011.49,1118.17,660.73,
23.000000,1252.65,918.28,698.984,
24.000000,1412.27,937.45,713.688,
25.000000,1125.8,1133.46,739.618,
26.000000,1257.91,1109.06,791.852,
27.000000,1292.75,1073.89,869.82,
28.000000,1249.52,992.908,863.288,
29.000000,1312.6,979.34,879.656,
30.000000,1284.72,965.53,880.21,
31.000000,1221.44,934.82,862.542,
32.000000,1069.38,904.445,902.826,
33.000000,1052.24,778.575,789.757,
34.000000,988.844,847.287,668.732,
35.000000,908.546,748.18,664.06,
36.000000,853.504,765.876,643.995,
37.000000,818.864,733.044,636.247,
38.000000,838.55,773.17,674.591,
39.000000,887.97,751.476,644.261,
40.000000,1065.7,785.908,723.724,
41.000000,1176.69,832.26,830.401,
42.000000,1248.96,893.068,919.571,
43.000000,1399.95,885.14,1021.99,
44.000000,1512.46,926.648,1062,
45.000000,1411.94,1024.48,975.555,
46.000000,1430.54,953.492,1037.62,
47.000000,1280.5,886.054,1044.76,
48.000000,1134.38,847.32,904.515,
49.000000,985,778.98,920.624,
50.000000,923.06,769.434,821.904,
51.000000,864.128,755.962,804.899,
52.000000,859.16,749.175,780.235,
53.000000,797.108,739.878,762.609,
54.000000,839.02,732.751,779.096,
55.000000,786.92,741.96,837.12,
56.000000,830.6,775.694,818.928,
57.000000,929.124,843.06,879.863,
58.000000,1092.55,1072.56,994.748,
59.000000,1179.71,1100.91,780.48,
60.000000,1399.63,1086.76,874.674,
61.000000,1531.01,1071.04,858.542,
62.000000,1637.28,1105.67,827.351,
63.000000,1596.42,1127.96,751.234,
64.000000,1330.5,1018.97,857.31,
65.000000,1092.2,975.186,815.494,
66.000000,963.9,875.745,959.505,
67.000000,959.015,1045.98,733.852,
68.000000,914.2,825.9,734.062,
69.000000,835.893,796.824,712.046,
70.000000,826.107,823.992,733.344,
71.000000,782.06,779.664,695.073,
72.000000,760.02,802.172,723.978,
73.000000,782.086,829.832,803.434,
74.000000,793.46,897.828,920.502,
75.000000,867.096,1011,889.045,
76.000000,966.777,1112.33,1039.49,
77.000000,1133.9,1196.16,1051.23,
78.000000,1285.73,1028.21,1171.94,
79.000000,1296.84,1122.91,888.39,
80.000000,1204.73,1048.37,956.447,
81.000000,1100.78,1037.19,903.167,
82.000000,1104.85,939.023,794.076,
83.000000,1057.85,870.889,836.769,
84.000000,980.048,816.163,759.1,
85.000000,850.88,756,658.108,
86.000000,830.881,771.088,718.078,
87.000000,772.16,760.004,688.839,
88.000000,744.936,732.044,633.244,
89.000000,726.08,756.884,685.991,
90.000000,719.946,781.22,749.156,
91.000000,739.54,788.44,783.83,
92.000000,788.84,899.444,815.01,
93.000000,889.524,939.072,845.98,
94.000000,999.068,937.176,873.178,
95.000000,1055.06,1028.86,931.897,
96.000000,1106.83,917.44,989.822,
