Time [ms],1000000000,1000000001,
0,594.976,663.472,
1000000000,689.86,564.839,
2000000000,1053.65,649.801,
3000000000,1565,732.12,
4000000000,1906.55,821.851,
5000000000,2031.21,783,
6000000000,1991.17,1208.97,
7000000000,2038.31,1205.38,
8000000000,1720.5,1132.41,
9000000000,1532.35,1085.17,
10000000000,1235.36,1000.8,
11000000000,1090.99,971.899,
12000000000,859.81,930.6,
13000000000,784.167,850.038,
14000000000,716.97,794.202,
15000000000,669.024,716.021,
16000000000,671.475,652.004,
17000000000,656.974,717.031,
18000000000,637.016,630.96,
19000000000,626.88,621.012,
20000000000,666.98,611.994,
21000000000,751.392,737.989,
22000000000,818.508,720.107,
23000000000,858.303,766.077,
24000000000,888.978,770.1,
25000000000,882.706,684.074,
26000000000,764.272,681.17,
27000000000,760.161,690.932,
28000000000,740.25,617.864,
29000000000,709.117,645.09,
30000000000,645.92,608.976,
31000000000,602.965,554.04,
32000000000,573.084,551.039,
33000000000,575.094,554.87,
34000000000,547.132,537.886,
35000000000,515.928,537.024,
36000000000,534.034,517.994,
37000000000,549.052,486,
38000000000,519.03,505.992,
39000000000,580.085,550.932,
40000000000,593.886,588.948,
41000000000,596.956,543,
42000000000,653.936,563.038,
43000000000,638.924,563.044,
44000000000,664.547,557.917,
45000000000,634.96,532.05,
46000000000,591.024,526.954,
47000000000,615.542,520.952,
48000000000,589.48,529.018,
49000000000,560.136,493.982,
50000000000,547.556,507.053,
51000000000,564.944,492.933,
52000000000,519.016,492.968,
53000000000,521.04,497.97,
54000000000,512.008,480.02,
55000000000,516.928,487.958,
56000000000,531.034,512.97,
57000000000,547.013,506.932,
58000000000,568.015,494.006,
59000000000,595.084,501,
60000000000,621,511,
61000000000,564.032,502.045,
62000000000,586.968,491.978,
63000000000,549.898,485.008,
64000000000,553.985,459.99,
65000000000,538.08,453.946,
66000000000,534.97,467.018,
67000000000,512.005,474.988,
68000000000,492.016,502,
69000000000,494.977,474.986,
70000000000,477.006,478,
71000000000,470.02,479.07,
72000000000,484.998,465.052,
73000000000,500.954,482.96,
74000000000,496.036,475.02,
75000000000,508,482.038,
76000000000,531.472,471.998,
77000000000,523.526,484.033,
78000000000,541.512,497.018,
79000000000,541.46,476.047,
80000000000,520.072,485.028,
81000000000,517,483.029,
82000000000,514.994,478.016,
83000000000,473.1,472.04,
84000000000,478.984,479.001,
85000000000,493.019,476.026,
86000000000,497.983,468.006,
87000000000,477.98,469.998,
88000000000,507.937,468.991,
89000000000,479.008,462.01,
90000000000,484.978,480.04,
91000000000,479.556,466.984,
92000000000,471.014,464.504,
93000000000,478.504,470.504,
94000000000,475.032,462.016,
95000000000,486.008,466.004,
