Time [ms],1000000000,
0,1352.92,
1000000000,715.902,
2000000000,547.05,
3000000000,489.003,
4000000000,456.995,
5000000000,448.008,
6000000000,431.036,
7000000000,444.016,
8000000000,437.004,
9000000000,421.96,
10000000000,420.978,
11000000000,422.96,
12000000000,418.08,
13000000000,415.98,
14000000000,404.976,
15000000000,419.948,
16000000000,425.974,
17000000000,429.96,
18000000000,430,
19000000000,425.05,
20000000000,425,
21000000000,430.98,
22000000000,421.012,
23000000000,429.088,
24000000000,432.936,
25000000000,425.04,
26000000000,425.01,
27000000000,421,
28000000000,422.052,
29000000000,417.982,
30000000000,419.038,
31000000000,411.02,
32000000000,410.022,
33000000000,405.029,
34000000000,402.97,
35000000000,418.04,
36000000000,417.044,
37000000000,423.999,
38000000000,410.984,
39000000000,417.986,
40000000000,418.016,
41000000000,403.984,
42000000000,418.006,
43000000000,414.991,
44000000000,414.016,
45000000000,416.004,
46000000000,405.975,
47000000000,410.004,
48000000000,412.024,
49000000000,417.002,
50000000000,412.038,
51000000000,412.033,
52000000000,407.025,
53000000000,408.012,
54000000000,407.968,
55000000000,411.978,
56000000000,414,
57000000000,412.012,
58000000000,418.98,
59000000000,406.963,
60000000000,415.96,
61000000000,414.014,
62000000000,420.003,
63000000000,416.976,
64000000000,406.983,
65000000000,411,
66000000000,400.024,
67000000000,413.97,
68000000000,408,
69000000000,414.504,
70000000000,413.48,
71000000000,408.968,
72000000000,405.976,
73000000000,405.025,
74000000000,404.979,
75000000000,406.008,
76000000000,398.004,
77000000000,400.98,
78000000000,417.976,
79000000000,408.012,
80000000000,408.991,
81000000000,410.02,
82000000000,406.52,
83000000000,407.5,
84000000000,409.48,
85000000000,412.96,
86000000000,402.024,
87000000000,414.975,
88000000000,404.974,
89000000000,412.525,
90000000000,408.012,
91000000000,408.5,
92000000000,406.496,
93000000000,406.97,
94000000000,403.016,
95000000000,413.52,
