Frame number,1000000000,1000000001,1000000002,1000000003,1000000004,1000000005,1000000006,
0.000000,657.595,732.306,550.822,775.384,828.832,926.136,652.318,
1.000000,553.85,545.638,525.95,548.316,599.894,850.507,629.397,
2.000000,545.493,592.366,479.124,597.425,543.925,702.265,572.752,
3.000000,578.075,487.767,506.558,689.442,588.33,892.395,585.525,
4.000000,554.872,524.425,610.52,544.849,616.92,786.186,542.866,
5.000000,520.121,611.57,513.481,519.08,572.769,852,545.775,
6.000000,613.912,570.037,619.486,614.821,588.555,676.39,495.446,
7.000000,443.519,531.696,530.002,583.076,518.92,629.512,478.935,
8.000000,442.974,460.013,531.36,547.077,471.96,493.981,454.03,
9.000000,505.096,493.04,493.895,554.96,466.923,577.066,486.488,
10.000000,472.072,437.954,440.033,549.528,537,453.046,497.96,
11.000000,457.497,463.956,469.52,437.931,442.094,488.476,459.047,
12.000000,506.476,452.456,501.008,448.048,462.022,511.058,440.493,
13.000000,458.096,458.006,458.13,458.112,449.868,470.078,441.966,
14.000000,590.965,466.02,516.096,483.95,488.955,523.05,480.994,
15.000000,614.186,534.87,512.824,523.982,531.996,527.04,473.909,
16.000000,540.224,760.572,469.984,639.93,563.183,643.256,543.17,
17.000000,618.082,531.375,526.742,763.163,603.499,799.34,497.003,
18.000000,545.085,681.823,473.168,531.63,649.198,1052.73,644.3,
19.000000,647.715,494.885,529.684,662.606,653.11,687.546,651.375,
20.000000,544.911,511.956,486.05,574.295,530.313,632.742,541.932,
21.000000,550.32,474.12,491.07,595.169,534.785,898.472,559.025,
22.000000,569.949,461.884,524.012,502.108,502.938,594.83,480.192,
23.000000,566.097,455.15,480.941,474.08,485.112,610.88,474.08,
24.000000,452.089,483.95,495.871,534.492,473.56,628.18,414,
25.000000,485.05,458.625,451.034,506.108,481.516,499.556,462.967,
26.000000,433.023,480.95,438.947,475.122,454.081,510.834,467.995,
27.000000,421.538,479.53,465.533,445.971,453.985,510.972,461.054,
28.000000,451.6,452.92,429.963,439.96,445.038,484.984,466.988,
29.000000,433.014,424.039,432.961,439.48,456.956,487,427.988,
30.000000,478.976,449.032,429.5,422.53,448.014,469.484,440.04,
31.000000,475.512,444.5,455.452,451.089,477.99,516.52,476.92,
32.000000,496.951,554.818,485.987,513.96,524,540.92,458.947,
33.000000,614.024,620.74,509.283,513.923,629.81,600.156,508.536,
34.000000,574.12,470.073,509.082,497.975,604.784,604.992,513.582,
35.000000,509.559,498.704,482.96,502.156,617.648,614.918,517.927,
36.000000,474.807,522.118,474.105,596.85,601.049,651.936,493.03,
37.000000,474.035,509.986,456.026,538.14,530.927,659.6,512.002,
38.000000,516.476,486.064,448.507,516.512,521.15,669.78,495.017,
39.000000,445.968,488.536,443.376,473.019,504.808,515.084,470.48,
40.000000,441.939,475.04,442.475,464.072,474.039,530.08,449.124,
41.000000,445.964,456.968,441.058,455.976,464.014,483.891,434.965,
42.000000,435.984,442.026,445.512,453.11,457.99,460.064,448.992,
43.000000,440,421.51,444.034,433.985,446.03,452.06,441.475,
44.000000,448.988,424.988,448.036,432.942,425.008,451.096,433.976,
45.000000,451.032,427.063,457.965,439,442.974,465,435.025,
46.000000,458.944,437.986,468.98,446.065,459,447.995,432.92,
47.000000,461.948,455.001,474.944,479.2,503.122,452.021,451.04,
48.000000,496.432,451.958,513.02,475.9,558.92,455.049,459.034,
49.000000,505.05,468.078,534.875,473.897,558.079,470.912,478.038,
50.000000,478,486.974,611.531,491.95,573.504,477.118,472.89,
51.000000,494.067,486.003,531.137,494.397,578.056,511.84,498.899,
52.000000,553.064,598.144,526.985,490.915,561.963,561,487.08,
53.000000,511.11,559.022,483.5,471.983,534.92,495.953,471.03,
54.000000,525,529.94,475.056,494.988,486.98,473.029,484,
55.000000,499.972,479.552,465.025,472.06,501.985,520.01,466.488,
56.000000,437.52,465.485,455.982,465.5,480.031,507.98,465.992,
57.000000,428.026,459.008,434.012,458.504,476.028,508.956,460.978,
58.000000,422.005,458.002,444.032,453.48,487.014,496.952,450.05,
59.000000,444.02,472.974,443.006,442.019,459.02,486.931,446.504,
60.000000,430.005,457.974,461,444.486,433.008,514.938,439.988,
61.000000,428.51,457.992,462.024,434.03,441.975,498.98,447.984,
62.000000,436.98,477.985,462.996,460,459.003,523.072,462.012,
63.000000,438.03,468.552,501.993,472.071,491.042,540.6,452.04,
64.000000,485.528,486.048,506.043,487.928,524.992,510.936,471.02,
65.000000,460.932,510.986,550.099,487.997,502.952,563.976,479.024,
66.000000,473.064,515.006,532.128,542.029,509.488,562.067,489.916,
67.000000,501.969,509.084,548.48,553.87,493.912,522.025,499.059,
68.000000,512.56,548.096,541.889,521.073,501.12,575.746,507.088,
69.000000,487.993,545.498,524.043,488.034,484.014,551.957,507.025,
70.000000,504.048,512.976,501.05,476.964,482.984,531.96,545.997,
71.000000,485.936,505.936,482.522,488.978,462.05,507.142,501.99,
72.000000,466.51,481.98,467.036,459.032,448.03,483.176,472.01,
73.000000,488.468,472.999,442.987,442.976,447.02,511.978,463.03,
74.000000,452.93,476.008,452.49,456.024,437.998,484.99,454,
75.000000,451.002,456.971,437,442.992,433.486,488.032,451.996,
76.000000,454,470,439.996,441.503,445.012,496.965,448.036,
77.000000,469.959,508.009,447.514,441.005,461.02,501.938,455,
78.000000,460.035,511.022,459.99,438.492,467.98,553.97,453.992,
79.000000,513.04,490.039,478.04,459.487,486.034,540.966,477.988,
80.000000,497.964,513.936,529.6,472.999,541.942,534.052,499.96,
81.000000,541.072,525.536,515.08,478.976,540.999,604.12,481.984,
82.000000,542.526,514.056,546.877,512.01,567.947,639.933,522.992,
83.000000,535.507,480.966,552.971,528.971,526.919,523.14,486.514,
84.000000,513.054,496,511.986,509.057,530.9,527.04,496.956,
85.000000,486.954,504.462,508.012,513.002,506.109,511.04,472.1,
86.000000,504.018,488.55,473.542,484.004,493.984,501.96,475.973,
87.000000,465.035,488.52,474.496,486.998,520.05,476.044,471.02,
88.000000,460.969,477.02,445.994,470.55,517.98,483.04,458.009,
89.000000,452,478.022,445.488,462.504,481.01,490.992,457.52,
90.000000,439.004,498.025,442.993,459.016,466,454.936,457.98,
91.000000,449.55,495.001,448.972,460.516,455.013,481,460.028,
92.000000,456.01,476.033,457.525,457.99,442.516,493,470.009,
93.000000,461.05,511.004,479.984,450.974,449.034,519.056,491.019,
94.000000,484.038,517.063,483.472,446.504,471.986,532.016,485.481,
