Frame number,1000000000,
0.000000,461.04,
1.000000,482.962,
2.000000,489.496,
3.000000,465,
4.000000,460.026,
5.000000,453.044,
6.000000,446.995,
7.000000,446.496,
8.000000,442,
9.000000,431,
10.000000,435,
11.000000,431.03,
12.000000,439.03,
13.000000,432.494,
14.000000,440.985,
15.000000,433.004,
16.000000,436.98,
17.000000,438.98,
18.000000,443.96,
19.000000,451,
20.000000,435.996,
21.000000,445.987,
22.000000,440.014,
23.000000,434.98,
24.000000,435.969,
25.000000,422.973,
26.000000,426.98,
27.000000,437.978,
28.000000,432.005,
29.000000,424.028,
30.000000,428.002,
31.000000,427.024,
32.000000,431.964,
33.000000,438.972,
34.000000,448,
35.000000,444.025,
36.000000,445.014,
37.000000,443.006,
38.000000,437.968,
39.000000,433.508,
40.000000,433.465,
41.000000,431.026,
42.000000,431.004,
43.000000,427.993,
44.000000,428.986,
45.000000,425.012,
46.000000,430.956,
47.000000,438.028,
48.000000,429.98,
49.000000,447.016,
50.000000,439.04,
51.000000,436.01,
52.000000,441.997,
53.000000,441.986,
54.000000,437.048,
55.000000,432.035,
56.000000,434.976,
57.000000,432.994,
58.000000,432.024,
59.000000,434.008,
60.000000,433.008,
61.000000,439.02,
62.000000,435,
63.000000,425.036,
64.000000,436.997,
65.000000,440.04,
66.000000,436.988,
67.000000,432.956,
68.000000,439.992,
69.000000,444.001,
70.000000,433,
71.000000,446.011,
72.000000,430.96,
73.000000,442,
74.000000,431.028,
75.000000,437,
76.000000,433.96,
77.000000,432.004,
78.000000,430.984,
79.000000,431.04,
80.000000,439.036,
81.000000,438.045,
82.000000,447.032,
83.000000,446.012,
84.000000,439.001,
85.000000,435.976,
86.000000,433.001,
87.000000,436.012,
88.000000,444.027,
89.000000,435.988,
90.000000,430.024,
91.000000,425.004,
92.000000,437.05,
