cid: 2, volume: 284.2051586697901, center: [12.444616606009909 35.76554117932433 2.821183108422429]
cid: 3, volume: 148.64166977384033, center: [13.660948372995389 28.166668726561998 7.037656698301826]
cid: 4, volume: 130.36269737422484, center: [16.34966890585243 33.123391202761944 2.591752672621657]
cid: 5, volume: 195.29638932220752, center: [14.98639901042428 43.59427577922743 3.7952762814466174]
cid: 6, volume: 400.15613887850253, center: [16.623099345200117 37.19101793555106 7.534844956296119]
cid: 7, volume: 281.97624801762225, center: [18.584082780723485 50.837298554741075 3.522778482467993]
cid: 8, volume: 326.4687337282027, center: [19.970529431058527 44.382554206453875 4.1282552342300285]
cid: 9, volume: 126.29541169697846, center: [20.552550672989256 37.10557703103552 1.9086416265555473]
cid: 10, volume: 148.2035078507646, center: [21.397852722818037 57.01495835844206 2.3207385582299636]
cid: 11, volume: 41.69205950657476, center: [29.881569166811172 11.084408055174777 22.353830519876627]
cid: 12, volume: 77.10697320212992, center: [23.10921626033296 33.270166250772085 1.8530817431747992]
cid: 13, volume: 275.68005168820804, center: [26.446665547143937 60.83743419428512 2.2219063135754267]
cid: 14, volume: 335.6796593719902, center: [25.930550414626094 43.618566545628674 3.3106254114667575]
cid: 15, volume: 286.8436554674417, center: [23.798159856099463 52.49582988209803 4.531803362671847]
cid: 16, volume: 170.73074585237515, center: [28.478105137385054 52.72873145996987 2.193850149101763]
cid: 17, volume: 71.59184812689419, center: [27.164996526256594 26.577335710417774 5.749361280934008]
cid: 18, volume: 79.25015652152204, center: [30.49691807230994 45.81151330078125 1.46762611875]
cid: 19, volume: 154.12821907148415, center: [35.35440957880277 18.734043420122365 14.467188276342624]
cid: 20, volume: 269.9363203922372, center: [31.381158811963534 40.80484048549702 5.035856494989238]
cid: 21, volume: 434.89475917104954, center: [30.798434770400394 59.48981013532426 6.629313434456929]
cid: 22, volume: 114.58886814349883, center: [33.27975539786868 62.979025710598506 1.2040070614713216]
cid: 23, volume: 395.669741796575, center: [34.17775780456276 69.05787918271986 4.766993423565806]
cid: 24, volume: 165.67283321860972, center: [34.2314855481818 28.74030855714943 3.030300252256655]
cid: 25, volume: 291.5205577333152, center: [31.78100855572549 51.31631191362522 5.941306190246691]
cid: 26, volume: 38.101036789193294, center: [33.687643926113566 36.667490681249994 0.921986208]
cid: 27, volume: 391.9834664872206, center: [37.19820546108453 56.371316087650655 3.0231948372375586]
cid: 28, volume: 430.5798167546734, center: [35.844149716740056 46.55372069806875 6.087526071840988]
cid: 29, volume: 91.34723570209091, center: [35.84990892459655 49.71848826678832 1.8188852940563085]
cid: 30, volume: 151.27064131229466, center: [37.739738342843616 24.887464408097728 8.72172852820981]
cid: 31, volume: 178.8081656516841, center: [38.790665488303326 37.92560069355955 2.0102414833795015]
cid: 32, volume: 337.9942973569337, center: [40.77131385396508 46.70220208260061 3.1495854517669937]
cid: 33, volume: 192.46738734060992, center: [43.14920041489425 19.114761451054143 14.220373157700683]
cid: 34, volume: 184.77097790919288, center: [41.97671642907456 24.349585058304978 7.0864203113207545]
cid: 35, volume: 333.06021309273314, center: [40.54882546046926 65.59761103115885 3.1142564006463425]
cid: 36, volume: 291.3491030677638, center: [40.024263306494696 30.001060396622748 3.6025915056723443]
cid: 37, volume: 311.79030930516603, center: [43.70353078049847 55.34265026010448 2.8717727295848228]
cid: 38, volume: 108.32124759167652, center: [44.72355203168927 40.002636194952515 1.3247806704185718]
cid: 39, volume: 129.81023234078154, center: [43.90179103009703 36.3986889335926 4.987354767464044]
cid: 40, volume: 125.60006777557568, center: [45.682222471805474 31.831109568974668 1.599223750151676]
cid: 41, volume: 58.10408110351977, center: [46.37240524574132 22.817168671721312 6.9233752527049175]
cid: 42, volume: 95.78600648803193, center: [47.36322146048467 47.36293608159308 1.495097891706444]
cid: 43, volume: 219.54769923852905, center: [48.38903612983113 60.065754535532996 3.404881621827411]
cid: 44, volume: 86.48935351146878, center: [48.51437986407849 27.312892592511012 2.1756784609030837]
cid: 45, volume: 66.4958344563396, center: [48.53484546069401 52.4127205726257 1.5232796312849162]
cid: 46, volume: 52.95091587778138, center: [49.26150472815594 37.726291138963845 0.8903218971937399]
cid: 47, volume: 184.36139176370904, center: [50.01862402366273 22.714851908059934 7.960323774141049]
cid: 48, volume: 220.18589160474804, center: [51.724082060809565 41.526343865136695 2.8988589601790964]
cid: 49, volume: 256.7057353671898, center: [52.41693930092547 56.59880725836735 4.075962667346938]
cid: 50, volume: 292.70168987378014, center: [52.93405066779688 32.38580068646881 2.727100898467246]
cid: 51, volume: 362.5027892715823, center: [54.806854854840445 48.84043452442389 3.275082893331056]
cid: 52, volume: 247.1614256514969, center: [57.53315851326847 29.504580348697395 2.38172280511022]
cid: 53, volume: 252.1431362116839, center: [57.516458939004224 42.89893214313777 4.590509362566582]
cid: 54, volume: 249.61894252439984, center: [20.250734580685783 29.805156673471725 5.833766011142486]
cid: 55, volume: 237.69331800938235, center: [29.71799628047935 67.19914439516711 5.394268228780956]
cid: 56, volume: 206.99340761648986, center: [46.21427365958086 44.50214676393171 5.263063521052874]
cid: 57, volume: 309.37089346905225, center: [48.86409691843629 38.0315954368669 5.933350390775578]
cid: 58, volume: 375.4380912615134, center: [55.14392617413997 25.73249949852848 7.659656874299125]
cid: 59, volume: 242.30354346087475, center: [22.337799220358487 39.08645951210787 6.464174597138141]
cid: 60, volume: 72.7158287121754, center: [25.63120252901386 20.888462321325648 11.892370590778098]
cid: 61, volume: 406.88097187179517, center: [40.489234109575946 41.79988912573743 8.485120241513718]
cid: 62, volume: 391.4786277497638, center: [38.88210687824192 70.91277693863599 6.631453649821163]
cid: 63, volume: 470.48112753215605, center: [49.86935661004015 52.55513354304254 7.818253193458587]
cid: 64, volume: 117.80840575218566, center: [53.80769615757311 17.783370160090556 10.908688014998383]
cid: 65, volume: 375.6857480006432, center: [43.169424100098745 52.64088801502243 8.412045243705787]
cid: 66, volume: 346.20507078500486, center: [51.11826833710936 31.604516358292525 8.413163757827547]
cid: 67, volume: 208.87940893755493, center: [58.74428936651814 37.17586131433262 3.314046274909937]
cid: 68, volume: 309.43757028343333, center: [42.402241885651634 62.2026004075294 9.114774911377209]
cid: 69, volume: 262.32563829359583, center: [45.31688057318693 31.37026049019608 8.883223906045751]
cid: 70, volume: 109.007066253882, center: [25.471358121184497 31.029505897413493 2.9278908681842015]
cid: 71, volume: 313.0762192968013, center: [35.35355123251695 63.00081070180723 8.23532081927711]
cid: 72, volume: 106.47334730740066, center: [22.3118388953775 61.35635262600644 6.01934252173913]
cid: 73, volume: 78.57386311851387, center: [58.8776350445365 24.930828978664078 5.342545441265608]
cid: 74, volume: 200.86866595262703, center: [28.538487186573725 29.852870410114754 7.301333266004362]
cid: 75, volume: 292.08254802595576, center: [56.25579554956323 37.81943724986955 10.71678826790373]
cid: 76, volume: 38.00578419722031, center: [40.010361244639526 20.66818185225564 11.211066192857142]
cid: 77, volume: 79.60259111182208, center: [18.373611956823304 21.60708771592677 13.275966031590283]
cid: 78, volume: 337.48945861947686, center: [30.56011574503959 47.19828618022353 12.237841626203043]
cid: 79, volume: 160.31963754972807, center: [44.814772508692684 59.761938173875585 9.338256671617847]
cid: 80, volume: 106.66385249134662, center: [58.25551488394359 20.692000405697446 7.681441225933203]
cid: 81, volume: 318.27701081852615, center: [46.51538517018705 64.7743726892171 5.044155384898545]
cid: 82, volume: 265.7452063454259, center: [53.27243121313748 44.75429435995913 8.477246580898957]
cid: 83, volume: 249.53321519162418, center: [44.27881507499867 69.78302630957742 8.82128542241478]
cid: 84, volume: 121.70423676388067, center: [45.68678607944288 26.42216263031228 5.756003699929561]
cid: 85, volume: 276.26109249924326, center: [17.2489462938276 27.52413662057373 10.854878673913044]
cid: 86, volume: 225.73911771677297, center: [25.039490662508264 35.86885240235875 11.600580808831596]
cid: 87, volume: 259.9347982350739, center: [25.199051955285615 57.832401354923235 10.616532823133864]
cid: 88, volume: 677.1792521135296, center: [33.35923340579328 27.24467258935479 12.641834893006344]
cid: 89, volume: 387.4113420725174, center: [24.4309729650981 27.915820309512686 12.191632305640244]
cid: 90, volume: 177.69371032560022, center: [56.322434950873436 33.13173355087108 8.94940024076655]
cid: 91, volume: 392.0025170056152, center: [33.419646043299636 55.26331361339116 11.748222667006852]
cid: 92, volume: 97.16716907164019, center: [54.73522458880056 53.35261881197921 8.708846644740712]
cid: 93, volume: 136.8208231099931, center: [39.50848364079399 18.512097300438597 15.672352363408523]
cid: 94, volume: 247.1709509106942, center: [41.08591940550066 31.81201069902501 10.898296805849936]
cid: 95, volume: 263.7163261364014, center: [42.548102744883735 48.17957963499603 11.958687530358304]
cid: 96, volume: 162.81525545942023, center: [45.71379125888508 42.07278926449424 10.381386874480782]
cid: 97, volume: 284.4147143721306, center: [19.65689057503411 47.7084006388526 10.944669206470412]
cid: 98, volume: 312.4666027081742, center: [20.887374690849306 34.690314561562616 13.008564691790635]
cid: 99, volume: 207.65065050110343, center: [50.58815428106197 61.979054712935785 10.943743764426605]
cid: 100, volume: 354.57777361943005, center: [30.476940293334938 34.531544953498994 4.332351312169242]
cid: 101, volume: 124.25700622875662, center: [49.76155357039713 46.34727859904178 11.933105239248754]
cid: 102, volume: 362.30275882843904, center: [38.36750690091768 58.15730251821958 12.06661762361973]
cid: 103, volume: 226.25348171342708, center: [60.80300528311017 24.95557718441881 10.913508240411739]
cid: 104, volume: 412.98666301726337, center: [14.13347685337033 31.111656612530847 15.711304040420233]
cid: 105, volume: 243.20844308461807, center: [13.691192957876536 43.751737411526264 10.432786229115262]
cid: 106, volume: 337.16559980676874, center: [14.31999338086738 21.980872229214338 16.8426981071701]
cid: 107, volume: 180.7036922319465, center: [46.76647354308045 18.367351336724475 13.422673456907912]
cid: 108, volume: 76.23064935597849, center: [57.64222326425738 47.213040108896664 9.606698527677121]
cid: 109, volume: 470.49065279135334, center: [10.787352817753845 32.84334642949548 11.617678297596873]
cid: 110, volume: 198.48735115330246, center: [22.59440419629603 53.5176886392888 10.67469660012957]
cid: 111, volume: 243.5418271565235, center: [28.850518683402658 24.517030364127034 12.655832765272997]
cid: 112, volume: 136.04927711501196, center: [60.50166442566798 38.41886982230624 10.28624293068683]
cid: 113, volume: 245.69453573511294, center: [16.380103215240922 14.607901403000698 22.79841660397767]
cid: 114, volume: 127.87660472372998, center: [21.68555482057957 19.90711051139665 16.058693440893855]
cid: 115, volume: 142.20259455646666, center: [22.441305454795557 42.57924601909036 11.856694959675798]
cid: 116, volume: 390.4022734604691, center: [26.62942308120408 48.81770750120773 9.802486228260868]
cid: 117, volume: 188.40962692256082, center: [43.780353689599465 37.9522918258089 11.537555171132457]
cid: 118, volume: 147.0414262286942, center: [46.4757261119801 55.07829784679666 12.987211667908271]
cid: 119, volume: 262.19228466483366, center: [16.353454421239597 51.501972721990114 12.61819905314975]
cid: 120, volume: 30.39510209857895, center: [18.343374125854975 17.87271621247258 16.519229413350047]
cid: 121, volume: 297.6167236195861, center: [48.967968198845504 37.91551698506961 13.6447072712434]
cid: 122, volume: 188.47630373694193, center: [60.56600593818067 31.577856423535657 8.954557695052307]
cid: 123, volume: 191.01954794262056, center: [10.1237940438025 24.40193779046574 12.084464686670987]
cid: 124, volume: 295.3401866714318, center: [21.347936560811693 26.459510765416372 14.66036491409727]
cid: 125, volume: 236.04544816824975, center: [31.641346408890758 72.4884827768048 13.972283196461]
cid: 126, volume: 605.1111410267706, center: [36.1082144562994 34.1812416021298 8.025210014096368]
cid: 127, volume: 283.78604726510895, center: [40.750143450899365 65.81286241803444 14.449885807823986]
cid: 128, volume: 151.58497486580552, center: [49.397314927235 27.128851565791127 12.6817843372188]
cid: 129, volume: 112.70286682243376, center: [56.59088524338534 51.69519549340771 12.674800213995942]
cid: 130, volume: 291.13954736542325, center: [27.96502368926954 55.33455156787175 15.32076725516113]
cid: 131, volume: 229.5968476916788, center: [33.666563122064154 42.298312140433126 13.519114526821275]
cid: 132, volume: 225.84389556794324, center: [35.243985996700076 73.40105214148039 15.325103862273304]
cid: 133, volume: 200.69721128707567, center: [47.00586199081377 49.33128939432843 13.756475643616517]
cid: 134, volume: 220.22399264153722, center: [52.93046343207565 24.9168869591263 12.941906532547577]
cid: 135, volume: 136.58269163006065, center: [59.49486746190653 43.381354948776064 12.964589428830461]
cid: 136, volume: 222.6719842552429, center: [16.958719594888137 40.57274186322026 13.78158311299568]
cid: 137, volume: 101.47258622881904, center: [48.19279359606276 58.14528275415376 12.342382854829626]
cid: 138, volume: 241.20813865318544, center: [26.356925585697123 39.409329586956524 7.52235645652174]
cid: 139, volume: 195.57262183892917, center: [39.8707218107373 72.98204242000293 12.89254349868498]
cid: 140, volume: 150.81342887082434, center: [46.8171107924429 68.74564681131181 13.154211998736816]
cid: 141, volume: 178.45573106138409, center: [53.28262305993542 39.02274546821457 14.61347100984788]
cid: 142, volume: 229.23488784218145, center: [46.628878218610474 25.735061259162304 14.009286775617053]
cid: 143, volume: 423.26441769114825, center: [26.91787861650623 67.18998011585201 9.638462327572238]
cid: 144, volume: 269.73628994909393, center: [31.66924894945257 20.250901551592627 16.738607198036583]
cid: 145, volume: 193.47706481552353, center: [49.60007521182748 33.372792436441514 15.49219121824537]
cid: 146, volume: 144.2410000246885, center: [58.734726370629865 16.0077516395034 13.72433427814832]
cid: 147, volume: 89.51838593620964, center: [54.07464616626041 56.62263768259204 12.422006433549692]
cid: 148, volume: 194.93442947271018, center: [29.149721379456807 32.62052015797703 13.96991777466406]
cid: 149, volume: 346.22412130339944, center: [30.828663459505872 65.51939246137339 16.43029328916309]
cid: 150, volume: 136.06832763340654, center: [37.39199783976175 22.480066434266714 13.765621182779139]
cid: 151, volume: 635.7634251236766, center: [38.49702292342275 38.33823620650985 16.668221144610083]
cid: 152, volume: 417.4921106175855, center: [56.362748980818104 19.25453532936345 16.531881397125257]
cid: 153, volume: 187.4761515212256, center: [48.51868293810972 45.02867000231176 17.14191659940555]
cid: 154, volume: 203.03089979041374, center: [54.63042539343751 47.17296972646024 16.114717619704436]
cid: 155, volume: 84.77480685595508, center: [58.31087189380132 47.34747958550562 13.75164655230337]
cid: 156, volume: 167.20639994937477, center: [25.602727807489114 60.78414655013102 15.287891093710837]
cid: 157, volume: 305.53221401254103, center: [35.40067559836343 65.84482869290123 16.03195890432099]
cid: 158, volume: 187.20944426370124, center: [51.89398243245463 50.71737778406432 15.527052852421898]
cid: 159, volume: 270.06967402099934, center: [35.95820505649616 45.41664148349381 11.742997186382393]
cid: 160, volume: 240.05558229031234, center: [33.64019541309878 14.400252677267678 21.004668542635507]
cid: 161, volume: 153.14711737416243, center: [56.283586523994764 41.48273949182112 16.628724644296554]
cid: 162, volume: 83.5555736787009, center: [61.215391464881726 30.211825575923395 13.724894298221614]
cid: 163, volume: 305.5607897901329, center: [22.26265859015632 63.750574504348634 13.092468395165062]
cid: 164, volume: 263.14481058456346, center: [22.96611032451841 50.14338425392746 17.523703392383986]
cid: 165, volume: 366.3509939872908, center: [32.388479142838484 38.62059269497673 17.853068478796704]
cid: 166, volume: 94.90015738268319, center: [24.11531214764325 17.03949504968383 18.51657208355917]
cid: 167, volume: 205.31696199776536, center: [47.31806526515188 61.873247373903965 17.408955685803758]
cid: 168, volume: 220.57642723183727, center: [58.28885946459619 31.9690265347843 17.182917820248736]
cid: 169, volume: 339.28973260776627, center: [18.96248771548748 58.07514456788321 11.225206322080291]
cid: 170, volume: 166.12052040088275, center: [27.814892374789896 18.352987872419725 18.549516277723622]
cid: 171, volume: 39.482199372801546, center: [37.05286846692368 14.669262483112183 17.75358794583836]
cid: 172, volume: 234.69286136223337, center: [42.031214658519076 58.24555189114818 17.739252144100814]
cid: 173, volume: 91.52821562683958, center: [54.843965498722376 30.459543114267877 15.886136333593507]
cid: 174, volume: 222.0909434442077, center: [24.374134778431838 33.47623684411992 18.439235138638704]
cid: 175, volume: 98.15779602815921, center: [32.1145969335043 61.25142304628822 17.66909223930131]
cid: 176, volume: 179.4463580179031, center: [38.39787833710448 28.270341057805616 17.19318677870375]
cid: 177, volume: 99.31987765022961, center: [61.77921431420186 34.54529235139541 15.729275948499088]
cid: 178, volume: 251.49541858626762, center: [11.346683629972354 37.29041301181684 17.877070355982273]
cid: 179, volume: 124.83804703979182, center: [24.501518734958633 68.14124270475354 16.780311219403327]
cid: 180, volume: 187.75238403794725, center: [25.885015325604666 23.076390396859622 17.34388685295013]
cid: 181, volume: 63.238195810863566, center: [52.21313258817456 43.948829687528246 16.299974899005875]
cid: 182, volume: 135.2396300832416, center: [60.77855338719078 20.487079088075788 17.20494477510917]
cid: 183, volume: 300.3980993051972, center: [13.723671303185366 45.94688668503662 17.91949159086153]
cid: 184, volume: 274.72752576847824, center: [20.31796726445552 39.639706112128145 19.06926394221968]
cid: 185, volume: 255.38172433876534, center: [44.387553772425164 43.11869965894596 18.252483085934877]
cid: 186, volume: 185.30439242424157, center: [58.07089626486755 25.96894171363216 17.023279558985298]
cid: 187, volume: 144.7077377253561, center: [43.75555888064384 71.92045363210902 17.10975426451422]
cid: 188, volume: 142.0120893725207, center: [49.165938679480526 66.26683362073244 17.764690016768395]
cid: 189, volume: 121.88521668862934, center: [51.850621542673395 60.47333829825727 16.614622904306035]
cid: 190, volume: 243.7894838956533, center: [24.98791567417552 43.01268449167774 18.944224090919747]
cid: 191, volume: 190.41945661319076, center: [41.00674379603558 23.96486676747036 20.701234277900056]
cid: 192, volume: 161.14833509989302, center: [60.61735093506135 39.33529277535761 18.049511949284785]
cid: 193, volume: 237.76952008296072, center: [16.51703479302783 55.477531174845765 18.898694661986216]
cid: 194, volume: 292.5588109858207, center: [17.47048380519745 31.2100375364329 18.7692416864622]
cid: 195, volume: 222.90059047597805, center: [37.52376937554946 54.58070311381992 15.658147373402844]
cid: 196, volume: 364.55071999900144, center: [45.040808582731025 36.22063180536684 19.79806643987772]
cid: 197, volume: 144.09812113672902, center: [20.634243475904213 54.86456643303808 17.86798002148334]
cid: 198, volume: 85.07961515026862, center: [21.167579184979964 14.884497642857141 20.37783409359606]
cid: 199, volume: 149.9466302838702, center: [31.456581557217877 46.16838949139245 17.770771036240628]
cid: 200, volume: 232.37822337728988, center: [39.852744028175564 46.68221735747664 18.84690676254304]
cid: 201, volume: 48.42641775906468, center: [54.0600710274199 56.90681852537372 16.39880021311959]
cid: 202, volume: 189.34310232389606, center: [40.30207033365515 53.43897230138847 19.710064862435857]
cid: 203, volume: 138.6401476166771, center: [53.61275388654516 34.54797006946067 19.76477007289591]
cid: 204, volume: 193.6866205178641, center: [11.163332143556593 18.152436909781645 19.85311398930363]
cid: 205, volume: 128.3719182019895, center: [45.92533771864898 57.93619687185575 18.416169743266305]
cid: 206, volume: 131.61050632907092, center: [50.88479057667151 18.080403385720487 13.852499917058696]
cid: 207, volume: 184.0470582101982, center: [10.494969956934082 24.882304920375738 19.547984194570954]
cid: 208, volume: 308.4278928085197, center: [18.03736994983227 48.534926380821496 20.49096090115812]
cid: 209, volume: 277.0612142718163, center: [28.501583568017132 39.022458921030015 12.910891640784543]
cid: 210, volume: 149.24176110327014, center: [29.373141264892208 15.165550264009445 21.091940727438093]
cid: 211, volume: 281.36663142899516, center: [48.83340416915929 14.495130853566472 20.191860877331663]
cid: 212, volume: 111.27407794283901, center: [55.629465875050606 52.827989169491524 18.199080580508475]
cid: 213, volume: 153.71863292600034, center: [28.05794845357457 71.68214522654604 18.49370863105713]
cid: 214, volume: 158.81464659655495, center: [39.49091362680152 68.68338739474 20.369680340940445]
cid: 215, volume: 321.4489221312265, center: [53.23220150531604 12.237389788781224 20.83333810880967]
cid: 216, volume: 85.96546425561736, center: [12.733382630088078 12.5991471066482 24.292730923878114]
cid: 217, volume: 105.22553835255458, center: [19.470135563553107 44.31687663356567 19.488905100162942]
cid: 218, volume: 176.35064877878116, center: [33.53560956009881 54.46729699883871 19.23174238757157]
cid: 219, volume: 180.85609637910326, center: [44.1306180578444 50.81142590235424 19.508055887817978]
cid: 220, volume: 292.75884142896393, center: [18.767669830059955 26.04817980248902 22.24422168594436]
cid: 221, volume: 106.7495798241223, center: [26.19172415317879 46.91581538935487 19.802773691665923]
cid: 222, volume: 192.85792296769915, center: [39.31169145044862 73.75076624522151 19.824415865831973]
cid: 223, volume: 139.27833998289609, center: [48.677104518576584 21.11653360863767 17.9030845075913]
cid: 224, volume: 353.95863177160567, center: [29.342188256559574 30.088278824555974 21.635057808503767]
cid: 225, volume: 157.21440305140882, center: [51.11773039800033 55.50220604868222 20.24730334753105]
cid: 226, volume: 205.91705332719513, center: [52.65304365456663 25.69204951623647 19.68204643900916]
cid: 227, volume: 212.45138113654178, center: [50.61473691614868 30.27599454144996 20.836159375851867]
cid: 228, volume: 123.38068238260517, center: [62.04505362056943 24.890914194742532 19.656806562031964]
cid: 229, volume: 202.24030327703798, center: [26.6744545365943 63.67085906511398 20.31573076879239]
cid: 230, volume: 228.69194806793544, center: [30.075879715994926 51.4178285834687 21.17895575765338]
cid: 231, volume: 211.99416869507147, center: [41.261485239517775 15.727116811331776 21.18850576401869]
cid: 232, volume: 184.1327855429739, center: [45.41821284768347 25.267243642232682 20.409543532616006]
cid: 233, volume: 158.83369711494953, center: [45.98008193008605 69.87693293433283 20.871078405517242]
cid: 234, volume: 59.085182800841494, center: [58.19053599899863 48.465234763179105 18.642109103175883]
cid: 235, volume: 79.63116688941398, center: [28.979088247841965 23.42339399605263 20.14288264539474]
cid: 236, volume: 260.5348895645037, center: [46.29832147862531 17.820973860741447 22.924914202471484]
cid: 237, volume: 146.95569889591852, center: [62.245842546655986 29.355072844211822 21.146764486582835]
cid: 238, volume: 122.45673224046725, center: [22.043523565817495 59.601244148218726 20.563450694033914]
cid: 239, volume: 539.5297314533716, center: [34.84891928731008 32.91851777285407 24.113874761546203]
cid: 240, volume: 299.82658375335933, center: [39.80769348610794 31.006649955729582 23.20057179575563]
cid: 241, volume: 75.06856773390808, center: [49.45634737326544 52.482877888846595 19.932601442900648]
cid: 242, volume: 193.6866205178641, center: [15.53189235338658 38.7648335875627 20.56187461743877]
cid: 243, volume: 307.8659025158791, center: [42.611980497816475 27.21549439191238 14.708662051638255]
cid: 244, volume: 190.52423446436106, center: [43.83543045412502 65.57759917838216 22.255428389961004]
cid: 245, volume: 156.56668542599255, center: [45.11798977833045 29.81556338300785 22.34283986594269]
cid: 246, volume: 138.25913724878515, center: [58.269376441588335 44.563094088529105 20.667916286290044]
cid: 247, volume: 57.82784858679812, center: [20.466558028555347 9.517145376873662 25.42127426980728]
cid: 248, volume: 38.67255234103119, center: [24.347300198507487 38.106014603940885 19.67576029137931]
cid: 249, volume: 164.31072115339606, center: [24.546781625265393 55.88183268991305 22.435449520956524]
cid: 250, volume: 118.81808322709928, center: [39.352179383083566 64.0710653452381 20.689024984126984]
cid: 251, volume: 47.19765932261319, center: [44.51920659496945 11.643029004641777 19.12698906902119]
cid: 252, volume: 146.86044630394554, center: [56.775518092701574 36.11360811172007 21.888717818296797]
cid: 253, volume: 254.04818805114357, center: [18.30930862629501 19.821702391661354 24.61696363593416]
cid: 254, volume: 243.38942300936674, center: [34.12869194381344 50.508323789194584 24.085876853279586]
cid: 255, volume: 128.9243832354328, center: [36.62422323490145 51.88185968821574 22.255210733838197]
cid: 256, volume: 249.61894252439984, center: [51.87020256871513 19.059617852381134 22.849136165286577]
cid: 257, volume: 56.303807115230384, center: [61.92189614083018 34.69208960463543 19.804896405007614]
cid: 258, volume: 157.8525954176278, center: [25.79370424288934 51.64462443980811 22.537748837617666]
cid: 259, volume: 260.88732415480376, center: [35.53533797351951 60.319253585746104 22.427384290609368]
cid: 260, volume: 194.00095407137493, center: [48.74644455068277 41.795504302916484 22.35721907711003]
cid: 261, volume: 126.16205806821628, center: [21.396282306994692 65.34121645175539 21.741451862853907]
cid: 262, volume: 263.42104310128514, center: [38.141100555053825 11.42693739340083 23.48006297307901]
cid: 263, volume: 164.68220626209072, center: [44.85583706117672 21.263438001561685 23.563190390681935]
cid: 264, volume: 93.31896435593167, center: [54.1368334172634 43.33865659426355 22.01876594049199]
cid: 265, volume: 106.35904419703307, center: [18.889987681865303 61.515564669398174 22.63886094801182]
cid: 266, volume: 150.6133984276811, center: [22.12362247574323 45.729643954211994 23.516977727675183]
cid: 267, volume: 178.3033269142273, center: [24.007896382759643 12.75088962476628 23.715134690368075]
cid: 268, volume: 73.17304115364571, center: [24.52062051054243 69.01595475312419 21.349830314957043]
cid: 269, volume: 121.29465061839684, center: [32.35215692938289 73.49317207456416 21.895661313609235]
cid: 270, volume: 189.11449610316092, center: [46.71191754155567 49.933149747506796 22.931342185856753]
cid: 271, volume: 138.96400642938522, center: [50.245660210666195 61.9190975681678 22.866127103331277]
cid: 272, volume: 96.94808811010233, center: [52.45654234579936 40.05904946020829 21.82495965651405]
cid: 273, volume: 87.10849535929316, center: [59.485045069019876 15.391262694587205 22.07393039917988]
cid: 274, volume: 180.37030816004105, center: [11.032813244359385 39.714709900427756 23.243770047053232]
cid: 275, volume: 103.15855710674084, center: [21.178638518205283 25.397998229085875 24.094230627423823]
cid: 276, volume: 64.96226772557456, center: [31.07299976353401 59.81534287258064 22.03930745564516]
cid: 277, volume: 168.53993623699654, center: [38.49880592991909 46.721397110122076 23.494123355798575]
cid: 278, volume: 230.75892931374918, center: [44.256796576429494 60.75132407921242 24.19571884004788]
cid: 279, volume: 65.26707601988811, center: [54.12314824719622 56.124052253721544 21.688083448555165]
cid: 280, volume: 127.34319020868128, center: [55.5248421845979 24.560030429912484 23.12767480735283]
cid: 281, volume: 194.47721703123986, center: [56.45971706653988 30.94374943985404 23.897818539085076]
cid: 282, volume: 174.302718051362, center: [28.69762688977002 45.832006618858955 24.039013968468222]
cid: 283, volume: 190.64806283392593, center: [48.59354838970552 36.36856604059455 23.964389983812143]
cid: 284, volume: 101.57736407998932, center: [52.4348509714256 48.00683480696737 22.40457886637284]
cid: 285, volume: 266.05001463973946, center: [28.73673440074656 36.81171338881529 21.901676399967776]
cid: 286, volume: 109.76908698966588, center: [35.001489041786456 73.33983621932488 23.49133855670774]
cid: 287, volume: 206.91720554291146, center: [50.4824372252227 24.536581594254937 25.436535436265707]
cid: 288, volume: 186.1902415295903, center: [29.42993561833041 58.00052479431626 24.399222895610578]
cid: 289, volume: 76.99267009176235, center: [31.62441630386089 68.8580943809848 23.21678475250526]
cid: 290, volume: 212.74666417165804, center: [32.983501119472855 25.858114763532573 25.58043775728677]
cid: 291, volume: 338.5372371311797, center: [33.633911439355536 42.76315741922006 24.98277004317549]
cid: 292, volume: 147.91775007484566, center: [15.788147610137013 26.54714666211604 25.80642748270977]
cid: 293, volume: 224.17697520841602, center: [41.25213399722346 21.29035761625239 27.305884369216063]
cid: 294, volume: 202.0593233522893, center: [43.17080913319462 10.929641402842597 23.70849771064913]
cid: 295, volume: 79.0120250415896, center: [55.86958058872627 49.45011311229656 23.320696313924053]
cid: 296, volume: 139.6498250915907, center: [58.74319047321524 25.611324008901168 24.04465823296501]
cid: 297, volume: 55.103624456370795, center: [58.64069491541955 40.67618150224719 22.92730688426966]
cid: 298, volume: 88.48965794290142, center: [23.057423327560517 20.83181887346609 24.55678636759957]
cid: 299, volume: 142.25022085245317, center: [26.358248044251177 17.826750929590194 24.363560997589392]
cid: 300, volume: 132.8964163207062, center: [39.5325532537223 58.291295941728784 24.944435212370987]
cid: 301, volume: 115.83667709834491, center: [43.63159454710478 55.111154298536306 24.7069897304498]
cid: 302, volume: 209.47950026698473, center: [13.15716707304075 27.6829853396235 27.348562146689705]
cid: 303, volume: 214.55646341914473, center: [21.96178823921171 31.223893058690347 26.59044517192009]
cid: 304, volume: 31.87151727416019, center: [52.489636759429494 59.122787380902565 23.169953697848175]
cid: 305, volume: 239.5888445896447, center: [30.636421554749287 65.27242011565221 26.02953798077764]
cid: 306, volume: 108.42602544284681, center: [13.898061227484533 50.87196610423439 25.35416677295089]
cid: 307, volume: 188.77158677205816, center: [24.13235758246231 38.47983425 25.084440333333333]
cid: 308, volume: 139.61172405480153, center: [28.468484429029996 71.86786882199632 24.00823138892679]
cid: 309, volume: 114.31263562677718, center: [27.553029706095504 24.3282101700275 26.548266670944088]
cid: 310, volume: 166.8349148406801, center: [35.45298637169599 67.3739227451613 24.706285457693404]
cid: 311, volume: 89.23262816029069, center: [41.73791155323124 71.13331209735269 24.364749621423996]
cid: 312, volume: 271.54608919658057, center: [44.34996918653701 34.632859536305595 27.856227399782515]
cid: 313, volume: 75.40195180581352, center: [50.89695706253734 50.047362683299646 24.833759258906014]
cid: 314, volume: 176.96979062660554, center: [15.594820510422167 41.57384995737122 25.43097231261101]
cid: 315, volume: 151.7183284945677, center: [20.16535393077751 55.34466424930939 24.705404390883977]
cid: 316, volume: 144.51723254141015, center: [20.87534600884473 35.24031352240971 24.232249089408118]
cid: 317, volume: 106.66385249134662, center: [34.02666077298766 18.10707682367387 25.02234372200393]
cid: 318, volume: 186.00926160484164, center: [44.719080210294635 6.876767264517616 27.630012949252357]
cid: 319, volume: 67.13402682255858, center: [48.40417399084941 65.17021032250284 23.768408854639613]
cid: 320, volume: 59.037556504855004, center: [61.49138830260579 34.6224853874637 23.50736013818974]
cid: 321, volume: 117.50359745787212, center: [14.756160652179796 20.365206103599224 24.680894095695525]
cid: 322, volume: 187.67618196436885, center: [25.59932502618938 30.64089054577983 26.624571795792516]
cid: 323, volume: 112.15992704818775, center: [26.68415736615844 64.95825412509555 24.604871137070063]
cid: 324, volume: 197.0299864961158, center: [48.38505378078505 55.731933451849166 25.82682869782451]
cid: 325, volume: 137.5447428089878, center: [53.48976244341024 6.698763519806094 25.252477938261773]
cid: 326, volume: 262.69712340229046, center: [56.056308245740915 17.425127763243772 26.699989908408572]
cid: 327, volume: 103.01567821878136, center: [60.5565709136687 19.151226764771152 24.70959793065187]
cid: 328, volume: 208.13643872016564, center: [12.5440651989175 46.34159003770994 27.039057342341312]
cid: 329, volume: 234.33090151273603, center: [39.87115419842031 39.249280407198896 23.865046231535302]
cid: 330, volume: 88.32772853654735, center: [59.99776416671619 36.44209499466192 25.586193854092528]
cid: 331, volume: 183.12310806806025, center: [34.13427563497263 10.848113426996099 26.83166536579974]
cid: 332, volume: 284.9100278503901, center: [13.39131388482502 34.85399084047675 27.797306202584334]
cid: 333, volume: 165.74903529218813, center: [15.983113883761899 55.64230240937302 26.154814611200507]
cid: 334, volume: 242.36069501605854, center: [18.8690513519389 36.68303712556988 28.381312897166325]
cid: 335, volume: 154.76641143770314, center: [29.610028449589244 27.06866975378508 28.185044112906205]
cid: 336, volume: 228.01565466492727, center: [48.841364173266136 8.593169617198596 24.84702509309466]
cid: 337, volume: 151.6040253842001, center: [11.053874495441061 18.004901928656697 25.519061010806737]
cid: 338, volume: 302.41745425502444, center: [30.810641479930265 22.200697788717754 30.39686081134839]
cid: 339, volume: 133.68701283408197, center: [43.248936090363344 51.40450568956181 26.904327625757034]
cid: 340, volume: 259.19182801768466, center: [42.11523667498429 43.46286889741281 27.378123217412075]
cid: 341, volume: 150.90868146279732, center: [46.58189259060237 44.64673251694755 27.602432135391023]
cid: 342, volume: 141.9358872989423, center: [49.899012757957195 28.953044990034225 27.110784382323335]
cid: 343, volume: 116.446293686972, center: [51.104025133387175 46.06407407705521 26.969058628343557]
cid: 344, volume: 154.03296647951117, center: [53.19200302034015 35.35492534617525 26.97426200943046]
cid: 345, volume: 64.09546913862042, center: [53.68873590687766 53.19292126036558 25.51411897235845]
cid: 346, volume: 159.51951577715502, center: [23.499734309986597 61.085209339851914 26.665111308055177]
cid: 347, volume: 78.60243889610577, center: [38.34273953100262 65.14099188439167 25.652581788293748]
cid: 348, volume: 184.43759383728744, center: [24.25108518724552 24.36041147324795 23.664663513840832]
cid: 349, volume: 189.819365283761, center: [37.513311787162785 3.8704645326425133 34.14660411145122]
cid: 350, volume: 112.88384674718243, center: [57.24634097389786 39.900282224664586 26.566662927390094]
cid: 351, volume: 75.51625491618111, center: [16.082447314695727 33.07053674243189 26.901394530461655]
cid: 352, volume: 178.4271552837922, center: [23.701324892013883 67.40921792849134 27.837947171444586]
cid: 353, volume: 201.154423728546, center: [38.90717437106428 54.7735794771522 28.462485598636235]
cid: 354, volume: 423.702579614224, center: [36.91199504749332 22.179569371532303 22.99740615370262]
cid: 355, volume: 259.79191934711446, center: [45.36705643791972 13.770449450905623 28.991647190419446]
cid: 356, volume: 107.99738877896839, center: [46.47002471994382 30.749396922076205 27.684965696110424]
cid: 357, volume: 102.21555644620831, center: [55.49214968256558 44.723143259714845 27.148045702124687]
cid: 358, volume: 166.9968442470342, center: [61.86767009647742 23.643175437371664 27.668303797484597]
cid: 359, volume: 222.0623676666158, center: [28.553662899016345 17.609607512675332 32.18025716838245]
cid: 360, volume: 166.72061173031256, center: [29.037004150802648 53.073434420585045 28.564260212534993]
cid: 361, volume: 179.5130348322842, center: [34.918744056359756 57.61557913586437 28.160743198662846]
cid: 362, volume: 87.22279846966075, center: [48.81608673200056 4.135934935786829 27.842909932510647]
cid: 363, volume: 22.66059163037271, center: [54.163200002647805 41.85621162295082 30.91005157377049]
cid: 364, volume: 178.70338780051384, center: [20.963666081342595 43.04914662568626 28.449319018842278]
cid: 365, volume: 169.8925230430129, center: [22.32842899800237 49.82056697886298 28.524198827623906]
cid: 366, volume: 202.15457594426232, center: [26.254496705681014 55.18862691363143 29.53971337897564]
cid: 367, volume: 125.80009821871896, center: [37.726978568403716 71.83583345358522 27.34444083516317]
cid: 368, volume: 198.75405841082681, center: [41.90365915057306 27.11813820864085 28.613593936643344]
cid: 369, volume: 94.68107642114533, center: [51.676673247881276 57.50838413239437 27.16488101001006]
cid: 370, volume: 137.5447428089878, center: [9.855771357866145 24.288930049238225 27.598373186634348]
cid: 371, volume: 77.2974783860759, center: [18.29755955111287 45.624478609242146 27.279866318484288]
cid: 372, volume: 97.01476492448342, center: [20.201811858424982 63.56289259749632 27.571793797201767]
cid: 373, volume: 109.71193543448209, center: [18.767025499377517 13.80520724322799 27.5899720479684]
cid: 374, volume: 179.69401475703287, center: [26.74141262331289 46.374733414285714 28.372013102623907]
cid: 375, volume: 145.35545535077242, center: [61.48595490549569 29.523208904292265 27.292940079947574]
cid: 376, volume: 186.64745397106063, center: [16.90457198147851 48.73754325968359 28.58996951513141]
cid: 377, volume: 348.5578098067375, center: [29.312437578943918 37.793870965075286 28.367330064698166]
cid: 378, volume: 87.91814239106353, center: [46.08239392748937 65.98633146971831 27.59304567676056]
cid: 379, volume: 137.77334902972294, center: [31.166147955744727 7.140792214774613 29.02940761030835]
cid: 380, volume: 481.2541956843005, center: [39.720366855109646 15.659850920354682 31.842676916980047]
cid: 381, volume: 222.46242855290234, center: [40.416846872339086 34.948705699421964 29.434995212524086]
cid: 382, volume: 120.54215514181028, center: [41.03278559677761 63.5002205451205 28.678954706953775]
cid: 383, volume: 83.58414945629278, center: [55.62592659409234 22.777453746666666 27.75792756]
cid: 384, volume: 55.01789712359511, center: [20.950360581229635 6.577075018265235 29.499873573926592]
cid: 385, volume: 110.82639076056599, center: [35.8860440980053 6.539432555865922 27.950956602234637]
cid: 386, volume: 41.01576610356658, center: [44.23956063591116 68.90557246992569 27.423053178588017]
cid: 387, volume: 137.94480369527432, center: [15.69795531134633 11.015862281418313 30.2982158981149]
cid: 388, volume: 156.59526120358444, center: [31.555873218839444 48.622650510218975 29.589817308667882]
cid: 389, volume: 197.18239064327258, center: [40.67094140174254 7.597181858340176 29.626523365465438]
cid: 390, volume: 321.72515464794816, center: [51.9608562092114 12.578843132357294 30.028292401927402]
cid: 391, volume: 102.76802147965161, center: [53.4931458304139 31.881879159328943 29.684535831124293]
cid: 392, volume: 213.92779631212304, center: [55.07034986313152 27.30059096313282 30.541362231354913]
cid: 393, volume: 249.9904276330945, center: [13.72890503555009 21.682708618536864 30.276819808954084]
cid: 394, volume: 239.08400585218791, center: [23.739813828678034 15.556513154880479 29.982033578366533]
cid: 395, volume: 284.1099060778171, center: [47.01533662788093 25.612838536074698 31.06580217613236]
cid: 396, volume: 50.88393463196764, center: [54.67890292444694 48.31173232749906 28.082001505990267]
cid: 397, volume: 110.1310468391632, center: [58.608004737091335 23.608054946419305 30.151968573689672]
cid: 398, volume: 99.71041327731885, center: [9.651262455886938 35.2669086312094 29.400359552350018]
cid: 399, volume: 107.27346907997371, center: [18.094521916841078 59.468284551145445 29.835322679808204]
cid: 400, volume: 125.04760274213238, center: [24.930960924626895 20.439508587408593 29.941226018281533]
cid: 401, volume: 149.80375139591072, center: [33.00866643092024 71.55006495285178 29.034928880746484]
cid: 402, volume: 125.21905740768375, center: [35.655095932084585 24.285654608968507 31.041259956298497]
cid: 403, volume: 116.4177179093801, center: [40.081190724917896 68.95327098453608 29.660653534609718]
cid: 404, volume: 213.81349320175545, center: [39.77720959035046 46.93473534859892 30.247194174277187]
cid: 405, volume: 139.06878428055552, center: [43.62104511141156 4.272054048493151 32.552122073116436]
cid: 406, volume: 88.28010224056085, center: [49.27985224600249 50.346535781128615 29.385254613185154]
cid: 407, volume: 187.35232315166073, center: [22.329309553912 57.818530356245866 30.346327781559815]
cid: 408, volume: 161.17691087748491, center: [26.713261751389304 62.15006364833638 30.946314425595418]
cid: 409, volume: 119.23719463178041, center: [27.810339838065243 69.59604435500879 29.48509443321617]
cid: 410, volume: 232.47347596926286, center: [34.919831254705656 47.12766813334836 30.855444452778006]
cid: 411, volume: 117.22736494115046, center: [48.141092897337195 61.73048734224425 29.61796812297879]
cid: 412, volume: 108.66415692277927, center: [57.203200073284954 34.397396687982116 30.859897585597825]
cid: 413, volume: 128.4100192387787, center: [10.742514547007989 40.620223926711674 29.499067518804242]
cid: 414, volume: 224.3293793555728, center: [36.3334638862799 63.38800181854274 30.288941966370853]
cid: 415, volume: 136.8874999243742, center: [45.612667106309864 47.35754739631898 30.70449091402825]
cid: 416, volume: 86.07976736598495, center: [58.773863051077484 31.608568186123716 29.592689756833018]
cid: 417, volume: 235.00719491574424, center: [20.480337110827435 11.652323118859435 31.79011368294017]
cid: 418, volume: 381.08656996551133, center: [35.721190998381985 20.576876881448708 33.46755792404019]
cid: 419, volume: 161.3959918390228, center: [45.14505329040881 19.47617020246105 31.89791556134915]
cid: 420, volume: 105.04455842780591, center: [46.621518636165106 56.78696183038629 29.94520031923286]
cid: 421, volume: 181.1132783774303, center: [49.849418949462795 35.5087373401704 30.114352141921742]
cid: 422, volume: 119.47532611171286, center: [19.08831186411838 53.46217880112413 30.498678549629275]
cid: 423, volume: 201.86881816834335, center: [20.784068036778553 20.75830571733591 26.877142595691975]
cid: 424, volume: 184.0280076918036, center: [31.066601047888433 57.01794577849379 31.11359717748447]
cid: 425, volume: 213.10862402115538, center: [45.27859430321167 37.57357877919814 33.203200222835555]
cid: 426, volume: 298.0263097650699, center: [16.89694899511842 17.36362349669202 33.11204726741882]
cid: 427, volume: 203.54526378706785, center: [42.322285688485664 59.89004182991717 31.354122502878]
cid: 428, volume: 193.1627312620127, center: [49.51686050375116 41.68470541750086 31.57583067343064]
cid: 429, volume: 82.50779516699808, center: [52.79795455971581 51.40343092900023 29.977896063033942]
cid: 430, volume: 110.14057209836051, center: [55.040735850482235 39.1052914819251 31.549926928305805]
cid: 431, volume: 226.0058249742973, center: [29.211187353358664 11.352408703059805 29.018144349095966]
cid: 432, volume: 196.19176368675355, center: [9.611722538272593 28.337939843350973 32.32432367980774]
cid: 433, volume: 254.68638041736256, center: [22.246350983303852 27.313822616351263 33.9648678378338]
cid: 434, volume: 113.94115051808254, center: [23.49244394951978 47.44156264842835 32.076122206487206]
cid: 435, volume: 268.4884809942478, center: [23.78627546424997 36.79925846168447 33.51263653489197]
cid: 436, volume: 181.33235933896816, center: [26.67435501458423 23.594566605662656 33.0911533871671]
cid: 437, volume: 276.92786064305415, center: [27.308734485290227 31.701117994324633 33.394300404653805]
cid: 438, volume: 280.33790343568694, center: [30.070893371535924 40.311428933590435 33.384613653358706]
cid: 439, volume: 319.6295976245425, center: [34.819415797261826 14.585550768372274 35.25924161291572]
cid: 440, volume: 278.67098307615976, center: [36.721721934865826 39.59661582326702 32.1626891692986]
cid: 441, volume: 180.57986386238161, center: [15.416094031090239 42.24963969983648 31.871344780092834]
cid: 442, volume: 336.50835692215514, center: [37.5933976926815 30.250080041907268 33.857498127335255]
cid: 443, volume: 111.03594646290655, center: [12.620299910988264 16.15738359213348 32.44726403851763]
cid: 444, volume: 196.17271316835897, center: [31.26222379883096 63.10075778040786 32.35721979657684]
cid: 445, volume: 251.5525701414514, center: [31.916434125822637 31.883969187549702 33.2697555385096]
cid: 446, volume: 288.1581412366689, center: [18.066916419711873 25.372796611909955 34.9070366400238]
cid: 447, volume: 151.30874234908387, center: [17.893792758397257 31.362467194334275 33.14307467535411]
cid: 448, volume: 63.11436744129869, center: [26.021282938383518 67.31311986605796 32.14000674969816]
cid: 449, volume: 122.29480283411317, center: [43.80397378995038 65.39135461336552 32.39930824180232]
cid: 450, volume: 271.0317251999265, center: [47.767284554922306 10.501916765990723 33.98033992846348]
cid: 451, volume: 144.3172020982669, center: [48.17630357221521 52.236451217741404 33.48931385888721]
cid: 452, volume: 163.89160974871496, center: [48.27094093993557 17.753926389631523 33.25361142987911]
cid: 453, volume: 71.09653464863469, center: [10.30395437761408 20.208739279943728 31.911285095860126]
cid: 454, volume: 114.05545362845012, center: [32.43699404495277 68.76280291598464 32.27379009420411]
cid: 455, volume: 275.518122281854, center: [37.310949785135044 9.15947581752809 35.712179253707866]
cid: 456, volume: 102.2536574829975, center: [44.01356611989778 53.40776019459711 32.03189201401956]
cid: 457, volume: 84.92721100311185, center: [50.03975696334411 45.88554921248318 32.887787253028264]
cid: 458, volume: 117.49407219867481, center: [14.541422630559465 51.768847508512366 32.67660858909606]
cid: 459, volume: 144.60295987418584, center: [23.605461470015705 42.10991469017193 32.644744572426056]
cid: 460, volume: 272.6319687450726, center: [37.78288818958094 51.815598604727136 34.47407616986933]
cid: 461, volume: 91.58536718202338, center: [51.12483581416336 55.354183283775356 32.581907771606865]
cid: 462, volume: 86.00356529240656, center: [17.08734325818177 56.924537614409125 33.240316851367815]
cid: 463, volume: 80.46938969877623, center: [53.488149402814535 45.28325694140625 32.62665123046875]
cid: 464, volume: 105.36841724051405, center: [22.70428805892075 31.535689148933287 34.24564583013922]
cid: 465, volume: 174.89328412159452, center: [33.30478881984036 52.96320438015359 34.3952802358804]
cid: 466, volume: 97.91013928902946, center: [37.35366281531813 67.349892514982 33.75121321514739]
cid: 467, volume: 110.86449179735519, center: [41.624539847745105 52.785109336197266 33.47730705099235]
cid: 468, volume: 193.0484281516451, center: [15.2244462144277 37.620572536241184 34.74441589993585]
cid: 469, volume: 324.7351365542944, center: [33.34090704408557 8.707897455913411 37.86731364466737]
cid: 470, volume: 92.0140038459018, center: [57.7260162425217 13.871632863819876 32.972500275]
cid: 471, volume: 228.23473562646512, center: [14.382062786064568 31.489201228433707 36.609223145048205]
cid: 472, volume: 115.06513110336374, center: [19.196548843807175 50.081829781663906 34.06014076105132]
cid: 473, volume: 114.179281998015, center: [21.79714147058239 63.251007916868275 33.44953831409027]
cid: 474, volume: 216.09003014990975, center: [41.25423496806069 23.408663549325574 34.3987137845808]
cid: 475, volume: 121.77091357826176, center: [48.52166966184134 4.893984616708385 33.9039780889393]
cid: 476, volume: 130.31507107823836, center: [56.15538008416416 20.089725649185002 33.790874454206566]
cid: 477, volume: 72.48722249144024, center: [60.78686037681577 25.809862706373192 33.43536924717477]
cid: 478, volume: 233.69270914651705, center: [28.87945834295702 44.600918168745416 35.85098205190756]
cid: 479, volume: 147.1462040798645, center: [41.26561052519667 36.12535648164811 34.581496800038835]
cid: 480, volume: 183.74224991588466, center: [51.33328977603994 28.73866089517885 34.469720766485224]
cid: 481, volume: 132.20107239930343, center: [53.39568588241748 15.155008967324736 34.84405643461344]
cid: 482, volume: 124.04745052641606, center: [11.187076766756661 41.3706598666206 34.71159349274361]
cid: 483, volume: 179.79879260820314, center: [44.15251703889405 47.68214553409091 36.157403011363634]
cid: 484, volume: 100.26287831076215, center: [13.1708070677974 46.64769397173666 34.51165218383051]
cid: 485, volume: 173.02633331892403, center: [18.435869661548836 45.24940422361684 35.99455105441783]
cid: 486, volume: 177.63655877041643, center: [23.647400832106367 54.50770117773071 36.29474407271167]
cid: 487, volume: 138.33533932236355, center: [33.90037811175182 35.13627884166495 36.29612411898368]
cid: 488, volume: 197.49672419678342, center: [42.69232351687995 29.520892815930356 36.15053856185492]
cid: 489, volume: 90.61379074389895, center: [52.04173573857512 50.064739011352884 34.87111712961211]
cid: 490, volume: 92.33786265860995, center: [20.910347351865326 54.672666436197645 35.364574131266764]
cid: 491, volume: 251.33348917991356, center: [31.57761845130723 17.1001410459903 32.12580080826954]
cid: 492, volume: 217.5950211030829, center: [42.03941949691193 41.67489813279198 36.16350060659254]
cid: 493, volume: 133.95372009160633, center: [46.83829791941799 31.61227162763991 36.287297617613596]
cid: 494, volume: 202.26887905462988, center: [55.76894402269168 11.284659369366612 37.461795389215915]
cid: 495, volume: 144.55533357819934, center: [19.226845335368765 9.637989024117026 36.72364199683711]
cid: 496, volume: 118.91333581907226, center: [25.568127899647333 49.43482560929991 35.83427398702339]
cid: 497, volume: 256.3723512952844, center: [32.84831252124334 26.48855778848226 38.37029518606725]
cid: 498, volume: 256.83908899595195, center: [42.840739995317634 9.660813187583443 37.158825212950596]
cid: 499, volume: 53.74151239115714, center: [46.07115944059833 61.414950763824876 34.67352789746544]
cid: 500, volume: 158.4717372654522, center: [50.84313128767042 34.96688182064074 35.73202811378253]
cid: 501, volume: 65.81001579413412, center: [56.442494179847785 25.36425188363005 35.129409556231]
cid: 502, volume: 165.33944914670428, center: [10.26861614289391 34.76275317205323 35.447355390684415]
cid: 503, volume: 134.69669030899558, center: [19.77448855718455 34.54069061774273 36.287048685489005]
cid: 504, volume: 154.9759671400437, center: [21.297802133134844 19.297441109649665 36.3984072159496]
cid: 505, volume: 147.2033556350483, center: [26.80529894451386 58.796524962016306 36.024698484405334]
cid: 506, volume: 113.81732214851766, center: [30.160418612642452 66.92169462314838 36.14318903740899]
cid: 507, volume: 62.152316262371556, center: [37.863357211176314 59.96902527379311 35.00421170551724]
cid: 508, volume: 82.13631005830344, center: [45.87781666140531 56.281837372666125 35.30761979032819]
cid: 509, volume: 69.43913954830478, center: [48.183457379312266 59.17627977283951 35.03174780925926]
cid: 510, volume: 64.42885321052586, center: [55.09288738912161 34.63430601914548 34.843551117977526]
cid: 511, volume: 122.49483327725643, center: [59.89155904991922 18.576064166290823 31.311335832270608]
cid: 512, volume: 144.2505252838858, center: [35.38946734921186 59.51755537767433 36.47133722573297]
cid: 513, volume: 194.06763088575605, center: [36.25450671341538 42.5059586886473 35.83246272504172]
cid: 514, volume: 132.85831528391702, center: [45.32394462958169 42.26648653746057 37.571895908517355]
cid: 515, volume: 95.60502656328327, center: [58.54117330371704 28.607763295755703 35.610557190893694]
cid: 516, volume: 132.08676928893584, center: [18.910573260692377 40.507806329811785 36.880491960337494]
cid: 517, volume: 150.07998391263237, center: [22.764554286066623 23.159274738861384 37.51107953836634]
cid: 518, volume: 113.0553014127338, center: [40.97493008562568 64.16465503012049 35.80658934939759]
cid: 519, volume: 80.48844021717083, center: [41.09256716950566 4.468875154615385 36.835122059999996]
cid: 520, volume: 98.66263476561603, center: [50.22946950144931 38.55740005652636 35.55395214954624]
cid: 521, volume: 197.2300169392591, center: [52.955055494802224 6.882337201608229 31.89232427347146]
cid: 522, volume: 92.77602458168566, center: [53.88162890663783 40.816475413706364 37.30087344409651]
cid: 523, volume: 154.08059277549768, center: [13.940763303954506 24.525061378431012 36.115663478022995]
cid: 524, volume: 124.79042074380533, center: [28.142780336079962 51.92424713350126 36.36527704911838]
cid: 525, volume: 110.66446135421192, center: [30.428038441204425 60.20062398816492 36.771267985238424]
cid: 526, volume: 156.709564313952, center: [35.745926789172835 65.07444468845733 37.22154635010941]
cid: 527, volume: 197.86820930547808, center: [25.399902614796286 19.104551840995523 38.327953327348]
cid: 528, volume: 127.25746287590559, center: [40.26054895705153 57.38122089229042 37.66139675737275]
cid: 529, volume: 68.50566414696954, center: [43.53618621631915 57.068337064655175 36.8437964121941]
cid: 530, volume: 206.1456595479303, center: [48.74108875566858 21.74483378832825 37.950321306279456]
cid: 531, volume: 99.56753438935937, center: [55.873964539178154 30.817332212666223 37.40998860456328]
cid: 532, volume: 99.63421120374046, center: [14.413104946341244 13.835446618164436 36.44343356300192]
cid: 533, volume: 119.13241678061013, center: [17.492205399601396 53.91048097757256 38.0492222414248]
cid: 534, volume: 74.86853729076482, center: [19.47725912576557 58.37502693377863 37.395446720038166]
cid: 535, volume: 125.28573422206485, center: [24.598228728206305 42.54447896213791 37.03911512905801]
cid: 536, volume: 58.923253394487425, center: [26.96346619898952 65.07408573593598 36.144507144762365]
cid: 537, volume: 286.1102105092497, center: [29.368892941009264 16.230901972966674 39.49379318760196]
cid: 538, volume: 250.90485251603513, center: [30.937094575412637 13.264481599104059 41.92971995423485]
cid: 539, volume: 264.6688520561312, center: [51.972778381543506 20.46250735510689 32.05818770486936]
cid: 540, volume: 150.66102472366757, center: [32.10867336090406 45.58918492688247 37.88253571966871]
cid: 541, volume: 193.46753955632624, center: [45.025735684412254 17.414896503766432 39.13368201718281]
cid: 542, volume: 176.664982332292, center: [48.45674154534299 47.07493069030032 38.405693138998224]
cid: 543, volume: 107.99738877896839, center: [59.39033246357991 21.57472478792556 37.53805357951138]
cid: 544, volume: 83.62225049308198, center: [24.019850596877482 62.18715142054904 37.42407018145575]
cid: 545, volume: 154.31872425543014, center: [10.965763657152609 20.937387433954694 37.885051075766924]
cid: 546, volume: 81.51716821047904, center: [14.901386357192367 47.783876911311054 37.94342265231362]
cid: 547, volume: 160.10055658819022, center: [23.38357973769268 13.064064293520941 38.16212055431937]
cid: 548, volume: 177.9032660279408, center: [53.278968255591096 25.79344488523317 39.266720019623065]
cid: 549, volume: 298.95025990720785, center: [28.06263610885105 26.24968605618926 40.5721957529393]
cid: 550, volume: 207.49824635394666, center: [43.49252410124505 24.77880995209787 39.541736452648735]
cid: 551, volume: 166.9396926918504, center: [21.267908687872502 48.502765922115714 39.15373212863745]
cid: 552, volume: 241.9511088705747, center: [25.03232035703031 6.214154529113027 37.347499005905284]
cid: 553, volume: 187.12371693092555, center: [32.57129825637964 56.56406053629422 40.61805798080937]
cid: 554, volume: 82.57447198137916, center: [48.74214018680105 56.3302594756604 39.06042053068405]
cid: 555, volume: 73.10636433926463, center: [21.745573538755707 59.70158556390879 38.591864031986965]
cid: 556, volume: 103.9396283609193, center: [34.51764977838067 50.88674053125 38.593525586189514]
cid: 557, volume: 162.76762916343375, center: [37.5518353658876 26.230581496400983 40.03921157944171]
cid: 558, volume: 236.65506475687684, center: [38.496611039441504 34.74759722439122 39.77688873713021]
cid: 559, volume: 123.80931904648361, center: [49.664933179245715 43.28365831735651 38.93501918595169]
cid: 560, volume: 40.39662425574219, center: [53.14129544842338 44.92655123874086 37.06952927988682]
cid: 561, volume: 235.8263672067119, center: [9.924299026881576 28.227943896114386 39.59383025026254]
cid: 562, volume: 97.129068034851, center: [17.11408958796819 35.38731760679612 39.598257791262135]
cid: 563, volume: 152.2422177504191, center: [24.973552091299823 30.215668961459052 39.444273693737095]
cid: 564, volume: 112.86479622878782, center: [46.36298990769843 52.269348631445695 39.236970755633386]
cid: 565, volume: 111.19787586926063, center: [45.778140804437264 5.4582240517817375 38.96602985244989]
cid: 566, volume: 121.07556965685899, center: [58.41227844259446 18.107171249468966 40.22245036547085]
cid: 567, volume: 86.23217151314172, center: [16.79521511258942 50.473724938031594 39.20176787424058]
cid: 568, volume: 168.1112995731181, center: [30.12916381511102 50.58005575191229 40.81957995945946]
cid: 569, volume: 121.08509491605628, center: [44.782850903048775 60.15123934337634 39.54876632013058]
cid: 570, volume: 274.2607880678106, center: [18.498676604109384 16.790415859323446 41.111135252161986]
cid: 571, volume: 140.55472471533406, center: [26.177775598004626 10.88136416210355 40.036268602229605]
cid: 572, volume: 140.840482491253, center: [36.50549974001894 44.053240332916275 39.46435614026782]
cid: 573, volume: 245.48498003277237, center: [39.5933425045219 46.81328007201614 42.26536319792798]
cid: 574, volume: 119.07526522542634, center: [42.19522998949952 51.43394926421886 38.85906337796976]
cid: 575, volume: 186.1616657519984, center: [52.183952709091265 13.11292994238641 40.85096040096705]
cid: 576, volume: 64.42885321052586, center: [54.663250612768856 35.7354177631579 38.731990532599056]
cid: 577, volume: 115.43661621205838, center: [13.449220377262725 42.2880998199934 39.130152322798914]
cid: 578, volume: 63.84781239949066, center: [20.1220065491244 43.232196562807694 39.68310532328808]
cid: 579, volume: 127.2479376167083, center: [26.298394555255573 40.645644691893104 40.33869625162812]
cid: 580, volume: 158.5193635614387, center: [46.952208932440655 28.13008404981372 40.46786983857108]
cid: 581, volume: 146.0603245313725, center: [52.55232442983466 8.295343518292682 41.541957765064566]
cid: 582, volume: 132.40110284244668, center: [55.43766658256967 19.550444881079137 38.31813187154677]
cid: 583, volume: 139.01163272537173, center: [34.465351551081675 30.248167297416746 41.5232502104632]
cid: 584, volume: 130.18171744947617, center: [24.891499832330133 36.02582571270213 40.23861539635618]
cid: 585, volume: 113.88399896289874, center: [51.109929093902686 30.489832491217797 39.099565284208765]
cid: 586, volume: 98.7769378759836, center: [49.85102153435332 52.74213725742527 40.50376036967213]
cid: 587, volume: 125.63816881236488, center: [26.64107198328187 47.2409392615997 40.55288237433662]
cid: 588, volume: 134.45855882906312, center: [28.311211910062582 55.99818992001984 41.289956541902804]
cid: 589, volume: 106.64480197295202, center: [38.151450075289546 57.124387255627006 40.686485872186495]
cid: 590, volume: 80.24078347804107, center: [38.40820863144647 20.319174180555553 40.49416578472222]
cid: 591, volume: 185.99973634564435, center: [44.14212806100425 32.2531140850361 42.194603057458906]
cid: 592, volume: 86.59413136263906, center: [49.48705202671416 7.0689586313386865 39.81001934160159]
cid: 593, volume: 62.19041729916075, center: [50.62208148843117 16.389939283504365 40.02740499410323]
cid: 594, volume: 264.0020839123203, center: [31.213835715906296 35.039897964118204 41.86368526618199]
cid: 595, volume: 151.0420350915595, center: [33.918043060603985 38.48619022665069 41.85069659841079]
cid: 596, volume: 196.96330968173473, center: [41.09288244495188 20.980825398950575 42.28099481494825]
cid: 597, volume: 123.87599586086469, center: [13.892296120326375 26.40667772698962 40.152523038408305]
cid: 598, volume: 78.61196415530306, center: [28.15875381683797 63.363968372955284 40.221564308615044]
cid: 599, volume: 79.52638903824369, center: [32.33742408669421 63.62247303557312 40.25969691699605]
cid: 600, volume: 142.0120893725207, center: [47.69417539418284 11.860609197565228 40.37448269736401]
cid: 601, volume: 148.3082857019349, center: [12.455363996421589 36.08946972514451 40.787626483237]
cid: 602, volume: 210.55585455627943, center: [13.517598581918799 16.842380345238634 41.68578531802759]
cid: 603, volume: 212.81334098603912, center: [40.67050864555922 10.329887236505236 43.016229468087005]
cid: 604, volume: 196.26796576033195, center: [45.00317023804671 37.519163565615145 41.67503984384858]
cid: 605, volume: 62.676205518222964, center: [52.15688350034372 48.254437081914894 39.83912069566869]
cid: 606, volume: 103.25380969871382, center: [35.11656201015992 56.88527426817343 42.184731307749075]
cid: 607, volume: 75.81153795129735, center: [40.256908483533834 62.43914611402186 40.32220271127026]
cid: 608, volume: 124.15222837758634, center: [49.877358712771404 39.65943751427037 40.91369677340034]
cid: 609, volume: 100.94869697296762, center: [57.300162288482056 25.565063389554634 40.83043093479902]
cid: 610, volume: 151.0801361283487, center: [18.590578145123228 30.150230272555323 42.6345042579913]
cid: 611, volume: 149.3941652504269, center: [20.558115249896677 39.74453989900535 42.11383419548585]
cid: 612, volume: 68.90572503325606, center: [40.94756653862713 42.69752303041194 40.491046660284766]
cid: 613, volume: 151.0229845731649, center: [53.655975421031364 20.559776823746454 42.110476354966885]
cid: 614, volume: 146.75566845277527, center: [27.10813515031741 33.334924976374374 43.59136511741416]
cid: 615, volume: 124.57133978226747, center: [43.94744560255607 53.868457910039766 42.51959615755467]
cid: 616, volume: 96.5289767054212, center: [51.81622224698027 36.876315306838364 42.04257104751332]
cid: 617, volume: 91.67109451479907, center: [18.421725700018154 23.316851872350373 41.92116187967581]
cid: 618, volume: 188.36200062657434, center: [36.09950367593059 48.71073444007585 43.211176804171934]
cid: 619, volume: 230.5969999073951, center: [15.666823542371764 22.464181074765584 44.47242194543352]
cid: 620, volume: 160.7101731768173, center: [20.587993258992626 33.436397228129444 43.60094698266359]
cid: 621, volume: 165.3584996650989, center: [26.445601515754316 52.93148408605991 43.97294564351959]
cid: 622, volume: 225.52003675523508, center: [22.735708956342098 26.315025413963507 44.15607835187532]
cid: 623, volume: 105.94945805154924, center: [23.251825667954726 50.23307877443136 42.78802635246786]
cid: 624, volume: 128.9053327170382, center: [15.593591439280507 41.36618501152738 42.94583286311239]
cid: 625, volume: 108.36887388766301, center: [21.130219473908525 55.28460033870967 42.465000919354836]
cid: 626, volume: 90.23278037600701, center: [22.083672869833794 45.06371672701362 42.922530153436085]
cid: 627, volume: 103.10140555155705, center: [25.09763386861252 59.35520371189025 42.140853882621954]
cid: 628, volume: 51.531652257383925, center: [34.13631133869913 62.56128564981516 42.31063813475046]
cid: 629, volume: 149.71802406313503, center: [49.70388218591 34.38370611789031 44.393997767654916]
cid: 630, volume: 145.87934460662382, center: [50.14280732978944 24.224972592164544 43.74870645661117]
cid: 631, volume: 186.08546367842004, center: [34.88704309722233 20.38419017989865 43.378109300675675]
cid: 632, volume: 209.79383382049556, center: [36.94224463209111 7.862353149534619 45.52180375729853]
cid: 633, volume: 92.00447858670451, center: [42.938997786170006 59.25044317833109 43.283141037012115]
cid: 634, volume: 70.80125161351843, center: [52.63357145062132 44.101949061818914 43.10334146932598]
cid: 635, volume: 183.38029006638732, center: [38.57463316039455 38.825384918346145 44.04359975301267]
cid: 636, volume: 142.65980699793698, center: [45.461573973730424 22.539746762435733 43.640399118247984]
cid: 637, volume: 65.61951061018814, center: [55.12460784386022 33.53741588343736 42.25208819364204]
cid: 638, volume: 114.96987851139076, center: [16.499829196798043 28.34017045724938 44.6015930995029]
cid: 639, volume: 90.90907377901519, center: [17.420108913568153 47.02620657287301 43.09927890559514]
cid: 640, volume: 120.4183267722454, center: [29.55868148171403 60.61843186544851 43.725590037494065]
cid: 641, volume: 159.1194548908685, center: [30.524551808394413 22.83857036614786 44.96326090038911]
cid: 642, volume: 95.70027915525625, center: [40.155745196404034 54.21520792654524 43.63893091549716]
cid: 643, volume: 114.2364335531988, center: [46.294097207444885 47.67198913707997 43.48067478683399]
cid: 644, volume: 95.82410752482113, center: [36.562646350074196 61.547708332306165 44.185016365407556]
cid: 645, volume: 122.88536890434567, center: [52.7532935710432 30.97117745027517 43.99011849562049]
cid: 646, volume: 141.37389700630172, center: [22.430143111672983 15.155135182589946 44.18314465082199]
cid: 647, volume: 139.31644101968527, center: [43.5294430812146 14.511489877375906 39.85370396841242]
cid: 648, volume: 204.4977897067977, center: [47.99773724148252 41.964118296124646 45.2106459040244]
cid: 649, volume: 81.44096613690066, center: [55.9525440531353 14.160754878947369 43.51053315631579]
cid: 650, volume: 236.8646204592174, center: [31.447662579486583 42.25074742001448 44.38658926112921]
cid: 651, volume: 68.98192710683446, center: [32.25485837124735 49.81146936536868 43.854691073115156]
cid: 652, volume: 302.44603003261636, center: [40.06944133782633 30.11864210473356 47.437907625141726]
cid: 653, volume: 94.58582382917234, center: [21.906189264523764 20.603509447885198 43.50801742296073]
cid: 654, volume: 91.4615388124585, center: [26.448474941345847 38.25240178244116 44.664973843834616]
cid: 655, volume: 100.80581808500816, center: [30.02321835681718 29.671035638382314 44.916309911225554]
cid: 656, volume: 128.74340331068413, center: [37.353878202475805 53.56913622369784 46.385513957050904]
cid: 657, volume: 91.18530629573685, center: [55.96758876176402 29.002569602632402 44.96904629614541]
cid: 658, volume: 127.91470576051918, center: [11.131759194813954 23.02726098789932 44.91214281461762]
cid: 659, volume: 78.23095378741112, center: [14.43511832271325 35.59711850499208 44.11433814458785]
cid: 660, volume: 151.0991866467433, center: [37.2723953052332 3.3782704206013996 47.74706359906701]
cid: 661, volume: 125.32383525885403, center: [47.642781833933995 19.77350414399179 45.20540703557042]
cid: 662, volume: 36.672247909598546, center: [51.147236749122094 48.81133764 43.005984839999996]
cid: 663, volume: 82.58399724057647, center: [53.059307468956035 41.067208757958475 45.08745311262976]
cid: 664, volume: 151.19443923871628, center: [12.309650088648757 28.65345060810811 45.33595139189189]
cid: 665, volume: 215.66139348603133, center: [25.73896945562536 20.32031706260766 45.81325313747184]
cid: 666, volume: 208.70795427200355, center: [42.49833218725256 41.0778997693396 45.718950933366806]
cid: 667, volume: 125.38098681403783, center: [48.855374113806754 30.09706008520094 46.52083613340424]
cid: 668, volume: 183.5231689543468, center: [27.44944638522081 43.72507208462656 46.19401889772668]
cid: 669, volume: 129.89595967355723, center: [29.597531244929304 9.790444655862727 45.93978809485224]
cid: 670, volume: 118.29419397124788, center: [44.16619302358901 48.6695119105403 46.30695412400354]
cid: 671, volume: 107.9592877421792, center: [52.60858629962907 18.18631260865537 45.50373578639492]
cid: 672, volume: 63.92401447306904, center: [19.603786448288346 50.792927637907916 45.151231868126956]
cid: 673, volume: 95.4335718977319, center: [21.970642397128458 38.81621313644076 45.34334828336161]
cid: 674, volume: 268.7361377333776, center: [39.11679283040807 18.701737259206748 47.861260130329995]
cid: 675, volume: 64.46695424731504, center: [43.286767831599676 34.595377496010634 45.80764305518617]
cid: 676, volume: 61.87608374564991, center: [46.63498451974118 55.82763726608682 45.070736929110225]
cid: 677, volume: 188.0095660362743, center: [21.991994326974254 11.16302617043267 48.34377530844057]
cid: 678, volume: 93.27133805994518, center: [34.541182242944835 52.939967568933824 46.82824640716912]
cid: 679, volume: 85.7082822572903, center: [56.76475786541193 22.761370732885084 45.847303613691935]
cid: 680, volume: 92.31881214021534, center: [23.440266031354124 44.78192575350805 46.219843965383824]
cid: 681, volume: 192.48643785900452, center: [35.49600055534931 42.74674449472981 46.92123952464371]
cid: 682, volume: 153.26142048453002, center: [45.15155148216023 10.932361469328775 46.836440129925414]
cid: 683, volume: 103.29191073550301, center: [54.05773608385279 35.97523185724825 46.750248058926594]
cid: 684, volume: 106.8257818977007, center: [17.342289426201578 37.960342597235844 46.19335504172982]
cid: 685, volume: 103.77769895456522, center: [18.582663985978424 44.393355162322166 46.328408389949516]
cid: 686, volume: 163.88208448951764, center: [25.65627652029196 13.767779520575413 46.9148294510898]
cid: 687, volume: 228.53954392077867, center: [36.70350265867697 33.71048669491102 47.6411310037511]
cid: 688, volume: 125.76199718192976, center: [38.554622891474665 59.360286037150644 46.78031845194274]
cid: 689, volume: 98.89124098635119, center: [40.97740561402786 51.65257917535157 46.43257485999807]
cid: 690, volume: 145.55548579391566, center: [44.093627422280534 16.85244897074799 46.88938659501996]
cid: 691, volume: 249.09505326854844, center: [49.20721768503565 13.856049634622003 47.46771891051967]
cid: 692, volume: 65.8195410533314, center: [23.224272181684448 54.91976396874096 46.05997243480463]
cid: 693, volume: 93.7190252422182, center: [31.993622607485204 59.66320807211098 46.43266742905783]
cid: 694, volume: 137.52569229059318, center: [25.36396632209003 30.087795671561157 46.96709634817842]
cid: 695, volume: 68.75332088609929, center: [26.094839088478253 57.81956755922693 46.14028746009975]
cid: 696, volume: 177.67465980720561, center: [36.029276177977785 25.3703952374417 48.13704299437088]
cid: 697, volume: 128.69577701469765, center: [47.806581299698536 52.06763880852638 47.054452558618905]
cid: 698, volume: 92.69982250810727, center: [48.17195883620101 36.34579420376079 47.41194045221948]
cid: 699, volume: 70.54406961519138, center: [56.69549629737188 17.90162624858223 45.997931223872534]
cid: 700, volume: 138.03053102805, center: [39.5930961895421 24.955763961079292 47.12134482765165]
cid: 701, volume: 86.04166632919575, center: [52.782399592481575 26.462607400531382 47.08170556808369]
cid: 702, volume: 149.61324621196476, center: [30.87281027703207 52.88776700967721 47.87732671866047]
cid: 703, volume: 131.6390821066628, center: [45.94303809843591 26.685853690050653 47.101659525325616]
cid: 704, volume: 123.74264223210251, center: [50.37965568458727 46.77684128154107 47.34846444665538]
cid: 705, volume: 86.69890921380933, center: [22.75328268364582 35.27291427043507 47.65320638711272]
cid: 706, volume: 105.76847812680057, center: [26.180023356976054 49.034462512337896 47.892178383555475]
cid: 707, volume: 136.64936844444173, center: [31.05012098924505 46.708057075909664 48.17217491122961]
cid: 708, volume: 100.94869697296762, center: [32.42388237177215 28.35384569244197 47.38282590639743]
cid: 709, volume: 34.69099399656049, center: [56.074599315126044 25.755936961285006 46.831640822075784]
cid: 710, volume: 111.912270309058, center: [15.181837625334941 32.167699405140866 47.688887035705164]
cid: 711, volume: 88.19437490778517, center: [42.40161600179141 57.21993680856464 47.51306317831299]
cid: 712, volume: 122.1138229093645, center: [45.995396377012085 44.156627117901714 48.69721200783931]
cid: 713, volume: 152.03266204807852, center: [28.368348928829292 18.37806955616816 49.12791259372847]
cid: 714, volume: 96.01461270876709, center: [32.0857170306983 23.328296509375 48.98660884464286]
cid: 715, volume: 180.84657111990597, center: [39.91131036108727 35.31833504895713 50.215804662514486]
cid: 716, volume: 84.6795542639821, center: [20.79155868860434 21.177951918053992 47.55354179021372]
cid: 717, volume: 136.78272207320393, center: [30.31953910999014 37.97347543245125 48.86422766354457]
cid: 718, volume: 272.85104970661047, center: [33.744200198537506 10.857944232012567 50.12324183684761]
cid: 719, volume: 217.5092937703072, center: [33.47417273719933 18.25039128202321 49.623647995533176]
cid: 720, volume: 257.1248467718709, center: [48.24852260343719 7.7041997182151585 50.67143202322739]
cid: 721, volume: 76.40210402152985, center: [51.94448679951643 9.835849524311183 48.16051034440843]
cid: 722, volume: 203.05947556800564, center: [30.35030202281459 33.374492844427245 50.08608355263158]
cid: 723, volume: 85.45110025896325, center: [52.58402393169952 22.634831242224948 48.368127035280345]
cid: 724, volume: 94.00478301813715, center: [21.28051193916462 30.46428723264769 48.952983520113484]
cid: 725, volume: 185.47584708979295, center: [42.12434297171863 5.020193603122433 48.300649285461176]
cid: 726, volume: 111.8836945314661, center: [21.769585310815327 50.04296802430615 48.59487711816789]
cid: 727, volume: 122.76154053478079, center: [42.30199447983274 46.832310914455306 49.72173446263967]
cid: 728, volume: 133.78226542605495, center: [53.912015567869304 14.095682903239588 49.519113604699186]
cid: 729, volume: 104.92073005824103, center: [19.89831522112254 26.378191753018612 49.64685924239673]
cid: 730, volume: 107.9116614461927, center: [24.20240141558754 40.08855385823992 49.74978527111837]
cid: 731, volume: 154.15679484907605, center: [41.752135116086095 10.947867686882105 50.3649981185739]
cid: 732, volume: 186.47599930550928, center: [44.356579920664295 23.057325087577258 50.51163821057874]
cid: 733, volume: 190.38135557640157, center: [50.04506326040209 18.70109245872317 51.13910832993946]
cid: 734, volume: 136.2778833357471, center: [18.128403053841083 14.362159107464876 50.16472701992031]
cid: 735, volume: 73.70645566869442, center: [18.494016899053033 19.793502821142415 48.75527289021711]
cid: 736, volume: 289.06304086041223, center: [37.68460088594053 14.42189449443108 44.91171432828615]
cid: 737, volume: 175.68388063497028, center: [44.010717073587074 30.249863162898503 50.32017079782043]
cid: 738, volume: 108.89276314351443, center: [50.61498822899492 32.02257994379811 50.01103489542513]
cid: 739, volume: 94.96683419706429, center: [20.05451336526698 39.40687748274824 50.657806375275825]
cid: 740, volume: 97.56722995792673, center: [21.06130588514792 42.783748036219855 51.03461124089622]
cid: 741, volume: 114.28405984918528, center: [27.39444438397207 27.57995089348225 50.36319175154192]
cid: 742, volume: 76.74501335263258, center: [28.608412410886668 56.55645872576641 49.70783478434902]
cid: 743, volume: 68.1722800750641, center: [34.6709489795694 58.21944940764287 49.322874980648315]
cid: 744, volume: 96.76710818535366, center: [39.89169162191899 48.686198541391875 50.63019107490895]
cid: 745, volume: 50.04571182260539, center: [18.46640228012578 36.14665334012181 49.516602624095924]
cid: 746, volume: 114.1983325164096, center: [34.38846978748934 35.94686073112853 51.44001229059971]
cid: 747, volume: 70.34403917204811, center: [44.04702542771445 54.22807010473933 49.73445287914692]
cid: 748, volume: 152.50892500794345, center: [45.739443765954 38.72611045362564 50.86109531675098]
cid: 749, volume: 99.64373646293775, center: [14.08654994456962 25.31204383438486 50.057685686119875]
cid: 750, volume: 113.24580659667976, center: [34.616147985573775 49.46173350643452 50.94204731491294]
cid: 751, volume: 84.09851345294689, center: [54.377894977596426 30.849198458715595 49.853285424566764]
cid: 752, volume: 61.28551767541741, center: [13.999416485954809 20.83569927090457 49.66002797606466]
cid: 753, volume: 72.08716160515371, center: [17.85944594193991 32.24004290188953 50.39256756322675]
cid: 754, volume: 133.4488813541495, center: [46.594293331226034 34.463598425910064 52.43118238265525]
cid: 755, volume: 78.82151985764362, center: [51.83512666648725 38.00193604803626 50.619941292507555]
cid: 756, volume: 106.35904419703307, center: [54.548758396970875 21.237186781434712 51.79663196775927]
cid: 757, volume: 124.18080415517824, center: [25.57969864014201 53.33977304678991 50.64401605492061]
cid: 758, volume: 87.46092994959321, center: [25.939401046965944 45.48512323366369 50.86513161511653]
cid: 759, volume: 122.81869208996457, center: [34.33319109214454 40.14750710388552 51.51243371754305]
cid: 760, volume: 124.9999764461459, center: [40.487361856203336 54.99454716135792 51.51440059891031]
cid: 761, volume: 186.7903328590201, center: [49.74586190762709 25.102347416573178 51.72185604584396]
cid: 762, volume: 104.30158821041664, center: [26.61821540060127 38.0643902190411 52.62208761986302]
cid: 763, volume: 162.30089146276612, center: [27.28781766795848 24.024259618140736 51.95061818657198]
cid: 764, volume: 198.45877537571056, center: [29.591094428458007 13.411015142980562 51.91607547321814]
cid: 765, volume: 97.129068034851, center: [37.31602768398111 48.66848463592233 51.50861924757282]
cid: 766, volume: 37.65334960692027, center: [16.75728238034222 29.25237569491525 50.83301959777385]
cid: 767, volume: 63.895438695477154, center: [22.88721518432475 21.021316186046512 50.68851332267442]
cid: 768, volume: 119.33244722375339, center: [29.091447404557933 47.62418883512931 52.255505128591956]
cid: 769, volume: 48.2835388711052, center: [33.095266851266324 56.46409462152299 51.190390850956796]
cid: 770, volume: 145.35545535077242, center: [39.802478041938826 43.24727585140891 52.30797605828965]
cid: 771, volume: 190.64806283392593, center: [20.97795982926172 18.697337564726453 52.56482538541094]
cid: 772, volume: 83.78417989943605, center: [27.312048017432023 41.502152003922234 52.87638848891541]
cid: 773, volume: 44.74014244971022, center: [30.725294548036178 56.6474517295082 51.33327282084309]
cid: 774, volume: 118.90381055987497, center: [26.49239414654933 34.85555696034607 54.28079181398702]
cid: 775, volume: 187.52377781721208, center: [34.784369416598864 30.815574560395184 53.29617492119165]
cid: 776, volume: 122.7329647571889, center: [47.061710772628906 47.41369368474971 52.51950235878929]
cid: 777, volume: 113.0838771903257, center: [49.59087314220872 42.405512221319064 52.316643229447436]
cid: 778, volume: 65.78144001654222, center: [54.3070856561466 18.147391767158993 52.417575959165944]
cid: 779, volume: 74.82091099477833, center: [22.317433956375748 45.587505398917884 52.33245972851687]
cid: 780, volume: 144.39340417184528, center: [45.9438664893839 12.202066187413418 52.68929857421334]
cid: 781, volume: 92.23308480743967, center: [16.843554064486618 25.257821323040382 52.653122829443355]
cid: 782, volume: 82.39349205663049, center: [23.16297100967517 28.86276928630058 52.61362828439306]
cid: 783, volume: 46.29275969886985, center: [23.532966982641184 48.249913749074075 52.52400526388889]
cid: 784, volume: 150.37526694774863, center: [42.597161620306125 41.404168060936215 52.84098036656743]
cid: 785, volume: 123.36163186421058, center: [37.16748986392848 54.52072020013898 53.381364619527446]
cid: 786, volume: 106.68290300974122, center: [44.291238600856246 50.63331033602679 53.052963241339285]
cid: 787, volume: 73.35402107839438, center: [54.34313618816133 26.366611822555512 52.09679696435528]
cid: 788, volume: 81.57431976566284, center: [20.31505823172506 34.777070245446055 53.353928655651565]
cid: 789, volume: 78.85962089443282, center: [22.33643840117678 25.35238316191569 53.789909356625195]
cid: 790, volume: 204.3358603004436, center: [32.73470948545375 26.63468118984244 53.50280766322487]
cid: 791, volume: 231.39712167996817, center: [38.243221017142254 8.475440622730828 53.515412327028365]
cid: 792, volume: 219.52864872013444, center: [41.73417981891418 16.28826976630364 53.4456546113377]
cid: 793, volume: 85.67970647969841, center: [46.0316550885916 18.103407008337964 53.01986230555864]
cid: 794, volume: 86.77511128738772, center: [23.884641906827525 34.6080020863337 50.78223726866081]
cid: 795, volume: 101.6345156351731, center: [29.328088820303744 6.685491632474227 52.383410916494846]
cid: 796, volume: 135.66826674712001, center: [41.29745008440289 24.725376883065366 53.45190402703082]
cid: 797, volume: 102.72039518366512, center: [15.27903705245767 17.025655928968842 49.14845163343843]
cid: 798, volume: 88.96592090276634, center: [16.3912925494204 20.91158263137045 53.06666885556746]
cid: 799, volume: 106.58765041776823, center: [25.251726745763946 9.69226283686327 52.71140988096514]
cid: 800, volume: 64.7241362456421, center: [25.256249279494067 18.842451537086095 52.686927102649]
cid: 801, volume: 125.37146155484052, center: [24.75677330923031 15.326649008889227 54.03349380325938]
cid: 802, volume: 58.151707399506265, center: [31.62156021510328 48.18645527027027 53.30954217567567]
cid: 803, volume: 103.82532525055171, center: [37.30599647185168 44.62191728752293 54.38233607490825]
cid: 804, volume: 94.96683419706429, center: [47.29611039452335 29.313059890170514 53.65555583696088]
cid: 805, volume: 105.0731342053978, center: [34.496835296371344 44.975881589747075 54.19342634171879]
cid: 806, volume: 92.37596369539914, center: [25.274540230812452 31.537993723190347 54.82562033243968]
cid: 807, volume: 142.61218070195048, center: [31.216975179129093 42.39260036461395 54.938547612843976]
cid: 808, volume: 74.13509233257285, center: [34.34951418797886 53.88917048869331 54.332855098612356]
cid: 809, volume: 199.50655388741336, center: [37.31162863363924 15.660170037908808 54.89125977020769]
cid: 810, volume: 220.70978086059944, center: [37.855611104543165 23.913237970976652 54.936871169004355]
cid: 811, volume: 69.829675175394, center: [50.10377481271036 37.4817641163552 54.00435569983631]
cid: 812, volume: 142.24069559325585, center: [30.56433633126666 20.53481403857229 55.150254370354254]
cid: 813, volume: 143.35515091933976, center: [43.319837414446546 35.18513672142857 55.44461427488372]
cid: 814, volume: 116.57964731573418, center: [51.79540522313137 14.081841366206389 54.87350369078356]
cid: 815, volume: 71.38229242455363, center: [51.88549747211892 31.383690523018416 54.10543191353082]
cid: 816, volume: 124.18080415517824, center: [30.73738793456393 53.01897553735522 55.078735027460304]
cid: 817, volume: 66.84826904663963, center: [25.888181328573335 49.26580590047022 55.086429639498434]
cid: 818, volume: 66.73396593627206, center: [27.75554517275514 51.33810374935769 55.45847650028547]
cid: 819, volume: 77.44988253323267, center: [18.831814724348728 27.096848438814412 55.8475164115115]
cid: 820, volume: 70.04875613693187, center: [19.836042965959688 30.025647522572747 55.73636345988577]
cid: 821, volume: 141.94541255813962, center: [37.4005033354762 40.14105534210174 56.752807952053416]
cid: 822, volume: 174.59800108647826, center: [46.98764009450691 22.606920845744682 56.64036404680851]
cid: 823, volume: 59.99008242458484, center: [53.0609660597673 25.009888046999045 54.9008590784376]
cid: 824, volume: 151.40399494105685, center: [28.96434775533327 29.76256610968858 57.102050276470585]
cid: 825, volume: 80.078854071687, center: [22.581008856890513 38.756822098965145 56.030231287736406]
cid: 826, volume: 163.16769004972028, center: [30.774088127087207 38.26911303126094 56.87567713949212]
cid: 827, volume: 71.90618168040504, center: [24.1718284903528 42.50213307385084 56.63555696939992]
cid: 828, volume: 145.10779861164266, center: [33.62320027916307 5.372378067152422 55.653279051988974]
cid: 829, volume: 125.76199718192976, center: [40.614730187715146 36.32588502828902 56.85087500408998]
cid: 830, volume: 70.03923087773457, center: [46.218377333795814 42.628414907588734 56.3282041756426]
cid: 831, volume: 65.9052683861071, center: [21.50902872603566 33.044222854531 56.58261125437202]
cid: 832, volume: 152.6422786367056, center: [26.79617755196643 17.77762353650546 57.49676391117004]
cid: 833, volume: 161.11975932230112, center: [33.7442125421672 17.96607995480343 56.45187410706473]
cid: 834, volume: 112.13135127059586, center: [39.93755221625894 50.583458766819575 56.32868383562691]
cid: 835, volume: 93.29991383753708, center: [45.39889156694336 26.577656268147013 56.83371627427258]
cid: 836, volume: 176.18871937242707, center: [46.516831749911525 16.067868048980916 57.50435125950154]
cid: 837, volume: 74.17319336936204, center: [49.73806095525688 33.004345229549244 56.151074441569286]
cid: 838, volume: 91.61394295961527, center: [18.463066780925192 18.265745225202746 56.38701219385527]
cid: 839, volume: 132.56303224880077, center: [25.57642718611462 22.895755431127398 57.48738081774089]
cid: 840, volume: 111.95037134584719, center: [26.151350744168766 27.039157403003486 57.30938595984004]
cid: 841, volume: 62.609528703841875, center: [29.147344069010447 34.09434991602008 57.0001147174806]
cid: 842, volume: 163.5868014544014, center: [29.98062412840155 12.161660424420635 56.95201663826133]
cid: 843, volume: 161.99608316845257, center: [36.264785345026986 36.530150373699065 57.91552836091021]
cid: 844, volume: 136.3921864461147, center: [42.62769607820324 12.241448892834695 57.5596830194846]
cid: 845, volume: 97.63390677230781, center: [43.85300519856488 46.28315006297561 56.69321210165854]
cid: 846, volume: 104.5016186535599, center: [43.3773380875581 29.61303927440525 57.566426121000816]
cid: 847, volume: 89.02307245795012, center: [47.10731666522141 39.32290539273486 56.99759201481917]
cid: 848, volume: 129.88643441435994, center: [49.80221719695411 12.662147753923438 57.984429147953946]
cid: 849, volume: 82.9364318308765, center: [21.129846202077562 14.840336323130813 56.64717588612611]
cid: 850, volume: 66.10529882925036, center: [25.25006795882637 45.44356257363113 56.71269275965418]
cid: 851, volume: 96.5004009278293, center: [45.31895997049822 6.980035162866449 56.9536881742671]
cid: 852, volume: 108.89276314351443, center: [40.856866923372756 30.48490776106543 58.294372520468855]
cid: 853, volume: 119.17051781739931, center: [19.775756595227115 22.485310576013106 57.86402118008153]
cid: 854, volume: 262.1827594056363, center: [37.491616983659554 11.17830714 59.61750366]
cid: 855, volume: 123.12350038427812, center: [37.94934610195195 31.802529843764507 59.04466947725514]
cid: 856, volume: 102.2917585197867, center: [33.16506123810966 49.42985220360369 58.14018569131204]
cid: 857, volume: 126.6192705096866, center: [51.24516444321608 22.50406243974272 57.84244758970887]
cid: 858, volume: 136.68746948123095, center: [25.460906242976034 11.13542772303136 57.86101017062718]
cid: 859, volume: 135.220579564847, center: [31.85742826715806 32.635801166208786 58.804161972527474]
cid: 860, volume: 85.794009590066, center: [36.001534668794925 49.341311210613966 58.476632325358054]
cid: 861, volume: 137.4113891802256, center: [42.42575048111143 20.119034815541383 58.768535571918754]
cid: 862, volume: 60.41871908846326, center: [23.76934160646201 35.205078874980295 58.744271845577806]
cid: 863, volume: 67.25785519212346, center: [28.047759862062094 45.79791887721286 58.141987448165985]
cid: 864, volume: 157.21440305140882, center: [30.851689101562652 25.037142943986673 59.59235197352317]
cid: 865, volume: 102.96805192279487, center: [49.662752129488375 28.464594774976874 58.294749053839034]
cid: 866, volume: 73.67787989110253, center: [24.994630688591283 38.549923638655464 59.34238358067227]
cid: 867, volume: 97.7386846234781, center: [30.48226674124446 47.246410238914336 58.903260722151835]
cid: 868, volume: 113.09340244952298, center: [40.15878681803493 46.16048283352986 59.097416209887975]
cid: 869, volume: 116.75110198128554, center: [46.82747660871963 35.04196018695439 59.038254109039734]
cid: 870, volume: 129.32444412171932, center: [33.197007899811894 13.883626867349193 60.236715391323564]
cid: 871, volume: 227.7298968890083, center: [41.76266167718666 6.312323055567174 60.55012606715326]
cid: 872, volume: 71.59184812689419, center: [50.39827643823347 18.863812256120276 59.55021723376796]
cid: 873, volume: 137.01132829393907, center: [33.511379624522846 22.818803744507786 60.34781214523081]
cid: 874, volume: 161.70080013333634, center: [37.346860570364086 21.332404292000472 60.64587780210297]
cid: 875, volume: 153.3661983357003, center: [43.234017464017086 40.33885033650083 60.1046646391839]
cid: 876, volume: 140.9452603424233, center: [46.92387239292935 9.701386125734947 60.61757131739542]
cid: 877, volume: 99.396079723808, center: [34.76014801311513 31.003295343076186 59.776980539338766]
cid: 878, volume: 119.50390188930476, center: [37.19021644174878 27.156639809540888 60.637673068507894]
cid: 879, volume: 140.8119067136611, center: [41.5791194742561 24.214138049685452 60.17403724257593]
cid: 880, volume: 128.8386559026571, center: [22.59325611728265 24.98252352358421 60.67587361792104]
cid: 881, volume: 91.09957896296116, center: [30.31911576527182 17.775897456398997 59.999759276348804]
cid: 882, volume: 89.98512363687726, center: [22.631440311400542 18.304111189425214 59.45563157081614]
cid: 883, volume: 86.39410091949578, center: [27.654567688328665 41.64991393643881 60.179297284895256]
cid: 884, volume: 112.89337200637972, center: [46.31364501989469 30.68143894325852 61.2858036133142]
cid: 885, volume: 125.36193629564323, center: [33.99371566936575 43.706205510827445 61.287962578755405]
cid: 886, volume: 110.20724891274159, center: [41.89471085047058 16.24854624775281 61.24247615224719]
cid: 887, volume: 110.10247106157132, center: [37.165728631275016 43.961227922008824 61.35028218959253]
cid: 888, volume: 110.86449179735519, center: [23.31500831843115 30.309245200446778 59.96246888276484]
cid: 889, volume: 154.93786610325452, center: [37.28497565521583 16.460488519365548 62.24768312633715]
cid: 890, volume: 135.80162037588218, center: [26.490829925304045 32.11987939773445 62.38743201679877]
cid: 891, volume: 89.96607311848265, center: [30.604520299765408 42.42764629105347 61.89210184383271]
cid: 892, volume: 106.92103448967367, center: [40.15373556673912 40.408724270645884 61.99485386271715]
cid: 893, volume: 67.83889600315865, center: [27.53238626919931 37.125178775484414 62.14866781844987]
cid: 894, volume: 109.5785818057199, center: [47.90195622739726 23.981905531032684 62.47238743250174]
cid: 895, volume: 196.82043079377524, center: [47.63333939186631 16.532589358176452 63.085683507356144]
cid: 896, volume: 81.44096613690066, center: [25.10724805912557 15.984856331052631 62.656955413684216]
cid: 897, volume: 139.55457249961773, center: [27.964503395539918 13.714772578083407 63.64746916370896]
cid: 898, volume: 103.69197162178955, center: [37.961461099890116 7.105110728917876 64.1436970093239]
cid: 899, volume: 99.9771205348432, center: [43.1673219222474 33.70694726953125 63.2403575143388]
cid: 900, volume: 85.55587811013353, center: [25.573586490229765 20.00072996192385 63.448372104208424]
cid: 901, volume: 171.5118171065536, center: [32.96653931359947 37.12465018460513 63.959749771659446]
cid: 902, volume: 114.7603228090502, center: [45.23516269397313 24.491717036354583 63.894297634213146]
cid: 903, volume: 143.04081736582893, center: [26.326985127574964 25.162975988246654 63.80261461180661]
cid: 904, volume: 71.5156460533158, center: [29.8486935100134 37.54663253462973 63.491007723228556]
cid: 905, volume: 118.80855796790198, center: [44.056437592309514 10.872200930249338 64.06860956882866]
cid: 906, volume: 101.30113156326766, center: [29.53851243188737 32.6048020303244 64.49735768801129]
cid: 907, volume: 152.61370285911374, center: [36.434318708934974 37.45664485288978 64.18058454768443]
cid: 908, volume: 125.19048163009185, center: [40.138174354315304 34.74223632195845 64.24847765430268]
cid: 909, volume: 150.0133070982513, center: [29.15058531962237 19.366838597117276 65.13100204543146]
cid: 910, volume: 126.78119991604068, center: [42.865308428672016 27.54162464504132 64.53417642024793]
cid: 911, volume: 86.52745454825796, center: [29.52467713977357 28.02469801287979 64.94313167387715]
cid: 912, volume: 125.03807748293508, center: [32.7959306532915 30.1047399571113 65.24496329949721]
cid: 913, volume: 161.10070880390654, center: [44.57555265939462 17.546116119523443 65.67890717179093]
cid: 914, volume: 160.98640569353896, center: [34.374117932210034 10.454803014525767 65.78012043864268]
cid: 915, volume: 134.67763979060098, center: [39.64459577551594 28.262104198599616 65.6442269614895]
cid: 916, volume: 47.24528561859968, center: [29.116046878423067 24.654240613306452 65.40352042590726]
cid: 917, volume: 86.8989396569526, center: [31.439747100638627 13.787911521703387 65.64337631404143]
cid: 918, volume: 119.8087101836183, center: [36.37251678882975 31.095568297265064 65.64439932910638]
cid: 919, volume: 167.95889542596132, center: [33.72588473106145 17.099927713661884 66.78069894011229]
cid: 920, volume: 112.19802808497694, center: [34.93664688234791 25.25618830274217 66.45998645789116]
cid: 921, volume: 142.93603951465863, center: [41.278413804132796 21.381212654538185 66.40640107946822]
cid: 922, volume: 137.21135873708235, center: [32.145324143404544 23.333970698715724 66.51913740728914]
cid: 923, volume: 215.68996926362323, center: [40.92922485972446 13.585789427066773 66.84874798350556]
cid: 924, volume: 84.91768574391455, center: [37.89954194748968 23.88639012955693 66.8170431540101]
cid: 925, volume: 144.37435365345067, center: [37.81669555077833 12.988268439170021 67.83329390281719]
cid: 926, volume: 134.33473045949825, center: [37.362348619890476 19.887803891831524 67.86769573867262]
cid: 927, volume: 213.37533127867974, center: [25.759695368212114 9.542053671353957 32.65234350843713]
cid: 928, volume: 147.58436600294021, center: [25.37299847264901 7.965529530689299 27.741250320607975]
cid: 929, volume: 184.1613613205658, center: [33.157256675916194 4.849385279481742 48.57968748714699]
cid: 930, volume: 81.2409356937574, center: [29.35112600630722 5.431368156173057 47.48639818237777]
cid: 931, volume: 257.286776178225, center: [29.86487588776434 8.291244135722485 61.27597508018956]
cid: 932, volume: 139.32596627888256, center: [42.55199214180606 5.200721070280988 53.918226647296095]
cid: 933, volume: 130.72465722372218, center: [33.98689274360939 6.064888142924803 60.96630276173128]
cid: 934, volume: 146.26988023371305, center: [25.980444810798016 7.851485349928367 46.80907730587393]
cid: 935, volume: 119.14194203980742, center: [37.66597534789091 3.862917123760793 56.67761077346498]
cid: 936, volume: 147.03190096949692, center: [46.38201534860732 5.967957696845037 44.21731984458409]
cid: 937, volume: 145.22210172201022, center: [40.977218968939106 4.8120801688311685 41.97874330844156]
cid: 938, volume: 209.94623796765234, center: [10.142057361434661 30.256282259902 23.33579772703144]
cid: 939, volume: 133.20122461501975, center: [57.29526232261286 11.920801698870138 18.932323721074088]
cid: 940, volume: 50.16954019217027, center: [56.2718059366241 8.668631628061513 22.944365380577178]
cid: 941, volume: 144.41245469023988, center: [57.59725708467314 12.167635560550096 27.170335518501417]
cid: 942, volume: 129.40064619529772, center: [29.066658341103185 7.7723588368421055 37.64543835789474]
cid: 943, volume: 216.05192911312056, center: [31.786257492400328 4.422821119786615 39.76295085305529]
cid: 944, volume: 111.99799764183368, center: [31.188980333829452 3.953616276577649 31.826149061532572]
cid: 945, volume: 193.84854992421816, center: [19.238615438149868 11.37258963417031 42.76674394874945]
cid: 946, volume: 102.57751629570564, center: [52.3128085665764 40.52998613381001 26.670820807967313]