cid: 2, volume: 5725.706131406412, center: [9.022994240536582 22.584967888475504 28.47108346893811]
cid: 3, volume: 160.97961328532404, center: [7.604795553624145 12.934341536458444 31.770366219105473]
cid: 4, volume: 375.1114029386977, center: [4.29944348680205 12.756126810261616 48.042812462331014]
cid: 5, volume: 1282.4368805493355, center: [8.030634673363387 17.91895848319208 49.61638991165785]
cid: 6, volume: 845.0521039303242, center: [5.84587622504631 20.99187160443011 42.65685881027957]
cid: 7, volume: 176.62584169193977, center: [2.356671935296468 18.654192743811855 79.62038554265555]
cid: 8, volume: 22.759723843694342, center: [0.653396001856038 19.457325980304184 57.751595298935364]
cid: 9, volume: 315.7111198728734, center: [2.860882211858647 20.02038853484458 63.51605630641961]
cid: 10, volume: 1446.8780487918752, center: [10.80666086969621 24.595234389613264 37.86793157815831]
cid: 11, volume: 47.40599513907134, center: [1.3602340514211955 23.145241544359255 51.59814557721796]
cid: 12, volume: 286.59944268268794, center: [2.5646380789191947 25.385517789866537 57.234176194317286]
cid: 13, volume: 607.0009695225889, center: [3.0922603279467626 25.04988178621938 69.62755763492059]
cid: 14, volume: 259.8762384129814, center: [3.9629708845965577 28.451417730909093 51.14142729552447]
cid: 15, volume: 1321.5870671154469, center: [6.996767732023012 33.22275681119987 18.601057824940412]
cid: 16, volume: 525.7409669019463, center: [7.930614687263258 29.573588241861994 34.880211103295366]
cid: 17, volume: 169.33926850700036, center: [1.9814269617199547 30.381663657675794 77.5286460344951]
cid: 18, volume: 254.66659820237155, center: [3.734029880661324 32.227277204186485 44.89310287635585]
cid: 19, volume: 669.187804328972, center: [3.6734174864172866 34.345016446485104 39.535951460366235]
cid: 20, volume: 470.6157042082836, center: [7.35571722278941 33.655277440336874 12.004159455338165]
cid: 21, volume: 403.49615358786787, center: [3.699133480315063 34.63350033116716 58.11068394452452]
cid: 22, volume: 212.5567821478405, center: [4.212732057729492 36.35074611340281 49.1065064782591]
cid: 23, volume: 237.94728775901888, center: [4.3110468741875225 36.60128127235234 52.990065003054994]
cid: 24, volume: 639.1761228499104, center: [7.85992454006211 36.36493873129164 31.430643057985378]
cid: 25, volume: 209.4413826863462, center: [2.042178795121763 39.733205386984544 13.779326816841582]
cid: 26, volume: 11.336592484881974, center: [0.6623364244576467 38.94991662778626 42.728536132671756]
cid: 27, volume: 255.20313922074, center: [3.7510033874750692 41.58139021395727 26.611610934750765]
cid: 28, volume: 38.35402892595184, center: [1.482879002609973 40.66980545022563 46.26058782685018]
cid: 29, volume: 18.675088994179617, center: [0.6590053540512157 40.789488520203896 50.51940326746988]
cid: 30, volume: 520.3755567182617, center: [5.875063267721411 41.3266265189084 60.22696345317302]
cid: 31, volume: 199.03941003991253, center: [2.1648925860228627 44.08052680664348 43.45518406119131]
cid: 32, volume: 510.85628058591806, center: [4.219331358481731 43.63482716210869 33.05979797058206]
cid: 33, volume: 352.5074490680781, center: [2.592471662954196 46.96999851699808 65.16781702788334]
cid: 34, volume: 412.46158092705696, center: [4.873387175555924 47.29374600147287 50.50831900316395]
cid: 35, volume: 237.56651671372515, center: [3.1270186269532245 47.082376955660784 57.07588581910972]
cid: 36, volume: 358.374784720559, center: [4.168219241287329 48.78728739279919 38.828458562981744]
cid: 37, volume: 88.40811360729332, center: [1.4723200699286794 51.883961658829286 53.11854878181284]
cid: 38, volume: 431.4828254169582, center: [4.623892833495114 51.9356800643923 46.92868794576414]
cid: 39, volume: 710.5187705181295, center: [5.645998708189985 50.23617002512423 25.194873768992984]
cid: 40, volume: 369.5209916827941, center: [3.666559470808897 53.14460517688525 35.201152846721314]
cid: 41, volume: 422.84624579870456, center: [3.380191827729229 53.68032956435267 59.63024618111825]
cid: 42, volume: 199.67979770699745, center: [1.5707050661665685 58.09442120914449 50.557196757597296]
cid: 43, volume: 669.862807545629, center: [3.43103061048396 60.785691217091696 36.11899048562127]
cid: 44, volume: 371.0094603143969, center: [4.4023249131188695 61.07333666330472 44.54191052183243]
cid: 45, volume: 957.5180244902679, center: [5.357927860729892 68.74600609649151 38.44458632901144]
cid: 46, volume: 506.16587361889054, center: [5.796416356102619 19.22496444837066 54.04742838250299]
cid: 47, volume: 461.5637379951641, center: [3.431624404383244 32.27041575671591 72.14136143878056]
cid: 48, volume: 264.3243365330038, center: [6.552754125260859 31.606632382169984 48.94770432157543]
cid: 49, volume: 51.5425533129443, center: [2.8957436095374556 43.60869900110813 38.35242300161182]
cid: 50, volume: 663.4416230999936, center: [8.176785479127544 55.29926530814463 42.64706156313002]
cid: 51, volume: 159.38729800500474, center: [3.3734828684467524 13.705425993006841 65.23548710630904]
cid: 52, volume: 892.5965612676841, center: [7.33358527987207 39.50302776679206 66.13747776539594]
cid: 53, volume: 1760.3737734921306, center: [6.358635617980086 44.396550459208534 17.715795137467307]
cid: 54, volume: 356.4709294940903, center: [10.176435689921147 44.67459923939114 47.8615616136677]
cid: 55, volume: 929.202504940242, center: [11.386509030549561 53.09189898222847 29.544807073816752]
cid: 56, volume: 261.2089370715095, center: [10.262540651487754 42.077467261641935 51.59319449206865]
cid: 57, volume: 622.9760456501401, center: [8.974333789932361 40.4258433911902 39.246803262952156]
cid: 58, volume: 422.3962436542665, center: [11.316635373750032 39.44880888930547 12.10777643902889]
cid: 59, volume: 476.25803878854543, center: [6.802855696882886 20.296876027219536 76.99570909537015]
cid: 60, volume: 239.4530641654078, center: [8.515065702485115 32.93380530162631 54.78879728480665]
cid: 61, volume: 411.95965545826067, center: [10.11127119123523 52.03542713967734 53.719370454865135]
cid: 62, volume: 186.9585832392291, center: [8.273536636436775 13.437799872653212 67.68181026543233]
cid: 63, volume: 445.6752007415432, center: [5.330551668187183 30.82812278940583 64.07562940286213]
cid: 64, volume: 363.6536560303132, center: [8.9793926260969 46.70927325142069 41.84568487143401]
cid: 65, volume: 535.5717829804394, center: [9.598726478268988 24.19118386876939 61.11733945005171]
cid: 66, volume: 35.740554933253854, center: [6.567975246816789 18.702933570508474 58.48941932338983]
cid: 67, volume: 275.8859300901048, center: [8.502994003567084 27.724602741267255 55.91970179717691]
cid: 68, volume: 133.82371464596554, center: [7.943773683925387 13.344483977521985 57.13867742444387]
cid: 69, volume: 178.73739021584143, center: [8.252683948345663 14.062471430250799 61.914544018088506]
cid: 70, volume: 620.5183416305168, center: [8.476523969582747 50.39735614498494 64.99814173173324]
cid: 71, volume: 1235.8097352756376, center: [13.492131718795383 67.19131268507745 52.691894759884875]
cid: 72, volume: 338.5919981400703, center: [9.477036313138864 44.949861183821504 30.39038707725809]
cid: 73, volume: 470.9445519292191, center: [9.746023602915693 34.37114275609702 71.21335777449835]
cid: 74, volume: 230.41840572707437, center: [8.923411244226235 57.955194359242846 36.0049711405919]
cid: 75, volume: 41.76366055880947, center: [9.431512104848656 18.233594382594283 59.001121485453794]
cid: 76, volume: 567.2623186137506, center: [10.625357746749742 44.74551418047598 55.5712773344714]
cid: 77, volume: 708.5110686429442, center: [7.587438269151612 52.76434680851573 71.65221884661423]
cid: 78, volume: 19.211630012548078, center: [9.403157475883473 38.07472363270271 43.6098294327027]
cid: 79, volume: 380.04411875273036, center: [12.40426441677104 32.31458660229985 46.086416715274616]
cid: 80, volume: 26.792435368850832, center: [9.74226993074022 52.714650705038764 10.741828541472868]
cid: 81, volume: 590.4201212775248, center: [8.76368080754924 58.61224672240788 55.94906756390819]
cid: 82, volume: 477.74650742014825, center: [13.374352865909394 34.95202424949462 39.980835466079775]
cid: 83, volume: 859.5214036514866, center: [12.925184569299638 59.65230618052194 50.620551675705286]
cid: 84, volume: 314.9149622327138, center: [12.109706906968084 40.40075239564715 47.89839713107997]
cid: 85, volume: 136.14295646730017, center: [14.39455274326434 47.00968583764302 52.123982771090766]
cid: 86, volume: 504.08894064456103, center: [14.413564057801462 59.99791993822146 37.071905601424895]
cid: 87, volume: 389.4941637859297, center: [10.123482329842039 13.417008579723605 77.02200517094738]
cid: 88, volume: 11.1462069622351, center: [12.166531840049695 30.277838308695653 50.273005992391305]
cid: 89, volume: 86.8331061017601, center: [14.91561389557284 34.790962366892565 54.615337034183774]
cid: 90, volume: 196.3740127228563, center: [12.942196904305447 39.87198133635643 58.96541004349551]
cid: 91, volume: 268.2012780850856, center: [14.626047773973168 44.06583182437404 25.811669899832214]
cid: 92, volume: 579.3777609640063, center: [15.231103187001676 51.901431890115006 38.91625690226437]
cid: 93, volume: 1079.3647589842665, center: [16.290331070693377 55.15604907403749 61.29202750502862]
cid: 94, volume: 207.08752531543942, center: [14.340655137552336 38.86483233755955 26.243465965223567]
cid: 95, volume: 584.9681722199099, center: [16.687584233123925 63.17865099744364 44.67862576732647]
cid: 96, volume: 96.92353880204435, center: [15.924290318588765 23.8188738885 56.326939239750004]
cid: 97, volume: 298.55911505986876, center: [16.67329428490563 23.61617711636522 43.853424443286954]
cid: 98, volume: 704.1841249464244, center: [11.568880237768278 44.861903354512606 72.52483946285209]
cid: 99, volume: 556.2718816245903, center: [15.637892964509307 16.539602115550714 47.14292508957685]
cid: 100, volume: 424.3347144303074, center: [12.027794945679016 26.371715601191013 68.5062990135824]
cid: 101, volume: 504.9716371586511, center: [14.259481323087117 31.94273097754319 64.36879291410749]
cid: 102, volume: 150.50840953974603, center: [14.16555809356196 39.309166389776905 54.39406264922953]
cid: 103, volume: 229.32801591555136, center: [16.41045479909786 40.34896058110189 31.782658357245282]
cid: 104, volume: 143.25645190437876, center: [14.34399295534057 34.75812687741936 59.349705822580646]
cid: 105, volume: 406.76732302243687, center: [16.304033970470268 47.54105776730917 32.74750324830227]
cid: 106, volume: 93.23698277260945, center: [15.655483714893103 32.07906649630592 52.050153273436045]
cid: 107, volume: 131.12370177933715, center: [16.027391684089125 40.6903667311774 44.083251588595566]
cid: 108, volume: 570.1007936786676, center: [18.38762951268882 44.77750000270803 60.86008219504235]
cid: 109, volume: 159.59499130243768, center: [13.910793606709502 13.29855587851643 58.04538742839172]
cid: 110, volume: 907.5331709080707, center: [14.919863667370405 19.736436974595215 65.792851372505]
cid: 111, volume: 381.35950963647235, center: [14.899680270455322 25.76015293541799 50.71967924308342]
cid: 112, volume: 514.3697588674921, center: [18.60466252555547 20.260946062741006 59.175448424109156]
cid: 113, volume: 186.76819771658225, center: [16.106391563134622 37.83287776930776 50.79272535665833]
cid: 114, volume: 473.5580259219171, center: [16.375489319853227 51.95660627806367 47.27260217696721]
cid: 115, volume: 125.18713502771193, center: [16.24395200205794 45.018788918083786 35.59675632467855]
cid: 116, volume: 347.7305032271202, center: [16.28202102805117 13.862692965432284 63.35814775050022]
cid: 117, volume: 412.47888870184306, center: [19.298311683302124 20.349263646399802 53.03106460623111]
cid: 118, volume: 496.5773663874026, center: [17.351248787318408 29.448967635606987 57.179062254874346]
cid: 119, volume: 247.20694726957134, center: [16.079058773419447 44.898727135328706 45.19871366089057]
cid: 120, volume: 311.695716122503, center: [20.094901196130177 23.47465397936032 21.94174974537731]
cid: 121, volume: 192.1855312246251, center: [17.9927437577465 29.80697503254683 14.534356111302234]
cid: 122, volume: 125.06598060420937, center: [18.057671572826045 39.255327338361475 46.6997958133684]
cid: 123, volume: 404.82885224639597, center: [20.175352946903466 54.06892783015819 54.761169112907226]
cid: 124, volume: 39.721343134052105, center: [17.72482469965639 58.13529907477125 42.68333294235294]
cid: 125, volume: 161.55076985326465, center: [18.304413711415837 13.023215167270195 33.398779885590315]
cid: 126, volume: 320.38421906511485, center: [18.62139586991384 31.54577985127222 35.69621938421479]
cid: 127, volume: 129.02946103022154, center: [17.596454158232625 44.54292595352113 13.710586759154928]
cid: 128, volume: 196.35670494807022, center: [17.29871731052872 16.43557908682239 39.76012571814896]
cid: 129, volume: 142.01029211978107, center: [18.576501131109694 13.981846336416819 55.320113373601465]
cid: 130, volume: 575.8123593580739, center: [20.331635750576023 44.815200323805946 67.61884237501579]
cid: 131, volume: 751.7112745089983, center: [20.446339287752107 52.56682239590164 67.35003947889344]
cid: 132, volume: 143.75837737317508, center: [19.25286074552786 59.54049029552131 32.38728872586082]
cid: 133, volume: 237.6876711372277, center: [21.616377480956714 29.787752718371806 31.157705153127505]
cid: 134, volume: 188.79320736655353, center: [18.82343427738619 46.8595842089659 41.04849900412542]
cid: 135, volume: 195.14516071304465, center: [20.49905659883866 34.62300725113969 14.184012467281597]
cid: 136, volume: 292.69177940738786, center: [21.920648011602204 57.95888986904382 47.02098461436935]
cid: 137, volume: 313.39187805153875, center: [20.558379393436216 37.3283063418954 34.415644974843985]
cid: 138, volume: 149.76417522394462, center: [20.79144106783521 41.70120312287068 33.98053497448284]
cid: 139, volume: 195.49131620876625, center: [20.751254230743996 35.94906929224435 28.912966481381144]
cid: 140, volume: 23.34818818642104, center: [20.32821316165463 20.43312915389177 26.30508768257969]
cid: 141, volume: 226.3683864271318, center: [20.82225189004235 28.667966566228305 45.447180504832176]
cid: 142, volume: 661.5031523239527, center: [21.24907375828014 38.29647399868132 66.01715950571429]
cid: 143, volume: 330.4919595401852, center: [20.778406907556203 40.59876604802828 39.56974383223881]
cid: 144, volume: 324.24385284241055, center: [22.008784311409553 19.891646483719438 39.21178233782428]
cid: 145, volume: 314.2918823404149, center: [22.580134572565843 48.909933818850156 26.89661778987279]
cid: 146, volume: 167.34887440660123, center: [21.696007213667418 18.789682338907852 31.8168449345951]
cid: 147, volume: 121.08519240341113, center: [21.259598508814634 33.56172797277016 10.856630876972556]
cid: 148, volume: 42.386740451108324, center: [20.184979537842292 44.19102368966926 42.54337480106166]
cid: 149, volume: 17.55008363308446, center: [20.987270398505842 22.682945976923076 48.0322831091716]
cid: 150, volume: 104.45242083398887, center: [22.03121593948923 25.90464130076222 49.22531112969346]
cid: 151, volume: 206.70675427014567, center: [21.743041725270153 28.588336393519214 51.720101074403416]
cid: 152, volume: 211.67408563375045, center: [20.92810649249214 29.906565129910057 41.757710912894524]
cid: 153, volume: 483.579227523057, center: [22.400899137619565 54.1725042854796 33.067873241800285]
cid: 154, volume: 559.7680521313783, center: [23.856414415733756 26.740966950417416 62.09081153258302]
cid: 155, volume: 438.12901093481264, center: [21.952642100729822 61.35289964410998 67.89271375649443]
cid: 156, volume: 466.3579916109081, center: [23.665160817633524 56.3703008553535 72.04964709645203]
cid: 157, volume: 386.91530534280383, center: [24.086866111138875 69.59695972675463 47.55874754820845]
cid: 158, volume: 62.32529700467173, center: [23.420052263873707 19.9471020122466 25.58665640061094]
cid: 159, volume: 1421.2106187841196, center: [24.23536318992987 28.244820781058042 22.994694647816452]
cid: 160, volume: 714.7591753407189, center: [22.36424177693665 34.85570274437611 46.65878004966462]
cid: 161, volume: 171.52004813004635, center: [22.022182990927888 36.917062071553985 53.37843897405651]
cid: 162, volume: 204.5086668723136, center: [23.26529374312011 16.715590060841233 44.46429417014218]
cid: 163, volume: 425.9443374854128, center: [22.86601974959526 31.59791155598131 25.771663297375053]
cid: 164, volume: 263.45894779369985, center: [22.78386573328087 42.489275796610166 54.92047861001183]
cid: 165, volume: 341.08431770926575, center: [23.6402327948175 42.30594498296544 21.92368213542396]
cid: 166, volume: 465.2329862498129, center: [25.265775779866615 13.807245294453125 40.43207865484375]
cid: 167, volume: 341.56893540327593, center: [26.040179556588793 25.42377682935901 30.651906531152775]
cid: 168, volume: 765.2113388421402, center: [21.443472246902047 36.425506159863836 21.029217711763774]
cid: 169, volume: 334.593902164486, center: [21.629988488840052 37.870534760350715 59.583669427172566]
cid: 170, volume: 249.31849579347303, center: [23.26013814211409 43.1543958789101 26.82042019732732]
cid: 171, volume: 48.21946055401707, center: [21.391219455120083 44.245309080150754 10.897684160804019]
cid: 172, volume: 407.234632941661, center: [23.155367675173036 50.501007853410684 73.09012127733011]
cid: 173, volume: 337.95161047298535, center: [22.911407009556427 54.12115285690361 40.37073937961692]
cid: 174, volume: 102.68702780580878, center: [24.06257269981729 21.66339225750885 34.22818143504129]
cid: 175, volume: 320.1938335424679, center: [23.93708529002963 60.90831870037297 40.60461926117838]
cid: 176, volume: 616.5029378801464, center: [23.71941570419202 61.84240092238349 57.2908263085233]
cid: 177, volume: 211.60485453460612, center: [24.52065806433269 64.13470101679208 38.67663319630296]
cid: 178, volume: 140.9718256326163, center: [23.839753884336037 13.531990432191527 52.77271081955801]
cid: 179, volume: 80.75807715184624, center: [24.70300862100182 13.909533445756537 29.146266222717532]
cid: 180, volume: 349.18435630915087, center: [23.960045009728688 32.40478870963569 63.32680096566543]
cid: 181, volume: 262.9050990005453, center: [25.412611694388275 34.96634323023042 38.8943652846083]
cid: 182, volume: 212.41831994955186, center: [24.159873067952926 39.41863778320704 11.469279892177951]
cid: 183, volume: 193.69130763101398, center: [24.17107823201133 43.375163893789654 49.390864575355195]
cid: 184, volume: 144.6583816620512, center: [25.6710107108072 46.310991902010045 39.91087761507538]
cid: 185, volume: 95.2100690982225, center: [22.42559701723866 45.09525163792038 73.9707389673332]
cid: 186, volume: 206.23944435092153, center: [24.336269156620684 46.85777772197885 54.495205099647535]
cid: 187, volume: 177.5950770799602, center: [23.866659135795143 48.47676149695936 48.49122173921645]
cid: 188, volume: 92.68313397945491, center: [22.87908597705832 49.05423121568628 36.09097041960784]
cid: 189, volume: 151.1141816572588, center: [24.05984958265838 50.85750777505441 52.61389428506471]
cid: 190, volume: 318.42844051428784, center: [23.982502727036152 68.67429479152082 40.51731742918252]
cid: 191, volume: 322.7726919855938, center: [26.41015199375884 13.403305048849804 33.517511431111586]
cid: 192, volume: 277.3051676225633, center: [23.579799359751565 15.414385140681564 59.26337288673075]
cid: 193, volume: 361.2824908846203, center: [30.04656621119999 21.660452969014084 24.101452127867205]
cid: 194, volume: 110.70052753176351, center: [25.579450050782015 39.21820775745778 50.67244809990619]
cid: 195, volume: 58.102199956868375, center: [22.957218157026656 49.82121780268097 44.290819132350315]
cid: 196, volume: 41.91943053188418, center: [22.897962625259712 49.738324187861274 56.91946821676301]
cid: 197, volume: 372.7921611173631, center: [25.404766737583785 50.708155790250245 62.04879805534611]
cid: 198, volume: 261.36470704458424, center: [25.554827087722252 53.75235075187736 48.268258907317396]
cid: 199, volume: 245.78770973711283, center: [25.09003380767861 56.466550972044224 29.094469505112315]
cid: 200, volume: 415.8539047851285, center: [24.940029695605396 14.299749726058185 48.817453259008616]
cid: 201, volume: 130.55254521139653, center: [23.579711060525288 24.48867644345751 55.78261933391224]
cid: 202, volume: 179.25662345942382, center: [26.183716416006902 26.86761529146471 35.822995723211356]
cid: 203, volume: 439.513632917699, center: [25.970305791280765 33.714090547794754 55.42864794695597]
cid: 204, volume: 172.2988979954199, center: [25.686123113901854 41.598928414023106 43.02889426863888]
cid: 205, volume: 266.0897295611839, center: [26.873610711928553 21.881805307298038 42.648695499967474]
cid: 206, volume: 189.52013390756886, center: [25.23671010547099 45.4420934970685 35.23665962868493]
cid: 207, volume: 229.12032261811842, center: [26.615345969291067 19.60119216662638 47.98182408614594]
cid: 208, volume: 159.69883795115416, center: [26.81304286888974 46.12888752407066 43.85898463388967]
cid: 209, volume: 151.80649264870198, center: [28.927015907363902 17.03809838188348 34.07934193000798]
cid: 210, volume: 602.2759470059892, center: [27.753643387729575 63.80978404722685 50.84144489843957]
cid: 211, volume: 106.3562760604576, center: [26.103066878145896 29.892055645288853 13.081759616631409]
cid: 212, volume: 156.09882079564966, center: [28.07849050648135 49.14820925042688 33.99273682183169]
cid: 213, volume: 132.38716933872095, center: [26.456963681304636 17.540911091201465 26.172813334553535]
cid: 214, volume: 367.3748276093203, center: [28.131875681988287 25.40754428516913 66.95105767311316]
cid: 215, volume: 200.3028775992963, center: [26.736450120237972 38.617130230623005 26.65622702379677]
cid: 216, volume: 202.55288832148662, center: [29.26331126918953 50.77899222765957 56.527504274134834]
cid: 217, volume: 410.7654189980212, center: [30.25339062151007 47.76074446947288 73.94303783706232]
cid: 218, volume: 383.021056015936, center: [29.615324708744392 57.35339581569815 54.066207154148216]
cid: 219, volume: 358.42670804491723, center: [28.264455066322938 60.061638850181076 34.269116150079675]
cid: 220, volume: 306.93607805633116, center: [26.261760356529244 31.723310589365063 36.053393106005416]
cid: 221, volume: 394.06341632945464, center: [30.31609661420916 22.86091986519677 56.217478884210294]
cid: 222, volume: 246.04732635890403, center: [30.182514874705898 34.14692019722144 29.258442956260552]
cid: 223, volume: 289.7148421441822, center: [29.435799341832872 33.80787505078559 65.74706828600873]
cid: 224, volume: 234.4165017026587, center: [26.93405717764212 45.98166962452008 30.24971889597608]
cid: 225, volume: 213.31832423842798, center: [28.36659535229633 15.218936918677485 55.75970620887627]
cid: 226, volume: 286.5475193583297, center: [27.78639114656441 24.454710557217926 47.5172703304965]
cid: 227, volume: 262.87048345097315, center: [27.895896612023158 26.554813147359756 40.88966125016461]
cid: 228, volume: 218.63181109775434, center: [29.43854151721681 25.52606611823939 17.811050905668143]
cid: 229, volume: 306.5206914614653, center: [29.59740830975574 41.17363171897234 37.17185336418972]
cid: 230, volume: 450.1406066363517, center: [29.536487202758014 58.93134151132728 62.640942578049064]
cid: 231, volume: 243.0530813209123, center: [29.545543516649307 50.621876512390514 42.57270338959624]
cid: 232, volume: 267.75127594064753, center: [28.576124903181263 66.1183663395475 62.53444390873303]
cid: 233, volume: 395.1364983661915, center: [29.56502767719817 44.96897471357424 61.53695108996058]
cid: 234, volume: 311.92071719472204, center: [31.05631443076467 37.77589184548885 43.424318891099766]
cid: 235, volume: 252.05312420967357, center: [29.54561921101508 39.039910299745934 55.552242954075396]
cid: 236, volume: 404.8634677959681, center: [30.654154600784427 41.543714934631495 73.94461518438355]
cid: 237, volume: 106.75435488053742, center: [28.7688110479118 42.20270666357004 46.95673518283074]
cid: 238, volume: 282.82634777932265, center: [30.101217915526426 64.13902226251147 44.8979924874977]
cid: 239, volume: 74.21573828270824, center: [30.29049072519687 12.569538713479478 46.67366121135727]
cid: 240, volume: 323.8457740223307, center: [29.583024215690102 29.08307370909091 49.97015602727272]
cid: 241, volume: 331.06311610812577, center: [30.38614978456354 48.3496627514586 67.84028874766311]
cid: 242, volume: 289.21291667538594, center: [33.01172452186485 55.14519450635548 58.99976563579892]
cid: 243, volume: 300.0648914662577, center: [31.122489260284688 68.14660090569302 57.148610249195364]
cid: 244, volume: 401.8865305327625, center: [30.87869733747965 30.184770042054264 56.415967233527134]
cid: 245, volume: 67.30993614306259, center: [31.221864336317676 14.236257775417846 28.742960235304707]
cid: 246, volume: 705.8283635511019, center: [32.58702453143438 17.865291703540866 31.338264293769157]
cid: 247, volume: 308.37262336357577, center: [29.123827311854185 53.28001946714935 37.61993827996296]
cid: 248, volume: 260.0147006112701, center: [30.19311147381313 19.80623547390002 51.73886345088198]
cid: 249, volume: 42.0752005049589, center: [30.633860098288366 24.24264846515837 35.152523339777865]
cid: 250, volume: 254.68390597715762, center: [30.46836285198937 38.88070100744138 30.202410090479102]
cid: 251, volume: 93.92929376405263, center: [30.518434876558253 40.96821206522941 52.556707524709786]
cid: 252, volume: 191.23360361139072, center: [30.347135955905486 46.5675262877274 23.92533520013576]
cid: 253, volume: 260.2916250078473, center: [29.346197019695207 57.19705494602035 43.35768764709755]
cid: 254, volume: 77.33113774420254, center: [30.62817710937278 18.120450109310653 43.56599980232767]
cid: 255, volume: 497.754295072856, center: [33.696096134585915 39.68918933785945 61.63370162131159]
cid: 256, volume: 318.7745960100095, center: [31.74715572589892 36.47335436111956 72.00147383487892]
cid: 257, volume: 172.17774357191738, center: [32.10324527713445 50.450925692611584 24.990279002985524]
cid: 258, volume: 261.7800936394502, center: [31.40735733077401 62.4438910209719 67.51999179038678]
cid: 259, volume: 142.35644761550265, center: [32.66731404373618 69.89348884697873 48.363560844]
cid: 260, volume: 144.79684386033983, center: [32.337087628959374 44.49688639468085 57.301041714893614]
cid: 261, volume: 127.41983797511617, center: [32.769263720828654 46.978768463569686 43.06110623080685]
cid: 262, volume: 98.03123638835343, center: [32.80018544239454 18.84879996117585 36.404943524947036]
cid: 263, volume: 405.76347208484424, center: [31.1272624633931 20.025467075750722 61.826820439916396]
cid: 264, volume: 122.34865996279491, center: [33.885569630286895 21.93872205430754 30.91202980193804]
cid: 265, volume: 196.23555052456766, center: [32.79334578231528 29.34021980953431 31.67335388091374]
cid: 266, volume: 222.14528937932843, center: [32.19248938521735 31.996823387354887 41.85501117940787]
cid: 267, volume: 157.81229049947152, center: [32.509589150932115 35.3619215866089 37.4542263572494]
cid: 268, volume: 245.07809097088358, center: [33.25842238755125 54.74784041466102 26.3952520679661]
cid: 269, volume: 201.1336507890281, center: [32.21601654747901 60.521639107202475 37.33289052091903]
cid: 270, volume: 142.11413876849753, center: [32.47164857656518 42.864468100511516 40.63270107314578]
cid: 271, volume: 131.60831947334736, center: [33.23005407622736 51.3018605613756 46.276392881733294]
cid: 272, volume: 529.9986794993218, center: [34.36342389306387 50.09516751888185 51.566689274946114]
cid: 273, volume: 162.48538969171292, center: [32.08025928638473 69.85373205773328 44.22700318037921]
cid: 274, volume: 168.16233982154696, center: [33.18112724115618 31.841945940345823 35.096179297262246]
cid: 275, volume: 181.64509637990275, center: [33.06813250149299 41.94574783103383 24.232218358599336]
cid: 276, volume: 334.09197669568965, center: [32.378371649294564 45.373131463404654 48.970858196394346]
cid: 277, volume: 147.47954895218214, center: [33.184058445583375 35.82931770080976 47.46217387090717]
cid: 278, volume: 238.57036765131775, center: [33.32060574327794 40.141240017135814 33.0730486172011]
cid: 279, volume: 161.39499988018994, center: [33.582752292361924 45.048217039431634 28.01365728270241]
cid: 280, volume: 71.93111201094577, center: [34.628107404238726 22.701297538065447 34.93495283871511]
cid: 281, volume: 219.9298942067103, center: [32.60842714732218 29.96565571690407 44.77614602998347]
cid: 282, volume: 555.7007250566496, center: [33.51449371489148 42.088104947709226 68.45866870621983]
cid: 283, volume: 175.9162229257105, center: [34.51070485305911 45.64385856157025 31.60775294607438]
cid: 284, volume: 310.95148180670157, center: [33.46419331805607 69.23429526861294 52.65627345576088]
cid: 285, volume: 91.61005194271799, center: [35.06062383990763 23.680714993670886 26.3197261151143]
cid: 286, volume: 210.42792584915273, center: [34.240078278489406 33.73783109185722 49.97041903931568]
cid: 287, volume: 189.69321165542965, center: [34.35955069055733 13.544726132983577 35.97690883902372]
cid: 288, volume: 139.50066477579955, center: [33.992500572192974 16.16034460462779 50.00499336442928]
cid: 289, volume: 233.86265290950416, center: [34.04203643292837 51.5001626678286 30.071270769404975]
cid: 290, volume: 23.65972813257047, center: [33.220190951231984 12.311453557132406 39.60519257073884]
cid: 291, volume: 296.30910433767843, center: [34.83678453245231 25.163710878732477 38.54988637966121]
cid: 292, volume: 155.00843098412665, center: [33.466191617970146 57.62153273682447 29.284877618501564]
cid: 293, volume: 346.1381879468009, center: [33.72955983593237 57.52226270854043 46.87603462922646]
cid: 294, volume: 223.04529366820458, center: [35.03516783800305 66.35580383954373 34.81809978674634]
cid: 295, volume: 269.0320512748174, center: [34.84369656183173 48.06120176280881 36.51175249091611]
cid: 296, volume: 239.6780652376268, center: [35.467930805369576 56.377440742006065 40.16897173717504]
cid: 297, volume: 218.09527007938587, center: [35.36495333516068 32.51183001303071 63.75223829871439]
cid: 298, volume: 116.98324977911032, center: [35.255306053160396 34.94408509800267 67.2657649310253]
cid: 299, volume: 29.99437370427551, center: [36.557247183198356 18.00534690623197 24.68048482798615]
cid: 300, volume: 237.16843789364532, center: [36.46903402685303 37.21190597538495 24.611768788206962]
cid: 301, volume: 230.3145590783579, center: [35.46656819564326 40.606962308995264 46.62959355433983]
cid: 302, volume: 201.54903738389402, center: [35.716908090669406 25.373230418875053 53.032667524147705]
cid: 303, volume: 166.20656127072, center: [36.2411869193537 27.072184562417995 27.164444692752266]
cid: 304, volume: 281.3205713729337, center: [36.15166884521256 54.16811113087856 71.6006724001292]
cid: 305, volume: 198.72787009376307, center: [35.669007271646926 13.029717303736282 44.33675074776172]
cid: 306, volume: 205.14905453939852, center: [37.09823944669367 25.511305840799796 48.52788014748165]
cid: 307, volume: 342.05355309728617, center: [34.52620148597534 54.72976314687042 66.29707929271872]
cid: 308, volume: 253.31659176905734, center: [35.233308213331085 67.99935959676141 39.68325954494398]
cid: 309, volume: 155.00843098412665, center: [39.09675774215479 20.658140224341224 26.971678841100935]
cid: 310, volume: 247.60502608965118, center: [35.14113218602205 51.198168537110305 61.44030341751712]
cid: 311, volume: 239.88575853505978, center: [36.05904496953832 55.312371776666666 33.92493861893939]
cid: 312, volume: 385.73837665735044, center: [37.35603695649267 19.106592820904563 36.94889036501548]
cid: 313, volume: 193.89900092844695, center: [37.67071398585003 21.79679505719004 43.86686856110863]
cid: 314, volume: 351.2093659591221, center: [38.22522376493453 25.365191719736845 60.40216805]
cid: 315, volume: 219.39335318834182, center: [37.2102675686544 28.582007584506155 58.59926823254181]
cid: 316, volume: 116.72363315731913, center: [37.34439310178947 36.259438555782914 56.45167734724199]
cid: 317, volume: 268.9974357252452, center: [38.23967630558956 38.200515411723075 39.95082164573414]
cid: 318, volume: 273.5839960435563, center: [38.94702852755066 38.63323500576959 51.26291985687987]
cid: 319, volume: 321.9073032462898, center: [38.24797967956659 46.80628540161837 58.26170482197968]
cid: 320, volume: 322.01114989500627, center: [37.65918073581018 58.40205768382155 51.95418318196721]
cid: 321, volume: 309.0995499045911, center: [37.324360864724774 63.1107578625231 41.27626920981018]
cid: 322, volume: 237.61844003808338, center: [36.670392960082424 65.7056122925122 61.847832167929205]
cid: 323, volume: 393.9595696807381, center: [36.89566320156152 15.597027650926982 40.084541795395836]
cid: 324, volume: 192.0989923506947, center: [37.195905944488125 26.11306803062438 44.42585639416164]
cid: 325, volume: 179.37777788292638, center: [37.34254924418554 47.76982506466615 65.11321916668275]
cid: 326, volume: 282.2724989861681, center: [37.78538155340175 60.530341122226986 67.89802512900239]
cid: 327, volume: 429.9424334609971, center: [37.54779978620839 62.13156278469466 57.80000148964213]
cid: 328, volume: 275.6782367926719, center: [36.94956196332727 64.40714745274988 47.257397275841285]
cid: 329, volume: 137.85642617112202, center: [37.76404981712899 34.869249882259886 36.27069657160076]
cid: 330, volume: 438.19824203395694, center: [39.68150265362565 41.574352884011375 54.094012565325066]
cid: 331, volume: 313.75534132204643, center: [38.95382497193424 50.30633928177406 44.18254343001434]
cid: 332, volume: 167.12387333438218, center: [37.732659792705796 60.60453235945526 32.24317102866611]
cid: 333, volume: 115.37362672400494, center: [37.974835761999564 31.584222364356435 33.79362008757876]
cid: 334, volume: 84.70424980307233, center: [38.08175773447497 41.25963976287291 22.10284486857376]
cid: 335, volume: 106.14858276302465, center: [38.56003546914746 22.646397602103374 63.9777184906734]
cid: 336, volume: 172.57582239199718, center: [38.491884034225805 24.17908506929094 31.079993057005318]
cid: 337, volume: 376.01140722757384, center: [35.76069675779794 31.590378921721516 70.16602478971691]
cid: 338, volume: 217.09141914179327, center: [38.76000596597395 49.93789782662042 23.25330782858168]
cid: 339, volume: 151.23533608076136, center: [38.597999938883845 52.32518940078966 38.111225780407416]
cid: 340, volume: 22.05010507746509, center: [40.12943879706502 16.876508713186812 25.89834995769231]
cid: 341, volume: 278.0320941635787, center: [37.70622733792151 26.90144514744771 66.72034164199452]
cid: 342, volume: 140.3141301907453, center: [38.463417912665655 30.67236690233132 28.224189807413346]
cid: 343, volume: 140.5391312629643, center: [38.59415335946843 43.84332852258621 34.09463112853448]
cid: 344, volume: 297.05333865347984, center: [39.76091597476199 44.488048882118505 40.31361640854746]
cid: 345, volume: 222.12798160454236, center: [40.02357984487714 44.749680520944366 22.778293036231887]
cid: 346, volume: 197.49901808395146, center: [40.22772800037317 51.065595737236 30.485016771965647]
cid: 347, volume: 196.32208939849806, center: [39.28156586456919 40.19016374377149 28.94843663528167]
cid: 348, volume: 217.73180680887822, center: [39.47665531617172 21.47648159616057 52.20027871876788]
cid: 349, volume: 176.69507279108407, center: [40.271142856447355 34.29674184084631 25.570553863855423]
cid: 350, volume: 214.44332959952314, center: [38.76726814973545 48.22307991932203 72.63376980152543]
cid: 351, volume: 301.76105339529346, center: [41.67473551759019 63.21544807041009 53.151102172738746]
cid: 352, volume: 229.58763253734256, center: [40.635497678874536 61.99293594316622 36.04542897530343]
cid: 353, volume: 54.311797278716995, center: [42.50859696235733 12.476264350095603 34.09391997122371]
cid: 354, volume: 215.36064166318533, center: [39.78283460722191 29.720760013598007 38.69187945869164]
cid: 355, volume: 380.02681097794425, center: [41.44025506242435 34.53280612184725 45.72420313877579]
cid: 356, volume: 331.34004050470304, center: [38.29651340903236 18.195579344160052 55.75202076420288]
cid: 357, volume: 226.33377087755966, center: [40.00595784650261 30.938512966987844 52.90005667384721]
cid: 358, volume: 149.0026331333571, center: [40.914322666220166 50.04137669926821 67.08497457755837]
cid: 359, volume: 369.64214610629665, center: [40.16491332398026 51.90718278466077 53.87930359292035]
cid: 360, volume: 211.84716338161124, center: [39.006808691877666 16.642625098406864 45.88006660279412]
cid: 361, volume: 308.9264721567303, center: [38.9424922316657 33.73913272266794 58.385388236450225]
cid: 362, volume: 85.95040958767005, center: [38.54349891505061 34.56676196804269 52.995583670237615]
cid: 363, volume: 233.22226524241924, center: [41.011746305619425 25.09055608161039 35.868857020831165]
cid: 364, volume: 77.72921656428235, center: [41.13787683180265 29.788749785905143 41.998436750835005]
cid: 365, volume: 175.7431451778497, center: [41.10089925212219 34.544972764112664 30.606106691983456]
cid: 366, volume: 92.61390288031059, center: [41.13599690214062 53.85679198772192 25.004376053317138]
cid: 367, volume: 377.4133369852463, center: [41.402899120839834 56.93714020633312 63.25055859210768]
cid: 368, volume: 238.2761354799544, center: [41.03731904974722 37.87708550937023 66.72876466981913]
cid: 369, volume: 118.0909473654194, center: [43.36123775869236 14.246800687879231 29.161345330719623]
cid: 370, volume: 117.34671304961799, center: [41.58457315642029 20.753921069867257 45.988583759690265]
cid: 371, volume: 212.67793657134303, center: [41.86665172422549 39.34493097277832 59.826470200854494]
cid: 372, volume: 203.95481807915905, center: [41.52449867508933 46.05043201560591 27.600185413314662]
cid: 373, volume: 153.779578974315, center: [42.084089014680714 48.3328468913112 33.13605902849747]
cid: 374, volume: 258.1627687091596, center: [40.709169451370485 68.95234550824618 46.085523166150445]
cid: 375, volume: 315.7976587468038, center: [41.71801882469704 57.356360289822426 41.347747034988494]
cid: 376, volume: 124.14866854054716, center: [42.488253082180414 20.879545798452533 34.931184140025096]
cid: 377, volume: 271.3859086457242, center: [41.7310647820624 32.501796679955355 63.893133255803576]
cid: 378, volume: 299.5629659974614, center: [42.26317693046601 44.77581493270164 47.08206087403513]
cid: 379, volume: 240.16268293163705, center: [41.64285236318839 57.83501386943644 27.88617920480686]
cid: 380, volume: 229.51840143819825, center: [42.5266152059672 54.37490032348993 47.167828789932884]
cid: 381, volume: 191.45860468360976, center: [42.76628684030269 28.782180530979932 30.287531032471524]
cid: 382, volume: 190.14321379986774, center: [42.28135669949203 21.283306298798472 60.97039324688695]
cid: 383, volume: 179.70662560386188, center: [43.4746557656823 37.097580059549266 33.55476360147356]
cid: 384, volume: 190.62783149387795, center: [42.30417174891049 41.06702747944435 34.335880758761576]
cid: 385, volume: 223.75491243443383, center: [42.99295596153003 40.7560918883818 44.02888091707147]
cid: 386, volume: 89.27350234659728, center: [44.646699120035365 44.838915970317956 33.021680747983716]
cid: 387, volume: 283.3801965724772, center: [46.29031251810402 18.213036062847372 33.13515950483112]
cid: 388, volume: 105.71588839337267, center: [43.979990910199454 18.74811439469548 28.299627175196463]
cid: 389, volume: 120.6005747094009, center: [43.21497431737463 40.95572911765212 22.26125572194317]
cid: 390, volume: 93.5312149439728, center: [43.725531855068205 25.739510731865284 39.9861700876943]
cid: 391, volume: 218.6664266473265, center: [44.033397506084384 48.803956098796895 36.977796540422666]
cid: 392, volume: 339.07661583408054, center: [43.01174442169319 67.93546469223622 54.423447176040014]
cid: 393, volume: 197.8624813544591, center: [43.09758421261592 29.506918819156752 46.66452542487754]
cid: 394, volume: 337.88237937384105, center: [43.884014174904145 38.83836400326811 71.54142676060341]
cid: 395, volume: 415.6115959381234, center: [44.394242148628265 44.14702363647608 66.69152875123892]
cid: 396, volume: 353.09591341080477, center: [44.17544300210268 61.21757995659036 47.44772307955983]
cid: 397, volume: 159.36999023021863, center: [43.93506162057167 48.27294702435925 62.539774912565164]
cid: 398, volume: 213.50870976107484, center: [43.27683208313458 55.61072233949417 69.41631104090466]
cid: 399, volume: 146.06031141972363, center: [43.37811231932315 63.89399677070743 43.019272883860644]
cid: 400, volume: 180.91816983888742, center: [44.096932743319 25.609329551841576 55.59017187853248]
cid: 401, volume: 260.18777835913085, center: [43.72462904943033 55.069298199860306 32.894507965116745]
cid: 402, volume: 119.11210607779807, center: [44.79745230429384 49.87082535562336 23.415543018439408]
cid: 403, volume: 117.69286854533958, center: [44.22824282350556 49.61070953166176 18.259389766058824]
cid: 404, volume: 259.8935461877675, center: [44.755548082043134 26.7150817926545 50.532573226278636]
cid: 405, volume: 200.8048030680926, center: [44.8663372770383 45.451736533037405 52.20793380822272]
cid: 406, volume: 124.25251518926365, center: [44.39989444618736 42.55281864734643 61.218346254492275]
cid: 407, volume: 189.0701317631308, center: [44.998363952858114 61.630846085234346 32.04503021254119]
cid: 408, volume: 289.50714884674926, center: [46.30433932540976 33.08061979886411 39.09749629231781]
cid: 409, volume: 149.76417522394462, center: [45.34355905822229 37.24402153462383 26.75175609090489]
cid: 410, volume: 319.93421692067676, center: [46.68534386753408 38.53322676977009 39.83796857191778]
cid: 411, volume: 207.53752745987748, center: [43.759445168844785 44.00672002504378 72.58907953292469]
cid: 412, volume: 249.45695799176167, center: [46.00532268882301 46.633033775667805 57.02786294089364]
cid: 413, volume: 154.09111892046445, center: [44.858405387692144 54.11756047568235 19.969032358497135]
cid: 414, volume: 407.9961750322485, center: [44.39808057336573 57.37377653318627 56.08891253888771]
cid: 415, volume: 139.48335700101347, center: [44.85538004062586 58.707605853108326 22.264228567713115]
cid: 416, volume: 230.95494674544284, center: [43.69140101857333 65.11920227520234 60.91311918077788]
cid: 417, volume: 280.3513359849133, center: [46.20749984692852 23.11732685769231 28.93091416153846]
cid: 418, volume: 144.19107174282706, center: [45.43400719760896 49.348676288404754 47.69374478671228]
cid: 419, volume: 214.58179179781177, center: [46.25018928867694 21.52642996195354 49.89616225404904]
cid: 420, volume: 131.60831947334736, center: [45.46793585952539 54.175161492845874 25.691664464676485]
cid: 421, volume: 151.39110605383607, center: [44.952847281998416 61.12292303771579 65.59025967911285]
cid: 422, volume: 106.02742833952209, center: [45.067745212625375 63.327085823947115 26.927963567042113]
cid: 423, volume: 242.7242335999768, center: [47.555039263573384 26.857652516521675 43.22724563663719]
cid: 424, volume: 255.39352474338688, center: [46.77466578864722 32.54743634985768 32.85296248662239]
cid: 425, volume: 130.7429307340434, center: [45.96746794704034 41.575056255281964 17.418657013185065]
cid: 426, volume: 218.94335104390376, center: [46.77586474339248 47.114893966387356 41.70123867730435]
cid: 427, volume: 124.52943958584092, center: [46.405553306045384 20.126870107546907 57.699020374023625]
cid: 428, volume: 76.63882675275936, center: [45.33503548736335 27.94105826897019 35.246742267276424]
cid: 429, volume: 95.85045676530743, center: [46.213781541405105 45.65591772432286 17.63595591836403]
cid: 430, volume: 123.21404870209888, center: [46.04102739608465 52.54253524955752 35.9337942899705]
cid: 431, volume: 182.97779503843088, center: [47.01961917930517 31.944229304795687 25.641132895119185]
cid: 432, volume: 236.89151349706805, center: [45.74305903274803 50.067107933871554 70.65367910452254]
cid: 433, volume: 174.46236984367982, center: [47.32909812542792 36.224918654583334 22.57790168020833]
cid: 434, volume: 169.39119183135858, center: [47.116712850725214 45.49693977737816 27.830108483130683]
cid: 435, volume: 180.83163096495704, center: [46.33705837616904 51.6265320505647 40.55310761189701]
cid: 436, volume: 40.91557959429158, center: [47.568860351973306 57.82381915913705 59.785396484771574]
cid: 437, volume: 302.6783654589557, center: [46.88229687257505 26.811439570814272 64.26227632735018]
cid: 438, volume: 184.2066470482425, center: [46.76448480036153 33.718382568758805 53.35840951059852]
cid: 439, volume: 172.99120898686309, center: [47.52946774732505 42.46964873891946 23.069839357938967]
cid: 440, volume: 209.75292263249563, center: [47.42797438062105 57.16171086020299 36.521784301435765]
cid: 441, volume: 187.9970497263939, center: [47.016424771862056 62.893030470861724 39.90906426139754]
cid: 442, volume: 310.4495563379053, center: [47.35348830700205 67.28113433545744 46.81368983820037]
cid: 443, volume: 129.04676880500762, center: [46.94047445824582 17.936373653151826 53.131074330539164]
cid: 444, volume: 139.4660492262274, center: [48.23869649683102 21.67443358049144 41.66934351880119]
cid: 445, volume: 532.1102280232235, center: [47.84671181335604 52.31833442083334 59.61352051318306]
cid: 446, volume: 147.3410867538935, center: [48.069247182442965 23.729225901961705 38.20438026759074]
cid: 447, volume: 152.8622669106528, center: [47.387661296843696 32.630098852445656 49.091161681691574]
cid: 448, volume: 284.6955874562192, center: [48.479662410485 40.08385331453584 56.91030075245303]
cid: 449, volume: 195.71631728098527, center: [48.093823785935804 44.019358331031135 37.33794776444994]
cid: 450, volume: 183.53164383158543, center: [48.07950965760135 22.260967554602036 45.443041143841945]
cid: 451, volume: 161.3257687810456, center: [47.492340514654046 26.249987979465725 58.24081572867718]
cid: 452, volume: 173.4931344556594, center: [48.85026318327256 58.58656125293296 29.576578422067037]
cid: 453, volume: 295.58217779666313, center: [47.543719291348694 32.624057948899164 67.93307369181403]
cid: 454, volume: 304.2360651897028, center: [48.00747111479919 34.183441442501994 59.30050842468995]
cid: 455, volume: 117.53709857226485, center: [47.98113623874453 37.83142181852452 18.256099911986453]
cid: 456, volume: 337.0342984093232, center: [48.563848771071896 38.260204038329995 64.58582531483593]
cid: 457, volume: 287.3263692237033, center: [48.849717850319344 38.630640781452925 46.764755659881935]
cid: 458, volume: 130.79485405840163, center: [50.006906615620586 29.526754629456132 26.647208143112348]
cid: 459, volume: 190.0047516015791, center: [49.237121479976594 41.52851708214612 32.92751032755511]
cid: 460, volume: 121.84673449399861, center: [48.46098745945256 50.73253924205966 30.14587177666193]
cid: 461, volume: 212.41831994955186, center: [48.743297278863416 54.4657622993889 43.44630986423857]
cid: 462, volume: 224.23953012844404, center: [48.31029220597459 61.19579737259185 61.912829759300706]
cid: 463, volume: 136.83526745874335, center: [49.556897166566586 27.233158220528715 30.200164728130535]
cid: 464, volume: 208.524070622684, center: [49.0482977152609 39.29035471207669 28.0412356312002]
cid: 465, volume: 89.98312111282654, center: [48.575874270646594 50.37978643283324 25.220261446682052]
cid: 466, volume: 510.838972811132, center: [49.76280961335357 52.47480114288666 50.8926440545858]
cid: 467, volume: 124.37366961276621, center: [49.18808466514306 65.28156695064013 31.196858226287222]
cid: 468, volume: 71.42918654214947, center: [48.95687623263973 16.005803881075842 28.161625134940635]
cid: 469, volume: 129.49677094944568, center: [49.86355897212971 28.052069975180434 36.23180428039294]
cid: 470, volume: 194.95477519039778, center: [48.42039057946957 49.78756208336293 64.67185349315518]
cid: 471, volume: 115.30439562486062, center: [49.759246206671975 62.114317159831884 26.60740758219754]
cid: 472, volume: 194.64323524424836, center: [49.574382986706745 13.689005733318513 31.754253212048727]
cid: 473, volume: 120.42749696154011, center: [48.947140494772654 37.77375212565392 51.127068485915494]
cid: 474, volume: 339.405463555016, center: [50.53013993893753 43.732534855073936 50.709357664956656]
cid: 475, volume: 174.32390764539122, center: [49.577854665824155 33.891558540458696 42.828127540329625]
cid: 476, volume: 153.4507312533795, center: [50.31567032418397 36.22685320310173 33.087958475874125]
cid: 477, volume: 161.9142331237723, center: [50.278137190290465 55.102364258257616 27.34473578549439]
cid: 478, volume: 184.06818484995387, center: [50.30640541302013 24.23799132042313 33.71732904767278]
cid: 479, volume: 182.77010174099792, center: [49.47566383276621 46.78422379590909 23.010584237812502]
cid: 480, volume: 146.00838809536538, center: [50.23815431217048 48.29334093111664 45.34501385807255]
cid: 481, volume: 216.67603254692736, center: [50.884182198426714 30.521810707093216 54.75614205770429]
cid: 482, volume: 173.44121113130115, center: [49.10920633049637 55.687288090998905 66.5036411169544]
cid: 483, volume: 183.27202720979423, center: [50.72115651692705 58.257292482689586 44.62749555519879]
cid: 484, volume: 153.0353446585136, center: [51.17757151437734 24.286568582978965 60.99341200287265]
cid: 485, volume: 239.17613976883052, center: [50.66902095521032 31.285275557406468 61.17656404465591]
cid: 486, volume: 110.68321975697744, center: [49.83355056283777 48.77638704450352 18.571076392165754]
cid: 487, volume: 139.32758702793876, center: [50.606867717077115 53.517464096086954 20.832137563826088]
cid: 488, volume: 117.53709857226485, center: [50.5306701619246 57.94760502351642 23.056687620291562]
cid: 489, volume: 229.34532369033747, center: [50.33583736530834 60.950235478288434 50.18734560332805]
cid: 490, volume: 226.00492315662413, center: [51.640691116750176 61.198444854403434 34.10610803895696]
cid: 491, volume: 61.21759941836266, center: [50.42494111055528 12.488327846988973 35.2672365336726]
cid: 492, volume: 235.8530470099033, center: [51.40906561832846 23.87347760513686 53.27167049310927]
cid: 493, volume: 207.27791083808629, center: [51.638084128540996 27.87738377790581 49.019446575150305]
cid: 494, volume: 243.48577569056428, center: [52.560261573594325 46.727385552381286 30.251508053738984]
cid: 495, volume: 150.61225618846248, center: [50.4538995947775 63.317182874706965 56.76029788183177]
cid: 496, volume: 126.98714360546418, center: [51.96614397158734 37.94866998457135 22.917100410985416]
cid: 497, volume: 130.2410052652471, center: [51.74762383340971 19.17970216660465 36.48863229767442]
cid: 498, volume: 183.7220293542323, center: [51.79057215831005 57.41857514526613 38.466945799331135]
cid: 499, volume: 121.58711787220743, center: [51.99500263572948 20.40698386735943 56.44488793093238]
cid: 500, volume: 288.62445233265925, center: [53.01293616792291 42.58808946496163 40.71898104144279]
cid: 501, volume: 68.76378922509325, center: [52.956613272445125 22.526581352907122 28.641587266498867]
cid: 502, volume: 124.23520741447757, center: [52.67202271172752 25.740562795151856 24.748652572694343]
cid: 503, volume: 97.54661869434321, center: [52.95922316130475 28.68707436871895 40.166551658623135]
cid: 504, volume: 130.76023850882947, center: [53.47376125679704 30.66543856582396 36.07764967886168]
cid: 505, volume: 167.55656770403417, center: [53.35749833740643 42.36261799023861 25.690931552711497]
cid: 506, volume: 129.68715647209257, center: [52.9343072215192 54.77882485904177 32.54065449721073]
cid: 507, volume: 315.8841976207342, center: [52.809783109313635 56.866551988614326 54.33990852234398]
cid: 508, volume: 216.13949152855892, center: [52.885014508979296 61.629538654708526 43.00099401776906]
cid: 509, volume: 121.34480902520231, center: [52.620529485684166 18.659732729952932 52.116840831964055]
cid: 510, volume: 182.11240629912692, center: [53.36665162403604 29.572688540790722 43.9459896551416]
cid: 511, volume: 92.31967070894724, center: [53.487365968005854 29.605304401968507 29.007587690157482]
cid: 512, volume: 156.42766851658516, center: [51.585218745799956 47.018785541624254 68.17758871082098]
cid: 513, volume: 79.68499511510932, center: [53.30227937296339 50.77626924422241 31.1263605464596]
cid: 514, volume: 194.53938859553188, center: [52.96443150895856 63.979200428300715 53.307076738265124]
cid: 515, volume: 184.8124191657553, center: [54.1308730092581 37.49030975225698 36.356945596778424]
cid: 516, volume: 134.79295003398596, center: [54.34042157716927 41.14136789965332 46.44059411640986]
cid: 517, volume: 110.51014200911665, center: [52.3110705822052 44.76766221993736 18.524574473375097]
cid: 518, volume: 154.81804546147978, center: [52.429805650870556 66.72287143589715 40.52324422910006]
cid: 519, volume: 138.2025816668436, center: [52.491429725920845 37.68783516056356 68.32970547659362]
cid: 520, volume: 297.4514174735597, center: [54.72510244345642 47.1654148314442 36.19543472745839]
cid: 521, volume: 110.02552431510642, center: [52.40692629924476 53.14165853237376 66.11013108112317]
cid: 522, volume: 156.51420739051557, center: [52.774941471490685 66.19925959898264 46.82314128713922]
cid: 523, volume: 102.86010555366957, center: [53.72563055423581 18.44153473745583 48.06324230459364]
cid: 524, volume: 187.37396983409502, center: [53.52625790916816 36.20020645629965 52.78358009406983]
cid: 525, volume: 37.74825680843906, center: [53.664717865890665 40.92704432998625 58.8870958823934]
cid: 526, volume: 288.0706035395047, center: [52.57379505980851 44.276903971106705 61.008250363320116]
cid: 527, volume: 107.74089804334395, center: [54.0950414873125 48.40190799306024 42.45355158125301]
cid: 528, volume: 120.94673020512249, center: [53.40839826580641 52.208924477790504 41.85367383825128]
cid: 529, volume: 200.07787652707728, center: [54.062546075468696 43.33614365403114 66.726213214827]
cid: 530, volume: 223.78952798400599, center: [54.819047182958634 51.5916104950348 36.54980202399072]
cid: 531, volume: 149.81609854830285, center: [54.508073173669494 34.64680514695009 46.439980328546675]
cid: 532, volume: 78.49075865486985, center: [53.47986698670834 35.397195497861084 19.387654467783904]
cid: 533, volume: 108.05243798949337, center: [53.69778812324995 40.62992970523787 18.955748927727058]
cid: 534, volume: 135.7794931967925, center: [54.009938990343436 51.338456229216064 26.108028551586997]
cid: 535, volume: 224.60299339895172, center: [54.0337373282756 58.20545831940356 60.84291207900901]
cid: 536, volume: 318.8092115595816, center: [54.923543487904304 50.62490235837134 56.82319432692182]
cid: 537, volume: 243.17423574441486, center: [54.8081791892577 33.57642453204982 26.917751348306048]
cid: 538, volume: 195.16246848783075, center: [55.1068015347814 65.4080562241043 36.148901335668675]
cid: 539, volume: 129.39292430072922, center: [55.328164681755375 26.899953575 30.7557625]
cid: 540, volume: 115.01016345349727, center: [54.38900687656496 63.5405801531377 30.261225077968398]
cid: 541, volume: 151.37379827905, center: [55.330040166311875 23.223013427109535 45.33775423922936]
cid: 542, volume: 121.63904119656567, center: [56.14149647268232 24.008497272011954 48.96544300697211]
cid: 543, volume: 183.42779718286894, center: [55.83297091039767 24.253974113936593 37.38976283560106]
cid: 544, volume: 122.98904762987985, center: [54.74312967100241 31.026289971193357 21.778884700942864]
cid: 545, volume: 171.46812480568812, center: [55.03795909976839 45.313137855395176 54.17575569036035]
cid: 546, volume: 110.56206533347488, center: [55.850367172056814 32.573055614981214 33.52399488606763]
cid: 547, volume: 232.35687650311525, center: [56.35489267876231 35.92490145890503 39.96434167255866]
cid: 548, volume: 145.52377040135516, center: [55.64723350142605 60.627584352723595 36.71137983211227]
cid: 549, volume: 106.04473611430817, center: [55.72812263880317 23.55808427631794 41.34093433220173]
cid: 550, volume: 168.6296497407711, center: [55.62263454314562 50.50282592882069 20.735273863132505]
cid: 551, volume: 120.77365245726169, center: [56.14325501844646 56.116773479363715 29.444658002020635]
cid: 552, volume: 137.85642617112202, center: [56.3122441847229 46.50094132338983 24.77233053291902]
cid: 553, volume: 111.09860635184334, center: [55.34025988099597 58.947462319302076 25.18289691559433]
cid: 554, volume: 144.173763968041, center: [56.233820631384695 48.604393569579834 47.81975164991597]
cid: 555, volume: 102.46202673358975, center: [55.59050598768615 55.207568103293916 22.89080825204392]
cid: 556, volume: 141.83721437192025, center: [55.902883979741944 23.896669162989628 58.60514549059182]
cid: 557, volume: 171.45081703090204, center: [56.257929167718046 39.182657179043005 31.00477385109025]
cid: 558, volume: 192.0124534767643, center: [56.06236688086855 20.63364493537047 33.527928784234724]
cid: 559, volume: 186.07588672513907, center: [55.78626773596484 27.620232914231234 56.208516855743646]
cid: 560, volume: 168.82003526341796, center: [57.74742655819817 40.60294291913061 40.48706913463195]
cid: 561, volume: 296.39564321160884, center: [58.446473464725045 42.05991224117956 33.61124248090511]
cid: 562, volume: 182.51048511920672, center: [56.463540814236325 43.865300738577524 47.28374225573258]
cid: 563, volume: 234.81458052273854, center: [57.484741167269426 59.136462762018134 46.76427201982015]
cid: 564, volume: 29.094369415399385, center: [57.63208251097405 29.72218299066032 42.11427272926829]
cid: 565, volume: 144.69299721162335, center: [56.939296480380534 30.430224461770337 51.76029800630383]
cid: 566, volume: 207.08752531543942, center: [56.37092222373443 29.739865372854158 62.722337385883826]
cid: 567, volume: 178.14892587311473, center: [56.22141165456562 35.025607862314196 65.22407223509181]
cid: 568, volume: 223.73760465964773, center: [55.95728035597082 36.77118725268044 60.36215218180552]
cid: 569, volume: 189.8489816285044, center: [57.705798133658995 39.029276430823224 25.045979761263563]
cid: 570, volume: 215.5683349606183, center: [57.03395277469933 39.80803421154556 54.34814307617824]
cid: 571, volume: 91.55812861835976, center: [57.54153690745784 42.82767439219282 27.13443941478261]
cid: 572, volume: 344.9612592613475, center: [57.49139874848661 52.425992329767695 47.45207812493603]
cid: 573, volume: 112.17168838858026, center: [56.92828425770831 18.492922067937045 45.28391575445148]
cid: 574, volume: 175.17198860990908, center: [57.345312685265014 31.82121741155024 47.53437562986859]
cid: 575, volume: 115.20054897614415, center: [57.136757029902576 45.09400016164363 20.118342842983775]
cid: 576, volume: 210.16830922736153, center: [56.04402047194107 50.419518453026434 63.325425770023884]
cid: 577, volume: 187.37396983409502, center: [57.743596285733844 54.927982923923885 40.87143226995197]
cid: 578, volume: 108.48513235914535, center: [57.295207857289725 58.72374425791321 57.365505728892785]
cid: 579, volume: 148.76032428635202, center: [58.714301809145404 31.565153761465968 37.89560967371728]
cid: 580, volume: 128.0775334169872, center: [57.218119770000676 33.058660676716215 57.25059580147297]
cid: 581, volume: 204.7336679445326, center: [59.91367259073699 35.689031595790006 28.594869259599292]
cid: 582, volume: 85.91579403809789, center: [58.42323533473993 46.27834970082594 41.711088896494765]
cid: 583, volume: 77.31382996941645, center: [57.323732141079695 23.461814442511752 28.081617428945602]
cid: 584, volume: 155.42381757899255, center: [59.146816348508516 27.753630500044544 33.30804295904232]
cid: 585, volume: 52.23486430438747, center: [57.78071243269232 41.13089801978131 19.66527993270378]
cid: 586, volume: 182.73548619142576, center: [59.19347619124246 56.843702342830085 32.75810796344952]
cid: 587, volume: 169.5469618044333, center: [58.15164582934446 64.65209211538382 43.81681403982238]
cid: 588, volume: 170.39504276895119, center: [58.74098893538009 35.927161240954796 50.294804731782634]
cid: 589, volume: 155.06035430848488, center: [58.355463763478454 36.3945826946869 20.701505752941177]
cid: 590, volume: 109.64475326981268, center: [58.833690599918796 20.24967660563536 49.90211366055249]
cid: 591, volume: 135.24295217842402, center: [58.81445957295413 50.60363435685949 27.520650051906834]
cid: 592, volume: 158.573832590059, center: [60.06107254788786 52.48566409237066 31.43075866270465]
cid: 593, volume: 203.2451993129298, center: [58.80155363174289 63.661136718598314 48.62627081641829]
cid: 594, volume: 123.2832798012432, center: [58.65406016926374 26.843005852225186 25.231753205812158]
cid: 595, volume: 149.98917629616363, center: [59.1708904178902 60.732542495961226 52.63098636276252]
cid: 596, volume: 153.32957682987694, center: [59.24323358960624 22.34588172231629 53.99613825387741]
cid: 597, volume: 132.7506326092286, center: [60.578191171937576 27.15231635581486 50.48251842754889]
cid: 598, volume: 180.7797076405988, center: [60.817416119447714 33.685903964145524 41.82978917267592]
cid: 599, volume: 169.25272963306995, center: [60.05587341585539 30.98691719634932 28.98964395547602]
cid: 600, volume: 162.64115966478764, center: [60.311816603275666 58.56842006903267 39.035267369447695]
cid: 601, volume: 128.85638328236075, center: [60.04284673358325 26.86529474732035 46.481326457689725]
cid: 602, volume: 97.33892539691026, center: [60.050480855359865 31.088205046514936 22.904697289864867]
cid: 603, volume: 260.3781638817777, center: [61.344712282925485 37.90306725514491 44.68294994347912]
cid: 604, volume: 175.8296840517801, center: [60.28121979696457 45.316425749128854 50.35875213260163]
cid: 605, volume: 223.16644809170714, center: [61.8850636940777 47.774134681596095 31.403036697231272]
cid: 606, volume: 213.5606330854331, center: [61.26969970580286 26.72603107400924 38.86405884237782]
cid: 607, volume: 239.85114298548763, center: [59.33116725648638 41.126240148297015 63.115188082262954]
cid: 608, volume: 250.08003788406052, center: [60.44529743280254 50.624996121510144 54.20234674326943]
cid: 609, volume: 139.43143367665525, center: [60.18568193194058 54.190759429766636 23.944182030610722]
cid: 610, volume: 124.71982510848778, center: [59.859865378332366 60.47992500441299 28.516736928684427]
cid: 611, volume: 236.54535800134647, center: [59.87632726197464 43.55920552953831 57.284850943594066]
cid: 612, volume: 101.14663584984771, center: [60.96495556500467 46.532679740092405 26.58391572376797]
cid: 613, volume: 203.79904810608434, center: [61.4733218858231 49.238649876968154 41.066504581859874]
cid: 614, volume: 113.53900259668053, center: [60.43699056616874 62.399281431951216 32.18713287754573]
cid: 615, volume: 97.37354094648242, center: [60.42056739426913 23.363848962211165 30.791711747671524]
cid: 616, volume: 193.4143832344367, center: [60.45506407948713 63.40115577806712 39.82376207167785]
cid: 617, volume: 141.04105673176062, center: [61.320430353512336 20.147617274622654 42.38497422885017]
cid: 618, volume: 141.30067335355182, center: [61.32087022201908 26.33152428546056 42.86502948123469]
cid: 619, volume: 91.6792830418623, center: [61.52033104054927 29.526878917198417 53.127975167868605]
cid: 620, volume: 76.15420905874913, center: [60.80156157442987 57.597868633295455 26.063104796113638]
cid: 621, volume: 208.97407276712207, center: [60.83888156177558 56.19443945650157 57.002935730279944]
cid: 622, volume: 240.37037622907, center: [60.779990666156905 48.64491955115927 60.68814075136088]
cid: 623, volume: 174.54890871761023, center: [62.1669204032902 34.31976281812593 32.755261317412]
cid: 624, volume: 152.6199580636477, center: [61.46732987007662 34.53719894438648 55.5074882484577]
cid: 625, volume: 153.69304010038462, center: [61.45843122411458 49.15220397996622 22.04463257216216]
cid: 626, volume: 258.69930972752803, center: [62.897211590383016 44.39697017385429 44.00475230235499]
cid: 627, volume: 152.36034144185652, center: [62.493462456954376 21.092184383698736 37.794251992264]
cid: 628, volume: 180.64124544231015, center: [61.664362881739144 27.397975641448692 57.688038802816905]
cid: 629, volume: 161.56807762805073, center: [62.34100317766581 40.69090322760579 49.416032509555436]
cid: 630, volume: 189.19128618663336, center: [63.15560432878035 41.9595178227884 28.937397415844845]
cid: 631, volume: 178.70277466626928, center: [62.867269541588946 45.0491898140339 37.71283789179661]
cid: 632, volume: 299.043732753879, center: [62.30007551148797 55.41068032955782 48.84229821849751]
cid: 633, volume: 136.6968052604547, center: [62.629302630958954 55.47309175745758 35.603755668156495]
cid: 634, volume: 162.22577306992173, center: [62.061050513264256 43.085827567438386 21.967814871844663]
cid: 635, volume: 135.05256665577716, center: [62.85966414241322 61.91384919865436 35.50527599288735]
cid: 636, volume: 119.19864495172848, center: [62.76835366720678 21.64449926994337 46.950736365398576]
cid: 637, volume: 119.40633824916142, center: [63.31430664968046 30.183083149050585 35.106081596999566]
cid: 638, volume: 159.97576234773143, center: [63.458414354265145 35.71250424427134 23.3560937967543]
cid: 639, volume: 141.9583687954228, center: [64.18076972738638 40.714316645135334 39.17291957724945]
cid: 640, volume: 56.59642355047947, center: [64.3121817744091 37.12452301779817 31.326913310000002]
cid: 641, volume: 151.25264385554743, center: [63.65116018807184 24.01828184081703 33.05234093680055]
cid: 642, volume: 102.80818222931133, center: [63.3949016668334 27.03662016010101 28.08254594409091]
cid: 643, volume: 192.89514999085435, center: [63.17372832453596 31.957119457927323 59.506148232462984]
cid: 644, volume: 169.9623483992992, center: [64.28683939221371 39.02841428214868 54.16678864017312]
cid: 645, volume: 233.3261118911357, center: [64.84068394653666 51.82846449006008 35.82515843679994]
cid: 646, volume: 231.64725773688602, center: [63.75897377943099 54.922608387866106 41.682066573953975]
cid: 647, volume: 175.5700674299889, center: [64.38533596410367 24.28706679194598 51.31099789326696]
cid: 648, volume: 205.73751888212522, center: [64.59860303308928 59.63730008068478 49.85603510386978]
cid: 649, volume: 171.10466153518044, center: [65.44604370080499 30.9302252491402 44.65004189056241]
cid: 650, volume: 249.43965021697556, center: [64.02779016799508 37.359473939633645 59.61851663790591]
cid: 651, volume: 174.96429531247614, center: [65.58425475495672 55.165008402087246 28.30280943338609]
cid: 652, volume: 100.31586266011591, center: [65.79327982042922 30.914922590942027 40.45390463695652]
cid: 653, volume: 114.17939026376547, center: [64.56898179556333 31.65867944333788 25.132728888722145]
cid: 654, volume: 96.3004589097455, center: [64.56775121012834 31.83650155918404 48.31863939694465]
cid: 655, volume: 126.24290928966278, center: [64.72014202156963 34.507399682533595 50.47413858915547]
cid: 656, volume: 167.83349210061144, center: [65.73180079598752 37.13008341829432 35.28379299219346]
cid: 657, volume: 121.55250232263526, center: [65.6801847930668 46.08901706322085 32.872904184707394]
cid: 658, volume: 121.93327336792902, center: [65.37990161787953 33.75480594234209 36.8278864433357]
cid: 659, volume: 108.74474898093655, center: [66.21077429536118 41.42356290816489 32.24572188941588]
cid: 660, volume: 220.70874407208385, center: [65.74320745816078 45.27262659899624 51.676170157104764]
cid: 661, volume: 376.84218041730566, center: [66.41954475507777 51.007725805589494 46.83001715541726]
cid: 662, volume: 167.4527210553177, center: [65.51431580545156 50.96925841575194 26.203293282263566]
cid: 663, volume: 118.95633610472336, center: [65.15585616750423 40.35375893849847 23.725489331994766]
cid: 664, volume: 178.1835414226869, center: [65.54065905909141 43.54779543791161 58.85422003503643]
cid: 665, volume: 160.0623012216618, center: [65.91733952593327 58.87969567032872 32.03741162150735]
cid: 666, volume: 209.63176820899307, center: [65.75359794969381 60.56249443731836 43.28413611055978]
cid: 667, volume: 148.81224761071024, center: [66.67092395903244 29.593372199999997 29.452854549999998]
cid: 668, volume: 127.21214467768321, center: [66.16578545184083 45.83537667342857 24.823036458]
cid: 669, volume: 146.97762348338583, center: [66.43709771393992 23.355414372739048 42.04847581762836]
cid: 670, volume: 85.25809859622687, center: [65.56602853676644 48.657594678989035 57.152343363581]
cid: 671, volume: 74.57920155321591, center: [66.1365490998625 24.94296960083546 46.20758151171966]
cid: 672, volume: 116.08324549023419, center: [66.28677409054796 28.861938757402715 53.66868581021321]
cid: 673, volume: 130.60446853575476, center: [67.51796521155215 35.81480310166976 46.05525519378479]
cid: 674, volume: 182.97779503843088, center: [65.79890156008001 54.107782157661745 54.650708324772985]
cid: 675, volume: 90.88312540170266, center: [66.6624256249006 24.547778191525424 36.075896440677965]
cid: 676, volume: 171.20850818389692, center: [68.09799670020834 36.10145197842701 40.79201065244642]
cid: 677, volume: 115.97939884151772, center: [68.61959183892401 39.04640893475601 44.245327887927175]
cid: 678, volume: 139.6910502984464, center: [68.24603538410537 39.205216700867304 50.08258527762359]
cid: 679, volume: 209.5279215602766, center: [68.33137846971857 43.91805704757145 46.83321090069387]
cid: 680, volume: 87.81964926456662, center: [68.55954736340853 49.76844630130075 40.452486782045725]
cid: 681, volume: 144.10453286889665, center: [67.7342755482404 59.26979392905356 38.7149990668148]
cid: 682, volume: 126.74483475845908, center: [68.43616423308612 47.63514787177386 36.57528657070873]
cid: 683, volume: 118.74864280729041, center: [68.05653125666254 38.383406142719714 26.599807103935287]
cid: 684, volume: 175.2585274838395, center: [69.03547292756568 41.404004140292315 35.91504391214695]
cid: 685, volume: 182.82202506535617, center: [68.62043297750918 33.56403653081511 54.22302746461233]
cid: 686, volume: 161.29115323147346, center: [68.65182396139956 27.629161862324285 35.47453903697822]
cid: 687, volume: 135.90064762029505, center: [69.06072136634508 34.939815295606216 28.359924507463067]
cid: 688, volume: 94.98506802600346, center: [69.19408990794278 26.75334213864796 46.348832827040816]
cid: 689, volume: 137.33719292753963, center: [68.92457680047077 28.980577269754253 50.346949726956524]
cid: 690, volume: 74.0945838592057, center: [69.2266333143396 30.133525380588647 32.576694579467414]
cid: 691, volume: 178.97969906284655, center: [69.89624665264412 46.08164516037134 41.50008470713664]
cid: 692, volume: 234.65881054966383, center: [69.2258082276495 48.28249144856911 53.76721082086591]
cid: 693, volume: 119.99480259188813, center: [69.56496321055661 50.0942102301601 30.492143082604933]
cid: 694, volume: 127.12560580375282, center: [69.5390153172329 26.812269334145675 41.516757575085094]
cid: 695, volume: 134.13525459211496, center: [70.4364347836541 41.790486529896775 40.11699538505806]
cid: 696, volume: 125.0486728294233, center: [69.46335179658274 43.49262360955017 26.930158641550175]
cid: 697, volume: 78.92345302452183, center: [69.49197335161355 47.73541259098685 28.405535684934208]
cid: 698, volume: 96.49084443239236, center: [69.33430442175525 54.272605127999995 31.818891576860985]
cid: 699, volume: 120.94673020512249, center: [69.45526377091645 41.48761454192902 55.85150384356039]
cid: 700, volume: 99.91778384003608, center: [69.77749557405578 56.89939871292222 35.94110410252902]
cid: 701, volume: 81.22538707107039, center: [70.51361438618552 32.684167607905394 31.594708670551885]
cid: 702, volume: 194.53938859553188, center: [70.3420147520402 53.84289893487545 50.02752178614769]
cid: 703, volume: 228.808782671969, center: [70.74544381955002 56.24211522036309 44.75317803946294]
cid: 704, volume: 113.45246372275014, center: [71.25109898975829 38.61393096457666 53.88419571812357]
cid: 705, volume: 199.10864113905683, center: [71.6224746416679 39.253846500260785 30.39520785383345]
cid: 706, volume: 153.50265457773776, center: [71.1945974907296 30.834520835990528 37.06211127513812]
cid: 707, volume: 96.0408422879543, center: [71.56775417175976 52.27056483492522 33.68885373162732]
cid: 708, volume: 242.98385022176797, center: [72.14380773444259 53.5727131045801 39.64452806023221]
cid: 709, volume: 72.415729704956, center: [71.24572796395009 30.842945754206504 47.65169442347036]
cid: 710, volume: 132.837171483159, center: [72.12119057516837 35.001852499153095 50.08423354952443]
cid: 711, volume: 167.2104122083126, center: [72.50027379638748 44.225724700020706 31.671256213352656]
cid: 712, volume: 147.47954895218214, center: [72.66400915720953 35.34288400931816 35.03117795358526]
cid: 713, volume: 121.9505811427151, center: [72.43654616129548 31.32318313330968 44.49835979416691]
cid: 714, volume: 113.41784817317797, center: [72.67541287546305 44.210779872653745 51.41053448528918]
cid: 715, volume: 131.34870285155617, center: [72.70123458863449 31.809771349769402 40.25444331433654]
cid: 716, volume: 109.5409066210962, center: [73.54002642060516 47.73371772717649 33.533052124427236]
cid: 717, volume: 173.9085210505253, center: [73.44896201682323 47.61804848915207 47.682046728373805]
cid: 718, volume: 76.13690128396306, center: [73.98233478228882 35.783765530870646 46.64969179115708]
cid: 719, volume: 120.27172698846539, center: [74.08903133516031 50.17604922131242 44.15060045465535]
cid: 720, volume: 156.2199752191522, center: [74.66168251368305 49.397534473687124 37.50130814282074]
cid: 721, volume: 33.73285305806865, center: [74.55965241628601 38.00927168250385 34.785445185838896]
cid: 722, volume: 152.98342133415537, center: [74.18894224553708 41.07296403553569 48.83142254411133]
cid: 723, volume: 70.44264337934295, center: [74.72067584574228 41.02429408017199 34.23798763842752]
cid: 724, volume: 109.64475326981268, center: [74.57019285240766 35.92066217138122 42.36700222077348]
cid: 725, volume: 124.7890562076321, center: [74.79756788724472 37.82276895145631 38.680263351844665]
cid: 726, volume: 191.52783578275407, center: [74.89083088440643 41.09429538483644 44.593723496855226]
cid: 727, volume: 98.27354523535854, center: [75.60807427720805 46.47749265523071 42.12069351636139]
cid: 728, volume: 132.0929371673576, center: [75.50923035819409 43.711958186595915 37.03525085243711]
cid: 729, volume: 78.42152755572553, center: [76.0596119830822 41.89218901026263 40.95771800843081]
cid: 730, volume: 122.55635326022787, center: [1.890957148479126 14.780904307287107 75.05605582912017]
cid: 731, volume: 107.37743477283628, center: [1.38416049729329 48.11996912098646 71.90461437287235]
cid: 732, volume: 169.01042078606486, center: [6.13985594237323 16.905920737634407 71.1431830316129]
cid: 733, volume: 1548.7343034079522, center: [8.66072844099402 64.01465744167542 29.470678764361548]
cid: 734, volume: 389.2172393893524, center: [11.15229428201597 47.29414622110459 13.69507312354589]
cid: 735, volume: 266.98973385006, center: [16.4010581331718 69.29830788028005 45.45983692224815]
cid: 736, volume: 411.4404222146783, center: [20.731536273163638 65.79053604249117 61.960775690194346]
cid: 737, volume: 412.4442731522709, center: [24.005656335117283 66.7916540672052 34.73971405241293]
cid: 738, volume: 281.38980247207803, center: [22.094626144659845 40.59319382426498 16.194465952220444]
cid: 739, volume: 233.6722673868573, center: [36.612655958486094 48.32945986283239 18.470807456484707]
cid: 740, volume: 179.41239343249853, center: [36.40951872314023 62.14850573427552 26.681152563756513]
cid: 741, volume: 130.05061974260022, center: [38.14193728149629 65.53790868848816 31.170667415597553]
cid: 742, volume: 76.95036669890878, center: [42.87621799177903 66.16332128434549 31.586500157692306]
cid: 743, volume: 83.1465500723252, center: [43.30628066546029 17.92906862997502 41.82795202181516]
cid: 744, volume: 195.73362505577137, center: [44.145247928407116 26.54994533657264 24.634511916438235]
cid: 745, volume: 176.79891943980056, center: [43.63369816077806 67.78799055133626 38.48457254129222]
cid: 746, volume: 190.3335993225146, center: [41.777337819685776 16.824094905601527 49.761349153405476]
cid: 747, volume: 167.74695322668106, center: [47.26503994729566 33.13082811432109 19.939844113124227]
cid: 748, volume: 195.4567006591941, center: [44.75967407582491 19.692462685486582 24.119386809935357]
cid: 749, volume: 152.6372658384338, center: [48.124571173904826 17.07610377094909 46.35520772177118]
cid: 750, volume: 152.23918701835396, center: [47.452215031555426 66.70246432595498 35.62160172970668]
cid: 751, volume: 54.48487502657779, center: [50.61273952969368 29.00400430482846 21.92732945393901]
cid: 752, volume: 54.20795063000052, center: [55.386993375757285 61.23514363515326 27.215894936302682]
cid: 753, volume: 173.21621005908213, center: [2.5045369200838765 15.020723697721824 59.205443289328535]
cid: 754, volume: 426.1693385576318, center: [3.641400925087502 54.87217762002599 12.634619195678837]
cid: 755, volume: 294.56101908428445, center: [2.989387244767339 58.613554727057995 18.62533217170809]
cid: 756, volume: 24.73281016930739, center: [7.430698753117934 12.452394953114066 72.58917847284815]
cid: 757, volume: 551.1487802879108, center: [12.073779981732564 63.74456538545095 61.34788426610979]
cid: 758, volume: 78.99268412366615, center: [13.141888801119912 43.551812045705525 13.687673794325153]
cid: 759, volume: 170.62004384117023, center: [11.172976895441833 69.18656750922094 44.183528605173464]
cid: 760, volume: 122.62558435937218, center: [17.583526519415813 43.654478621157374 18.74774998962597]
cid: 761, volume: 59.400283065824325, center: [17.12722480251683 34.37207992211538 70.97114092666085]
cid: 762, volume: 240.47422287778647, center: [18.951011175177605 39.735537504260826 72.16105970937815]
cid: 763, volume: 342.1573997460026, center: [23.17741656822983 63.06410919431433 29.62904049891244]
cid: 764, volume: 212.38370439997968, center: [28.03654155759004 55.94663323639475 23.04365871340559]
cid: 765, volume: 129.49677094944568, center: [29.78263269084436 44.06853871639936 19.999305043384123]
cid: 766, volume: 316.4726619634609, center: [39.66955668116584 24.13189828447908 21.139830044823626]
cid: 767, volume: 138.7910460095703, center: [47.13174774241155 18.32801161851852 39.52718026790123]
cid: 768, volume: 139.3102792531527, center: [1.3799317383696958 13.804323471487141 69.15378428803578]
cid: 769, volume: 64.47146107814558, center: [1.073572329257636 13.597522453932886 80.15971615916779]
cid: 770, volume: 64.50607662771773, center: [1.440199951546728 18.52646194837671 69.81773013469278]
cid: 771, volume: 102.06394791350992, center: [1.3894036604345061 23.67020972589452 80.09447092669153]
cid: 772, volume: 22.58664609583355, center: [0.7499247491372453 36.45658338482758 78.69516661034483]
cid: 773, volume: 471.9484028668117, center: [2.6297653803829624 66.68834100203534 49.28782049144052]
cid: 774, volume: 64.93877099736972, center: [0.9542717273301771 61.62407003955224 57.191207520895524]
cid: 775, volume: 17.49816030872622, center: [0.6777935571759117 67.47059256706231 44.57596020593471]
cid: 776, volume: 23.10587933941593, center: [4.242639063860308 12.31726552 72.18006670000001]
cid: 777, volume: 153.1911146315883, center: [6.176060795978913 53.66119058860016 18.77178356305502]
cid: 778, volume: 472.13878838945857, center: [11.267500807303763 58.69657245342571 68.12967631454966]
cid: 779, volume: 159.23152803193, center: [10.385455436105708 22.505503407586957 72.61030195969566]
cid: 780, volume: 283.3109654733329, center: [15.762589691197496 67.38415018630948 38.25367871632354]
cid: 781, volume: 62.307989229885656, center: [17.092827634826502 47.309828893833334 10.97937337175]
cid: 782, volume: 278.326326334942, center: [14.680766651318818 49.7669700928114 21.41958734353585]
cid: 783, volume: 319.70921584845775, center: [20.915782574791624 58.439142892415546 24.916632073197274]
cid: 784, volume: 128.45830446228092, center: [17.825438440984758 29.462021312570734 69.72058064971706]
cid: 785, volume: 151.28725940511958, center: [20.95905339072424 27.141722237215422 68.41660281721771]
cid: 786, volume: 136.64488193609645, center: [30.237605026103953 64.1680227777454 29.84414747069031]
cid: 787, volume: 157.01613285931185, center: [27.381933246197764 34.96385523564815 14.276674819212962]
cid: 788, volume: 86.71195167825753, center: [30.81367868985297 35.346039485928145 12.149755027904192]
cid: 789, volume: 76.72536562668975, center: [34.20444271196594 43.281572571418906 18.689213864786826]
cid: 790, volume: 209.42407491156013, center: [35.637329946218365 53.25260214689256 19.98242548631405]
cid: 791, volume: 112.06784173986378, center: [40.78710774542823 61.99803825989189 25.75770342681081]
cid: 792, volume: 77.88498653735707, center: [2.643786115792886 65.85424860046666 58.04207169506667]
cid: 793, volume: 166.6911789647302, center: [2.046675684716319 64.12344642241719 22.304310429986504]
cid: 794, volume: 354.87861421377096, center: [2.947468065146706 41.0410029152897 72.79403796815257]
cid: 795, volume: 516.1697674452445, center: [7.3730382832695165 57.84913077412735 23.53964174939141]
cid: 796, volume: 35.68863160889562, center: [12.390017798783896 44.46082696076625 18.44517160489816]
cid: 797, volume: 196.99709261515514, center: [6.3682736749828655 14.133264434686348 81.47691832675277]
cid: 798, volume: 165.2546336574856, center: [4.322280924561102 34.21583019479472 81.7997913925953]
cid: 799, volume: 580.433535225957, center: [8.683783546084253 27.333838909691078 80.65490307618678]
cid: 800, volume: 127.61022349776304, center: [25.210629425540365 29.78350820885664 69.86412512022244]
cid: 801, volume: 189.0009006639865, center: [14.998798988994201 14.810381283076923 81.35720124903845]
cid: 802, volume: 214.4779451490953, center: [22.857738925373443 34.50654739619109 71.6690672260168]
cid: 803, volume: 124.73713288327387, center: [34.06269362617337 27.047438916248094 21.09536127360899]
cid: 804, volume: 22.2924139244702, center: [38.404585239015 30.82908926576087 11.820392551630436]
cid: 805, volume: 197.72401915617047, center: [40.18647051765503 38.33023724503676 18.680349078860296]
cid: 806, volume: 13.015446639131671, center: [40.91191845134028 25.525190733111703 17.182642801196806]
cid: 807, volume: 52.80602087232809, center: [43.02211272747731 12.568413945427729 43.03528519537856]
cid: 808, volume: 267.16281159792084, center: [45.49586109064024 13.942534707858254 38.39269131497149]
cid: 809, volume: 80.08307393518915, center: [51.78485240212841 17.454123406656578 43.32007409818457]
cid: 810, volume: 140.93721008304414, center: [56.2614123826481 18.80312933287486 39.99782879347906]
cid: 811, volume: 11.042360313518625, center: [0.5268181022465956 28.786440238401255 82.34652293416927]
cid: 812, volume: 95.76391789137703, center: [1.247809117021742 56.55046592092897 66.8759909833002]
cid: 813, volume: 553.2084054874542, center: [4.249945862764359 61.64412772650877 62.58045631522385]
cid: 814, volume: 11.059668088304704, center: [3.762383945393051 57.89730726056339 68.89081703098591]
cid: 815, volume: 81.17346374671214, center: [9.430640666630767 53.4220323219403 17.725511038208957]
cid: 816, volume: 43.459822487845244, center: [7.97720172104283 20.134328663321384 82.45040012807647]
cid: 817, volume: 167.24502775788474, center: [12.792247895646838 49.380825731791376 17.759806398044088]
cid: 818, volume: 33.680929733710414, center: [17.11040180136507 60.073643006115105 27.74741766151079]
cid: 819, volume: 279.9705649396195, center: [21.545437279886556 51.78740646798961 22.578077106658014]
cid: 820, volume: 110.75245085612175, center: [17.633221010884796 21.82550905485232 81.8673396477731]
cid: 821, volume: 247.67425718879548, center: [27.426950764191513 49.87361657062893 20.541411351677148]
cid: 822, volume: 28.921291667538593, center: [18.41649692641936 17.335873149012567 82.22518753859964]
cid: 823, volume: 166.6219478655859, center: [37.45581198682135 57.21945319105641 21.75307874512309]
cid: 824, volume: 53.87910290906501, center: [31.85256005077775 39.33075154895599 20.475526605525218]
cid: 825, volume: 58.37912435344565, center: [30.694837630270793 31.144558086688406 13.97412662179069]
cid: 826, volume: 73.19457957032957, center: [35.03806794394523 37.59017817623552 19.88790083494916]
cid: 827, volume: 284.5571252579306, center: [36.92352585626812 31.856883962131256 22.411498086193053]
cid: 828, volume: 116.08324549023419, center: [34.403522661452065 32.10869572418369 12.71325021523781]
cid: 829, volume: 92.61390288031059, center: [44.07060099101737 30.33500317075313 21.71866923324612]
cid: 830, volume: 22.67318496976395, center: [14.695359183913611 45.285983994732824 17.015645792290076]
cid: 831, volume: 244.19539445679354, center: [37.04448383699934 28.252604772910907 16.141986299170743]
cid: 832, volume: 266.1589606603282, center: [30.237831810611965 60.60206928560281 25.41191643681233]
cid: 833, volume: 133.37371250152745, center: [13.086718848014087 21.263281110615104 79.99849351927071]
cid: 834, volume: 150.33533179188524, center: [32.51260667269463 32.58170530461663 17.966718345245223]
cid: 835, volume: 213.3010164636419, center: [15.58132282860562 57.92708497334469 24.07448082426972]
cid: 836, volume: 119.49287712309183, center: [39.4304149069465 44.078682521002314 17.35410220089803]