cid: 2, volume: 223.13506909661456, center: [4.804775864989532 8.029083110524905 25.339977893132435]
cid: 3, volume: 306.9379207648414, center: [6.25408959757933 12.340305350451798 21.046629474913864]
cid: 4, volume: 649.2526167696271, center: [6.039995393187418 14.647497653787763 27.186828569501213]
cid: 5, volume: 298.2383866392826, center: [5.179084697720649 17.945835623884392 15.164831909219242]
cid: 6, volume: 724.3160281924532, center: [6.85587216521817 14.997141212870169 62.151291420558664]
cid: 7, volume: 509.10232388447827, center: [5.484144936618969 17.537450168477363 39.111640579094654]
cid: 8, volume: 1014.7926745224644, center: [10.165555749820205 19.492210266129888 24.55807123504984]
cid: 9, volume: 36.53405271536271, center: [1.6147399342759845 18.418968766630258 52.39081347968324]
cid: 10, volume: 275.17264937059923, center: [3.177397514880974 19.611159465325212 58.01506095464433]
cid: 11, volume: 260.0681830103974, center: [6.13773563050751 19.968492748066595 33.97242521906552]
cid: 12, volume: 237.46136611989715, center: [2.906086029927085 22.829852793269474 37.46747714650869]
cid: 13, volume: 188.6362284931945, center: [2.3345168677278676 23.898933682123968 26.77616921154009]
cid: 14, volume: 148.27118827299856, center: [1.6985840513250812 23.483706523778764 52.828157828784825]
cid: 15, volume: 149.30874738889088, center: [4.559069015379733 26.6304772212348 47.68575024611787]
cid: 16, volume: 98.14910175143048, center: [2.731070200246474 27.159002853628788 30.018535883980487]
cid: 17, volume: 140.70897856293712, center: [2.3974748533855963 27.75134768478446 7.038262813953488]
cid: 18, volume: 338.8428635785307, center: [3.4597664353971425 27.48746186735367 42.16374797126958]
cid: 19, volume: 454.8499539592619, center: [4.737950165017908 30.106625016301106 35.74128699518775]
cid: 20, volume: 80.09158252291968, center: [1.741044773650698 29.138172500672646 51.849814669207774]
cid: 21, volume: 142.18550499709158, center: [2.6074510533526474 30.81055884341847 3.0787782589390966]
cid: 22, volume: 37.79109549038612, center: [1.6045010077715771 29.082072218585008 46.270134049260825]
cid: 23, volume: 118.60098817046203, center: [1.9613635852894924 34.0013212871467 7.255319019851951]
cid: 24, volume: 295.80411332891987, center: [3.2045629156950968 36.55854428082293 34.79785491729511]
cid: 25, volume: 85.17961280277632, center: [2.4251414176413344 35.239763706324666 1.6559016898102599]
cid: 26, volume: 351.2137607295546, center: [2.319769378456581 35.31609952899671 63.19081289127372]
cid: 27, volume: 97.19135487522216, center: [1.7118041453720494 34.99283542412236 43.708369960562514]
cid: 28, volume: 38.03053220943819, center: [1.0968882855266044 37.369271096694646 47.65970033405036]
cid: 29, volume: 164.3932606891717, center: [3.1011789103776115 38.834041280798644 4.451323029991504]
cid: 30, volume: 63.35096524919531, center: [1.5320399972259124 39.372612069165356 13.918183105984252]
cid: 31, volume: 316.2959058677934, center: [5.855502340673595 39.14939134316805 21.37990539403861]
cid: 32, volume: 217.3486817195227, center: [2.3303543607973793 39.74348668152024 26.123269183227762]
cid: 33, volume: 108.42492761074877, center: [2.721323676880443 41.42561122574531 1.0495750591645197]
cid: 34, volume: 10.994136016474526, center: [0.6875812607284908 40.79876224954628 17.903625542831218]
cid: 35, volume: 184.6256634490722, center: [2.1144615976323258 42.21292208928996 37.50994524977845]
cid: 36, volume: 215.4730940869481, center: [2.9314083809930493 44.60031837699787 20.369165865570885]
cid: 37, volume: 249.31348371297494, center: [1.7456892918605458 44.9934459907563 61.78475306285714]
cid: 38, volume: 5.806340437012862, center: [0.4702952983368102 45.88689222989691 30.144881986597937]
cid: 39, volume: 83.82280472814787, center: [1.4811273829461662 46.86761613377767 4.551795833587241]
cid: 40, volume: 814.9228732937434, center: [5.649894940623571 48.59637284564419 24.566263313669754]
cid: 41, volume: 704.981513128998, center: [8.125332443117879 48.205771946314954 50.38386184157987]
cid: 42, volume: 318.33111797973606, center: [3.112860086897074 50.79167500176758 39.43265133264385]
cid: 43, volume: 405.1867878158769, center: [4.058950167341933 54.007250617063086 64.22417769906929]
cid: 44, volume: 301.39097010680166, center: [3.855086814820314 54.116089492552135 52.20753564943396]
cid: 45, volume: 172.4542968972583, center: [4.199406764426277 29.833117715480736 55.606862427108645]
cid: 46, volume: 123.60920621063464, center: [4.477495181913318 29.905048691525426 50.27188616677966]
cid: 47, volume: 241.65150870330848, center: [5.147532921862433 33.795163060787715 21.873391618999257]
cid: 48, volume: 101.92023007650069, center: [1.1137389769201003 50.212922348140175 56.85120072685982]
cid: 49, volume: 1269.333859934743, center: [8.023694540739381 8.144057009947183 33.3336529934419]
cid: 50, volume: 258.970764714742, center: [2.728495364216911 31.34454906622236 27.0183444682333]
cid: 51, volume: 245.26301254901065, center: [3.2408461454152366 35.19772807892939 55.35097810780182]
cid: 52, volume: 25.619728938572216, center: [1.3973114381716116 48.49767255514019 30.694848281542058]
cid: 53, volume: 120.19723296414254, center: [4.077361163505077 24.40837784885458 31.671070126095618]
cid: 54, volume: 197.63505851756838, center: [4.42240404137236 40.860475311095406 44.2667136780212]
cid: 55, volume: 145.81696190271475, center: [4.929885360293944 42.04462436954024 48.1175111862069]
cid: 56, volume: 486.1962110951629, center: [4.454389367928891 20.581284290950876 46.799117773340996]
cid: 57, volume: 18.436627367009912, center: [2.022698689578237 38.39675299090909 30.61670613409091]
cid: 58, volume: 281.6374407850053, center: [2.925327122825631 53.688287246992566 45.96450828284803]
cid: 59, volume: 1049.3513743056476, center: [6.855037833683617 62.358315599241315 48.91990504388393]
cid: 60, volume: 384.9344319960554, center: [5.690391941670456 41.24931134597242 52.120808638388965]
cid: 61, volume: 669.4850195295277, center: [6.619741019075861 46.84639571379311 34.94133351803713]
cid: 62, volume: 233.75009697458995, center: [2.3916748113271873 29.97932732087068 17.998890193956466]
cid: 63, volume: 103.5164748701812, center: [7.079148897966336 38.88297562361218 48.03268846809946]
cid: 64, volume: 922.5097723878098, center: [8.266997546504253 50.02252605867544 57.52633595724358]
cid: 65, volume: 808.0989268007592, center: [5.273046827458978 54.9090960037926 32.72739427284444]
cid: 66, volume: 243.10808207754195, center: [7.137638756360757 29.19293353505417 21.678392573736044]
cid: 67, volume: 131.6303362988792, center: [7.0326992891547775 36.69377524588449 44.79786713055935]
cid: 68, volume: 24.362686163548812, center: [5.817718934209419 48.78105368353808 29.862020821130223]
cid: 69, volume: 77.37796637366282, center: [3.317435254159667 34.47953586552347 39.48946087472924]
cid: 70, volume: 92.78172863267976, center: [7.78938644352223 19.01743702329032 52.82552918503226]
cid: 71, volume: 50.600959959672224, center: [5.676883453128211 25.545967872752364 26.35694930347003]
cid: 72, volume: 149.62799634762698, center: [4.688033456646969 34.361483176730225 50.47911058559808]
cid: 73, volume: 18.875594685272052, center: [6.110164885819463 43.0259820846723 59.88129087906977]
cid: 74, volume: 512.3546726516023, center: [7.049335306932145 64.08896365728639 40.980349962372465]
cid: 75, volume: 568.6023485689193, center: [4.032257588775111 9.620387525276344 32.864837538319826]
cid: 76, volume: 568.3828649097883, center: [4.656638444322987 26.91816937891245 61.04624050941164]
cid: 77, volume: 373.2219858224247, center: [4.57918913428098 57.59724537140337 40.3585917069607]
cid: 78, volume: 261.6444747441569, center: [8.581989731368834 32.950629719469234 46.76566164644246]
cid: 79, volume: 583.3277067906221, center: [6.648924918253409 46.727839729256026 43.548289315166755]
cid: 80, volume: 417.1985298883228, center: [9.810092569988884 55.92239557974556 47.18569691540007]
cid: 81, volume: 36.095085397100576, center: [5.673960688889377 24.478770736650084 23.020597703316753]
cid: 82, volume: 165.19138308601197, center: [8.148927100007135 33.73406180640174 42.276112338748646]
cid: 83, volume: 470.6128712968569, center: [7.664068137639758 42.50871637838972 28.6598236181506]
cid: 84, volume: 717.132926620891, center: [8.425688905801646 20.244811256041846 18.27107141128238]
cid: 85, volume: 632.3523750165348, center: [8.761389090122009 39.696329492436575 56.967751250444906]
cid: 86, volume: 33.6807651466588, center: [7.297315373714562 36.89707365177725 0.6895611280805687]
cid: 87, volume: 27.41550433146279, center: [7.615254155558956 39.45936302336245 3.283130968777293]
cid: 88, volume: 286.36631598628384, center: [9.383816117481054 9.028641212061038 39.406781612897156]
cid: 89, volume: 295.48486437018374, center: [4.435985971129981 29.240331944911876 11.661365273711931]
cid: 90, volume: 110.0610785242713, center: [7.623900589173 30.870881136548224 2.448807509390863]
cid: 91, volume: 83.98242920751593, center: [9.927207902287673 36.495262513542414 40.53507652872417]
cid: 92, volume: 28.652594046565188, center: [7.556101224436367 36.02898046483287 31.40876613029248]
cid: 93, volume: 12.510568570471012, center: [7.3471268746676355 37.52278891722488 4.888389471770335]
cid: 94, volume: 268.76771713595616, center: [7.307495173265644 39.81235894734967 41.13008316131403]
cid: 95, volume: 178.16087203466614, center: [10.19687078508349 34.94673060561093 2.5557763474297235]
cid: 96, volume: 278.1057491789872, center: [7.4523112569089145 35.3677642141412 27.672281555510118]
cid: 97, volume: 134.28409326837306, center: [7.721674245198344 39.93450293322437 31.350286881441306]
cid: 98, volume: 378.76893648046445, center: [7.240239361571532 45.74894420326608 2.1401807744139494]
cid: 99, volume: 233.82990921427398, center: [11.417549645597 23.516113092456695 41.29048846140455]
cid: 100, volume: 343.7912224389402, center: [9.613653121216146 26.52254344598375 31.551983916163667]
cid: 101, volume: 336.26891884872083, center: [11.452113490526658 32.09044024012342 30.324268088743842]
cid: 102, volume: 80.51059678126082, center: [8.47557922701332 36.163908122453535 48.22498264825279]
cid: 103, volume: 216.1315450643413, center: [10.619940845672362 41.74665371349705 36.88144683816469]
cid: 104, volume: 260.18790136992345, center: [12.413341216825724 24.496437478458592 26.98698862125]
cid: 105, volume: 1343.2799000019927, center: [13.414060638767792 24.606877804130892 13.49197255780874]
cid: 106, volume: 492.0424576520178, center: [12.467476215511866 26.007959451824817 20.814285095656935]
cid: 107, volume: 82.24651299438837, center: [9.704846748488233 53.03716182037846 38.79037855]
cid: 108, volume: 190.252426346796, center: [10.780305134222287 6.328233457378081 29.318580078720505]
cid: 109, volume: 450.06121957822035, center: [8.692576970021072 24.47393754060117 53.36268628361412]
cid: 110, volume: 43.63734204724099, center: [10.514973545724109 39.23767652633745 0.7540078412894377]
cid: 111, volume: 311.06820416848973, center: [12.730437881154966 15.310312919326492 29.244740484881333]
cid: 112, volume: 228.94140953362742, center: [11.842074730583883 24.728101578804253 37.72635827800244]
cid: 113, volume: 628.2819507926495, center: [11.184334193804542 39.59870139724657 63.73813584133956]
cid: 114, volume: 288.60105869743654, center: [13.253775958659896 58.83056521673811 41.147419085985895]
cid: 115, volume: 332.03887014546746, center: [12.095127715081752 35.20903405640887 35.45674369709754]
cid: 116, volume: 758.7749626760314, center: [11.590219661495663 47.42874449592931 63.68463506549385]
cid: 117, volume: 687.4627265183544, center: [13.174440793199203 29.524330952681836 42.51515597261276]
cid: 118, volume: 649.3922881890743, center: [11.704036476445093 33.01333961449333 62.07699831384195]
cid: 119, volume: 366.4978046290455, center: [12.665887270023509 22.320131776143295 46.882110299199695]
cid: 120, volume: 290.73603610898425, center: [12.504329540085601 28.707725302326537 5.796959716285773]
cid: 121, volume: 119.35920444746027, center: [13.372397686187576 36.51899191068205 29.546382940521568]
cid: 122, volume: 233.909721453958, center: [13.462607635011478 37.078315356231336 51.2934710104069]
cid: 123, volume: 194.46252199012835, center: [15.856145170288912 40.215513576698136 36.56510391842807]
cid: 124, volume: 484.9391683201395, center: [14.643507152105823 48.980379145161294 28.868936641676267]
cid: 125, volume: 266.2735846458304, center: [14.731771689092708 9.155713506182092 36.394703759190705]
cid: 126, volume: 29.37090420372142, center: [12.020133227958052 16.931732409375 35.62599670047554]
cid: 127, volume: 30.987102057322936, center: [11.78205204044788 17.693529110882164 44.19829637269801]
cid: 128, volume: 202.90266633671408, center: [12.016787997935836 30.756912718890746 24.661850634713346]
cid: 129, volume: 427.6539332869301, center: [14.11084314796034 45.18884224235525 69.37780849630944]
cid: 130, volume: 318.3909771594991, center: [13.966224016188294 52.66329784837375 43.188336979639026]
cid: 131, volume: 183.18904313475974, center: [13.23754589525567 31.477120668118943 49.17460681447555]
cid: 132, volume: 388.76541950088864, center: [16.49905716353088 45.37297327543112 58.3852976792907]
cid: 133, volume: 159.26532428947309, center: [11.575628792695404 54.35996353109496 28.082918799749436]
cid: 134, volume: 23.863859665523652, center: [13.070379680568408 11.75463528486622 24.014470645986624]
cid: 135, volume: 15.044607180438824, center: [11.619738857283977 15.018953330769232 43.217587007427056]
cid: 136, volume: 560.8007021398058, center: [14.42405880138878 21.422823604739204 58.271811851145664]
cid: 137, volume: 338.5435676797156, center: [12.354138148986658 32.484878086208525 55.661058525985744]
cid: 138, volume: 490.36640061865324, center: [14.94530151560774 51.115770943261715 68.36072096029054]
cid: 139, volume: 116.74535359780843, center: [13.93046742782061 31.380196572756795 2.0478679956588617]
cid: 140, volume: 502.95678142880826, center: [11.26845440390393 31.132900880560953 16.090009127603444]
cid: 141, volume: 468.11873880673113, center: [15.123852346665858 36.68218911321342 17.49544694486595]
cid: 142, volume: 441.1821079133725, center: [13.675287420227972 56.252962217923205 64.21643629237936]
cid: 143, volume: 445.75135863528294, center: [16.930618545534543 28.36840829139212 51.411589072493285]
cid: 144, volume: 301.8299374250638, center: [14.060159064271456 38.087021732901434 4.5003445900509025]
cid: 145, volume: 340.97784099007833, center: [14.45533280049187 27.120873281180877 59.18189736958862]
cid: 146, volume: 350.39568527279334, center: [14.484390367333686 43.768942324229826 22.48505125426798]
cid: 147, volume: 67.84040373142176, center: [13.556574886243782 43.04668585535294 1.3167670097647057]
cid: 148, volume: 255.4390731087239, center: [15.09071558883381 37.86364421920794 22.48528814943759]
cid: 149, volume: 85.55872094127544, center: [13.290885317184832 18.87204665855877 51.52504020258862]
cid: 150, volume: 63.59040196824739, center: [12.745548941898234 44.65806298908064 48.48715031973643]
cid: 151, volume: 216.53060626276144, center: [18.240480444760564 8.555406900856985 24.545796640223]
cid: 152, volume: 306.0599861283171, center: [17.04195270826196 13.685665465206336 44.47877943391356]
cid: 153, volume: 171.2770663619189, center: [15.81128713349246 38.07250005541705 45.28874676636766]
cid: 154, volume: 24.302826983785792, center: [17.050125751798575 15.288168037931033 16.902390653448276]
cid: 155, volume: 193.62449347344608, center: [15.192961989716338 42.96007091488046 44.54846250213314]
cid: 156, volume: 628.5213875117015, center: [15.438908584750033 56.61687122746666 53.53701422433333]
cid: 157, volume: 153.9977164703274, center: [15.867658409292263 41.471720866597565 50.15533479989635]
cid: 158, volume: 164.3533545693297, center: [17.067666457187112 36.14331072252033 38.85595628861236]
cid: 159, volume: 339.3217370166348, center: [15.079935278030243 48.873011597736095 36.41048758317064]
cid: 160, volume: 301.4109231667226, center: [16.977356647145363 16.757688064226137 38.49752806696015]
cid: 161, volume: 282.35575094216154, center: [16.95654865240379 48.38110281886792 44.156840528301885]
cid: 162, volume: 283.4531692378169, center: [19.840898106392437 45.30051216647895 52.63091446150922]
cid: 163, volume: 12.570427750234032, center: [16.421740456939364 45.922672713333334 0.6857239366666666]
cid: 164, volume: 599.3500139071901, center: [16.847562706707695 57.27902571739464 35.76335251937546]
cid: 165, volume: 70.87326883941472, center: [16.700476458520576 10.307445548986486 40.582079509290544]
cid: 166, volume: 271.22194350624, center: [17.440354649528807 51.29161524449349 24.905040300154493]
cid: 167, volume: 102.57868105389389, center: [17.036030560783257 2.8140923693639373 34.463189048414705]
cid: 168, volume: 164.57283822846077, center: [17.231773377250075 12.583972807892822 21.18563217006547]
cid: 169, volume: 303.8052903572434, center: [17.426405144662258 26.439568485833444 31.973519198988573]
cid: 170, volume: 259.2700606135571, center: [16.879734842582526 29.616850415753426 34.76980259794521]
cid: 171, volume: 201.8252011009797, center: [16.973135244786892 40.1066618900346 31.088322033010378]
cid: 172, volume: 96.41318553830291, center: [16.968888879974447 44.09972643979719 38.58880568803808]
cid: 173, volume: 92.76177557275875, center: [17.54200549884213 46.12241868094213 48.782894270036564]
cid: 174, volume: 436.7724816708301, center: [20.444928326204817 39.58204656172681 57.70978519110096]
cid: 175, volume: 151.5833962198856, center: [18.553110413295133 40.69785915736475 39.57208030464657]
cid: 176, volume: 57.76410847131352, center: [16.82224727692512 19.88882024227979 53.06087675181347]
cid: 177, volume: 42.26058091269155, center: [18.397465679946546 33.4618971417847 45.75946268711048]
cid: 178, volume: 339.50131455592384, center: [19.952741423968725 28.402958372671172 61.81814333203056]
cid: 179, volume: 529.2549144046947, center: [19.40424638359467 41.76844923907635 70.26784081408105]
cid: 180, volume: 285.52828746960154, center: [17.3276942446719 63.6124476518868 36.77216301023061]
cid: 181, volume: 61.87443881504084, center: [21.864412783372554 4.872201293905191 27.376637547629795]
cid: 182, volume: 381.54241180948435, center: [19.557052619274856 19.426948469108883 20.094752930373392]
cid: 183, volume: 208.3298986352278, center: [18.509459388180353 33.14809635228426 22.136686626079875]
cid: 184, volume: 12.929582828812146, center: [18.62615344721898 35.637616674074074 0.49184407870370367]
cid: 185, volume: 75.74181546014029, center: [17.329975769686605 41.325969331533194 0.8798944274762909]
cid: 186, volume: 257.8733464190867, center: [18.78827737632717 21.37026313788301 36.80604137994429]
cid: 187, volume: 179.5974923489786, center: [16.73248733208886 21.74632380986557 31.647855260871015]
cid: 188, volume: 177.32284351798387, center: [19.922999078675254 24.29393431002588 44.6847025642624]
cid: 189, volume: 245.24305948908963, center: [20.203543269920825 33.61517643619722 51.63618255262387]
cid: 190, volume: 221.9777916211962, center: [19.016811192345678 40.6289685648 25.8964468896]
cid: 191, volume: 275.01302489123117, center: [17.993315207001384 43.77804359847638 30.582899760944642]
cid: 192, volume: 342.51422660399584, center: [20.903019483198104 54.78123373928696 30.14239592572527]
cid: 193, volume: 253.5634854761493, center: [21.284703615686247 28.78781060963173 25.0004554789424]
cid: 194, volume: 120.63620028240469, center: [19.730947771179235 36.6352500549785 42.9529006112471]
cid: 195, volume: 267.88978249943193, center: [20.694533107990605 16.23730865505735 52.392113156777896]
cid: 196, volume: 280.9390836877701, center: [18.836063571479162 19.23786586372159 43.38709826360795]
cid: 197, volume: 352.1515545458419, center: [18.664655563692186 20.03426768663947 63.122355891143975]
cid: 198, volume: 571.3957769578602, center: [20.213252303885284 58.625928208335374 46.95977184038132]
cid: 199, volume: 120.33690438358958, center: [24.382731729602177 1.6301474401591776 30.98110575365611]
cid: 200, volume: 100.00473632408406, center: [21.27620946354208 19.51145100670391 52.016339511033514]
cid: 201, volume: 14.246484783598568, center: [20.206516065168984 38.881905102941175 50.18093308529412]
cid: 202, volume: 414.60463209859194, center: [21.148392604262597 36.033813816622555 70.21103348840175]
cid: 203, volume: 359.77362343566637, center: [18.2038056146552 7.532774749098775 29.55250144783429]
cid: 204, volume: 396.72669040937024, center: [21.273000033949554 52.15007942847156 50.17385503101142]
cid: 205, volume: 266.5529274847245, center: [21.661795096018835 51.94524155802829 39.37698717251291]
cid: 206, volume: 517.1633600925649, center: [20.655089506425668 53.485012924646014 58.90358713589645]
cid: 207, volume: 328.4074132398443, center: [20.11431150887104 60.75319646221521 58.95374384971748]
cid: 208, volume: 130.75240166235494, center: [21.91871817915425 10.71727684257592 36.796370738364104]
cid: 209, volume: 774.0191004556802, center: [21.32639594511407 15.711320246922046 27.952479448700764]
cid: 210, volume: 139.31226436846669, center: [21.217477315474913 23.0148462446004 47.54689689916929]
cid: 211, volume: 314.0212570367987, center: [21.17907218515162 35.80516671728936 32.988176819672134]
cid: 212, volume: 153.1796410135661, center: [20.841568023417235 12.961158193122314 39.14331315037124]
cid: 213, volume: 389.62340107749196, center: [21.52836723158722 24.71583197907513 52.37846816205254]
cid: 214, volume: 459.4990169208563, center: [25.6838808127185 13.524839464262453 34.45344185533892]
cid: 215, volume: 81.54815589715315, center: [21.252170270801507 35.16118324396868 48.26645722410081]
cid: 216, volume: 195.65970558538874, center: [21.666972331449205 45.60281435672037 39.04535110306955]
cid: 217, volume: 373.44146948155577, center: [16.921896621545788 64.47831672719064 43.78612263592114]
cid: 218, volume: 315.85693854953126, center: [22.62928074404693 32.38913296970941 39.29008672406191]
cid: 219, volume: 260.34752584929146, center: [21.074963663029802 14.534743257618027 47.676532709227466]
cid: 220, volume: 229.50009521141558, center: [20.55217215513122 32.03535506585811 2.7127392670839856]
cid: 221, volume: 296.98134386425926, center: [21.74059053884322 43.03363496553346 64.2425873502553]
cid: 222, volume: 24.063390264733716, center: [19.979030440336857 38.49723380373135 0.676231630597015]
cid: 223, volume: 238.39915993618445, center: [22.359740840796757 41.23990660435219 19.158557330147307]
cid: 224, volume: 309.55177161449325, center: [21.235482554562555 47.933959373166175 33.55369732767822]
cid: 225, volume: 150.30640038494118, center: [23.457370718354785 38.99294702481083 53.45841603078455]
cid: 226, volume: 307.7559962216027, center: [22.44645196681705 31.08412731473029 68.34563871288252]
cid: 227, volume: 307.33698196326156, center: [24.74757419264845 49.684655247283004 55.22011460372655]
cid: 228, volume: 95.99417127996178, center: [22.609792004680678 10.31256335200582 29.046640556682604]
cid: 229, volume: 378.13043856299225, center: [21.296286086523896 14.579714076397025 58.120956918584774]
cid: 230, volume: 169.42143178926534, center: [24.18077331225542 30.44548964715581 43.54103717238252]
cid: 231, volume: 251.2888366451546, center: [21.979804133507233 33.495730730300146 25.90698150219152]
cid: 232, volume: 341.39685524841946, center: [23.800302162035898 39.868477657767386 45.04506584438925]
cid: 233, volume: 9.41784428271502, center: [22.91775818374098 24.908543531567794 57.50975682775424]
cid: 234, volume: 232.11394606106742, center: [25.060206977146766 28.260576619754147 45.86454392220407]
cid: 235, volume: 511.31711353570995, center: [24.726011785784728 34.26773168944041 57.77299339390072]
cid: 236, volume: 73.02819931088342, center: [22.42331455136164 53.75572693778689 43.75206963491804]
cid: 237, volume: 206.31463958320614, center: [24.67171919528364 55.194678396441006 33.30857063498066]
cid: 238, volume: 275.89095952775546, center: [22.830042829748393 58.89710682035149 41.098680646995014]
cid: 239, volume: 269.2266375141393, center: [23.1910351662271 57.17245044821759 63.8629027115912]
cid: 240, volume: 308.3545880192329, center: [22.677368493435775 62.891815580600486 53.40692998897373]
cid: 241, volume: 229.59986051102064, center: [23.55942027716115 26.684734867263405 37.74094255664378]
cid: 242, volume: 204.0000846323694, center: [24.25808479767214 24.12998168858568 27.308261359741785]
cid: 243, volume: 165.5704912245111, center: [24.20734143440053 29.967008319016628 33.27489666438901]
cid: 244, volume: 160.90147520299558, center: [24.085095617098112 37.359174278125 36.464621789062505]
cid: 245, volume: 150.74536770320333, center: [24.27436003245263 41.60319569023164 39.1890240992323]
cid: 246, volume: 194.3228505706813, center: [24.37161877248365 45.11319589378787 20.525078503994248]
cid: 247, volume: 158.52706107239584, center: [25.375033709928086 64.63344806828194 44.44072273797357]
cid: 248, volume: 312.9437918010644, center: [25.688349573920778 63.894153706885994 48.94590493431522]
cid: 249, volume: 182.96955947562867, center: [24.57318139146061 26.523499935343512 30.69574145908397]
cid: 250, volume: 151.98245741830573, center: [25.22393429127955 45.90834711185506 42.36765577577786]
cid: 251, volume: 46.111521477445784, center: [25.666896627512987 15.917726857334488 16.438316224881003]
cid: 252, volume: 180.99420654344905, center: [23.902468864106982 17.554539396174622 21.914895998092824]
cid: 253, volume: 555.5730004405021, center: [25.90051772474938 44.49000543105158 47.6758315051142]
cid: 254, volume: 253.12451815788717, center: [24.789327374903316 34.65581921968312 28.9047439970834]
cid: 255, volume: 186.74068780069888, center: [26.24701650135117 40.05562285624533 27.385303627898278]
cid: 256, volume: 153.65851445167027, center: [25.10505626695108 64.58274946848462 40.26023129626023]
cid: 257, volume: 221.33929370372397, center: [25.205335641783012 36.556875484143156 19.355180907752636]
cid: 258, volume: 563.8535203077198, center: [24.410781395514654 36.64865574307654 64.75637626519693]
cid: 259, volume: 270.5036333490837, center: [26.65269130542661 51.59198747550343 42.7880482518035]
cid: 260, volume: 221.93788550135417, center: [23.510417415828623 24.635525284078035 40.70506689043423]
cid: 261, volume: 143.522360011799, center: [25.1805670560485 27.5484600907549 5.212084171555679]
cid: 262, volume: 177.1632190386158, center: [25.549436827973945 39.55198874927357 23.702766532086944]
cid: 263, volume: 172.85335809567843, center: [24.64635658038032 45.503471760741085 57.78010859279695]
cid: 264, volume: 256.0177118464331, center: [25.924151888256976 49.4552583603928 22.067804341898526]
cid: 265, volume: 215.89210834528922, center: [26.450833666635244 19.721970422828097 49.05885626356746]
cid: 266, volume: 213.45783503492646, center: [26.218307219320035 29.502305183735277 62.05233337316321]
cid: 267, volume: 293.03063799989997, center: [25.87166605124182 19.883699145757863 34.26418282049571]
cid: 268, volume: 201.96487252042675, center: [27.495845577275176 21.794379862655603 22.542138290041493]
cid: 269, volume: 270.4637272292417, center: [26.768566009852854 42.56288960857248 32.53514785201771]
cid: 270, volume: 247.6374266796104, center: [26.565019503312318 46.10408600338409 25.59343892030457]
cid: 271, volume: 261.3451788453418, center: [28.518512018514603 49.968637299702245 29.74629638273019]
cid: 272, volume: 12.69014610976007, center: [27.326837819566624 5.527104658018868 26.671175124999998]
cid: 273, volume: 172.97307645520448, center: [26.24844193140272 52.44560066155266 24.986078352347445]
cid: 274, volume: 78.71482138837024, center: [25.889768530886872 12.112736862661597 20.361965803498098]
cid: 275, volume: 200.28881548706224, center: [28.64264209733292 16.212273980125524 39.6040005746862]
cid: 276, volume: 115.58807612239006, center: [24.91193824658164 19.105874793785603 57.034539795287415]
cid: 277, volume: 111.41788659889973, center: [25.76255650038228 25.46929192612822 60.005491580157596]
cid: 278, volume: 189.45430394995574, center: [28.650821580223592 12.54274211614534 29.122137066824646]
cid: 279, volume: 235.08695198929738, center: [27.797736766550553 22.94252722906128 54.797292822288235]
cid: 280, volume: 406.86284484924147, center: [26.275446431552883 26.017915768898042 66.37470743058702]
cid: 281, volume: 242.78883311880585, center: [27.06512992930351 35.05144398856016 42.55352501725838]
cid: 282, volume: 350.5154036323194, center: [26.042732983044623 49.35875307279559 62.58215688086754]
cid: 283, volume: 50.201898761252096, center: [25.727927240325265 30.414198520588236 53.07629671335453]
cid: 284, volume: 491.30419443494054, center: [30.76583257604867 36.03985380515372 50.10144436756285]
cid: 285, volume: 461.9731963510611, center: [29.56728940110519 56.685750634984664 54.2104873323457]
cid: 286, volume: 221.31934064380297, center: [28.562685693934515 20.54848387570321 40.33112830307429]
cid: 287, volume: 256.71606894366835, center: [27.6963203610792 51.03443708977149 36.21052986039173]
cid: 288, volume: 342.33464906470675, center: [32.384307217918995 4.803258843574051 30.49053752790698]
cid: 289, volume: 299.335804934938, center: [27.610452064813437 48.671605596727105 67.93195565161312]
cid: 290, volume: 320.6656259904938, center: [28.881073190305088 12.574836321205899 51.8123359761247]
cid: 291, volume: 226.14798114468653, center: [28.144156015439098 19.970579303335096 44.58333999340921]
cid: 292, volume: 29.889683761667584, center: [29.602948052650454 11.024381715420562 21.76359308271028]
cid: 293, volume: 277.527110441278, center: [28.292696265925297 21.369392393507802 62.97786687856065]
cid: 294, volume: 105.4120155626768, center: [29.27498017469811 28.99966144298694 48.974294907666106]
cid: 295, volume: 93.48008572991498, center: [31.50817763315926 30.713291561045892 52.22165663359659]
cid: 296, volume: 86.01764131945858, center: [29.98908809086741 46.22509781997217 57.40881468740431]
cid: 297, volume: 344.74896931514854, center: [29.62140445277456 52.868456328915386 48.23572536696956]
cid: 298, volume: 228.26300549631318, center: [27.643756399101473 61.15754224602273 30.90647376555944]
cid: 299, volume: 221.75830796206512, center: [28.8384445509189 60.20971048968868 58.203484857117154]
cid: 300, volume: 310.21022259188646, center: [29.347902184528166 41.25390701521837 54.4827211009005]
cid: 301, volume: 371.5060226692181, center: [30.057143065775847 43.264753456189915 62.356715619259894]
cid: 302, volume: 257.6139566401136, center: [29.43592701404124 42.31426655804353 14.09616744191]
cid: 303, volume: 246.26066554506096, center: [28.092357820410918 62.707748048371414 35.81732181601847]
cid: 304, volume: 112.41553959495005, center: [28.62022172972493 17.00316085425985 60.0976075544196]
cid: 305, volume: 245.7219329271938, center: [30.597532125140386 20.03920995897686 56.34896900401949]
cid: 306, volume: 149.24888820912787, center: [29.53270951350171 29.413532647339572 31.877153623074864]
cid: 307, volume: 291.0552850677203, center: [30.373292931647683 32.6031155748269 35.682904615931996]
cid: 308, volume: 306.8182024053154, center: [29.883968248391053 57.76749308740327 37.438557263790074]
cid: 309, volume: 280.679693908797, center: [29.4007065186493 59.05089576231606 43.46517806306249]
cid: 310, volume: 230.5177012673869, center: [30.248175477605592 15.65209837735653 48.340801831576215]
cid: 311, volume: 332.3581191042036, center: [31.17271553225584 44.62124929132497 40.16708024536231]
cid: 312, volume: 174.9484293873841, center: [30.303338508964412 24.928472494468522 23.49277795435675]
cid: 313, volume: 272.13978426260627, center: [27.812146981897833 31.303734565994574 19.64137874591979]
cid: 314, volume: 295.80411332891987, center: [29.515523434946264 54.94225567477235 64.29606357523103]
cid: 315, volume: 228.5423483352073, center: [31.04911388241889 25.32073099439497 48.97554750594552]
cid: 316, volume: 118.22188003196291, center: [29.49738042035832 26.172755685822782 29.316035816607595]
cid: 317, volume: 321.9426218254382, center: [32.01666327307482 38.77773274464209 36.14769294924078]
cid: 318, volume: 211.1831862039317, center: [29.874869294427977 42.56770058650794 69.10164691170635]
cid: 319, volume: 177.36274963782589, center: [30.943751202669535 46.81359434262572 34.039999775835305]
cid: 320, volume: 244.70432687122246, center: [31.13918089394325 24.031224740582193 34.3887796760274]
cid: 321, volume: 184.047024711363, center: [31.182060357070007 34.660893920977884 24.927081762033822]
cid: 322, volume: 99.94487714432105, center: [31.082114631362714 38.49709055390298 20.11343786256738]
cid: 323, volume: 243.36747185651504, center: [32.11979385064671 45.442084535197175 26.59757209708945]
cid: 324, volume: 399.4602596185481, center: [33.247305870906445 9.394263936608391 34.47216748143357]
cid: 325, volume: 183.9871655316, center: [30.422394191441143 55.22519456870187 28.20625636257456]
cid: 326, volume: 565.5694834609263, center: [31.39690230034815 11.013968885366026 27.851784729049214]
cid: 327, volume: 217.0493858207076, center: [31.675232663912464 28.22061425926641 20.687978662548264]
cid: 328, volume: 258.95081165482105, center: [33.25121675910973 38.55717982831715 29.320302284789644]
cid: 329, volume: 376.4344284697067, center: [32.1163230483918 46.1984611215361 49.90528961736987]
cid: 330, volume: 168.32401349360998, center: [31.03400830984627 52.86666717400427 59.06292895462304]
cid: 331, volume: 406.3440652912953, center: [33.03596184978463 28.89576155786398 41.578695275207465]
cid: 332, volume: 139.45193578791373, center: [32.30433734817169 14.837554944570039 41.93923496308485]
cid: 333, volume: 323.85811557785485, center: [29.944529330229233 28.060409280118293 54.5768366699464]
cid: 334, volume: 243.9062044743822, center: [31.966610475696083 32.17779793988874 63.13669939692409]
cid: 335, volume: 253.54353241622832, center: [31.598069336834406 44.35063996186354 18.885362200125915]
cid: 336, volume: 255.89799348690707, center: [32.98670630907846 60.44446214832749 27.320910506923976]
cid: 337, volume: 96.41318553830291, center: [32.54949838108116 24.07406307299255 37.661607474958615]
cid: 338, volume: 258.1925953778228, center: [32.53206738729286 19.34674295585008 31.48126264808346]
cid: 339, volume: 123.82868986976571, center: [33.686702384358966 39.51399381293909 16.454529455462456]
cid: 340, volume: 202.04468476011078, center: [32.51031341071639 15.460080230110608 57.13860379547699]
cid: 341, volume: 299.0963682158859, center: [30.324273379099147 33.134163648832555 47.34044882023349]
cid: 342, volume: 219.46370607114937, center: [33.12434681593853 33.80178427476134 55.979154824229475]
cid: 343, volume: 105.6913584015709, center: [32.8619778995485 43.34566575750425 34.602610745063245]
cid: 344, volume: 321.92266876551724, center: [34.22612045084072 39.02721366812942 42.95771049717367]
cid: 345, volume: 73.42726050930355, center: [37.50574847111118 1.0000598982880435 32.174767502690216]
cid: 346, volume: 21.309867995634832, center: [35.932183111942386 5.250977725 27.08018915]
cid: 347, volume: 292.31232784274374, center: [32.40176874769208 26.69174514550853 60.10896376871673]
cid: 348, volume: 215.73248386592118, center: [34.48548207280319 35.33893856698113 30.005471453440624]
cid: 349, volume: 157.4895019565035, center: [33.811487896307824 50.40253999296845 36.33939710916001]
cid: 350, volume: 343.3323020607571, center: [33.68601259060964 57.72616946336956 49.54756415844134]
cid: 351, volume: 242.86864535848989, center: [33.576005507346146 63.3875466037956 42.26476011275057]
cid: 352, volume: 192.0482017396866, center: [34.53925241078453 22.8945239736 25.710819196145454]
cid: 353, volume: 176.68434560051165, center: [33.65687270193898 28.645465528458498 26.150569595098816]
cid: 354, volume: 255.25949556943485, center: [34.65611189353777 48.68679664622059 43.22690507667475]
cid: 355, volume: 166.40851974119337, center: [31.713956126408238 32.297226733920866 68.57211229007194]
cid: 356, volume: 170.5388031448417, center: [34.312887332753455 42.6260929948403 29.03127551228501]
cid: 357, volume: 245.52240232798374, center: [33.512484575044944 56.548494134872 32.08386483871597]
cid: 358, volume: 102.19957291539477, center: [35.22453490875906 19.89559272112456 35.6947079581804]
cid: 359, volume: 195.75947088499376, center: [34.897523757330596 19.729327830394453 51.71182070854143]
cid: 360, volume: 242.0106637818866, center: [35.117730021448224 34.96338370883007 39.773837713059606]
cid: 361, volume: 102.21952597531578, center: [34.06249490561655 48.42296585088815 20.56951240447004]
cid: 362, volume: 194.30289751076032, center: [35.04592809017666 49.97285885727049 60.20177024004929]
cid: 363, volume: 178.7195577124543, center: [34.54205130943017 52.96601500446578 38.102399945606784]
cid: 364, volume: 68.47890164889395, center: [33.97156339486697 53.60619799291958 25.264533431381118]
cid: 365, volume: 80.80989268007592, center: [34.81110504133026 15.20209864288889 45.14933558125926]
cid: 366, volume: 224.79117307005808, center: [33.16073829321925 35.23008798941061 17.586908535540562]
cid: 367, volume: 94.55755096564933, center: [35.276271254511514 51.019057512850814 30.125784161299855]
cid: 368, volume: 180.97425348352803, center: [34.949135368727084 51.89428924620728 23.00870268916207]
cid: 369, volume: 158.28762435334374, center: [35.960624422734206 27.251544437728477 35.65214441564351]
cid: 370, volume: 197.19609119930624, center: [35.8255689573669 31.238579581038145 29.20376113702317]
cid: 371, volume: 246.16090024545593, center: [34.6199644170418 51.0467395570398 53.48373933747264]
cid: 372, volume: 214.61511251034483, center: [33.83509133574254 40.44452253129416 23.192419662021198]
cid: 373, volume: 374.7982775561842, center: [36.50208541630084 55.51313672347742 43.63069218681324]
cid: 374, volume: 143.1033457534579, center: [35.79790331486715 36.64702252750976 57.50487020709704]
cid: 375, volume: 171.7758928599441, center: [35.4017873989212 21.64585400232315 47.55557849818795]
cid: 376, volume: 172.93317033536246, center: [37.401088668759044 33.65448033537556 67.34613578591208]
cid: 377, volume: 421.8276397899963, center: [35.51517961546382 38.35330416544629 63.06116644163474]
cid: 378, volume: 176.44490888145958, center: [35.43748257657787 42.57479132083003 58.833020013151646]
cid: 379, volume: 212.6996187579282, center: [35.007972393534054 49.92361089554409 65.8099893053471]
cid: 380, volume: 227.78413205820905, center: [34.51485454594638 23.693062168281358 42.49181711066048]
cid: 381, volume: 220.8005610858568, center: [34.69273609615662 38.14543157063076 69.00554309495753]
cid: 382, volume: 117.46366375496467, center: [36.54200479093415 40.56031459191439 47.15405331652794]
cid: 383, volume: 275.25246161028326, center: [37.315469211898936 40.87339983096775 53.139830831612905]
cid: 384, volume: 167.1667360181916, center: [36.17914862897483 58.24897630470279 39.12643656603008]
cid: 385, volume: 101.88032395665867, center: [37.26047752081857 19.428838211457112 44.75161678924794]
cid: 386, volume: 78.75472750821226, center: [37.06136020108487 22.040448667950344 30.692226576589814]
cid: 387, volume: 87.41435551392902, center: [37.23103931528273 38.4210175992011 49.76881794829948]
cid: 388, volume: 247.19845936134826, center: [36.9491087175958 44.229834688312216 67.06845321892808]
cid: 389, volume: 116.46601075891435, center: [37.140764833411204 44.22474497783108 13.720514363046085]
cid: 390, volume: 213.3381166754004, center: [38.89771122828294 52.65825237429854 52.256811416554434]
cid: 391, volume: 130.47305882346083, center: [35.61007010410722 62.082370751276954 34.155097093057044]
cid: 392, volume: 134.18432796876803, center: [36.78854716954253 14.146320595717473 53.85527182416357]
cid: 393, volume: 262.9214705791013, center: [38.77091190096563 26.581020151764438 28.459330344706686]
cid: 394, volume: 329.14567645692154, center: [39.27395645875969 32.568260712312075 35.530552622356936]
cid: 395, volume: 155.67377350369193, center: [37.64220517857857 43.47140165633171 43.68495665783132]
cid: 396, volume: 171.1773010623139, center: [37.09372153861892 48.51920908601235 27.994035524221935]
cid: 397, volume: 155.51414902432387, center: [36.86345007855395 55.35050818691301 61.964175446997686]
cid: 398, volume: 200.30876854698323, center: [37.89116381191617 56.04191242448451 27.780287452236276]
cid: 399, volume: 113.23361505171131, center: [38.1982007175732 44.33329500803524 18.570535594837008]
cid: 400, volume: 136.8380849382619, center: [38.19777399474251 48.526841008792644 21.393606473972003]
cid: 401, volume: 211.28295150353676, center: [36.05601791795971 20.531753937217868 60.599349479280384]
cid: 402, volume: 188.83575909240454, center: [38.29539399639698 27.751296543195267 49.3019460170858]
cid: 403, volume: 231.9942277015414, center: [39.35224915870096 41.16647885725467 37.40062836213124]
cid: 404, volume: 150.74536770320333, center: [37.9810132972913 48.59890484477829 15.567613570165452]
cid: 405, volume: 145.9566333221618, center: [37.63193986828154 11.815650109377989 49.07965485933015]
cid: 406, volume: 140.09043370538592, center: [38.41855061568285 15.70536139680957 46.438485068494515]
cid: 407, volume: 176.8240170199587, center: [38.52656833083362 20.206394105687206 54.384496783412324]
cid: 408, volume: 209.66675364993523, center: [39.599079057577775 8.689999540968785 27.694984825180814]
cid: 409, volume: 159.50476100852515, center: [39.28176620140185 15.553070142819614 37.55393972180386]
cid: 410, volume: 199.43083391045894, center: [39.18645354894075 25.954125298169085 21.134673691245624]
cid: 411, volume: 198.0540727759095, center: [38.71174611696538 27.181894253314525 15.299529195909733]
cid: 412, volume: 105.63149922180787, center: [38.942639739762015 39.86873833492633 12.899693005987912]
cid: 413, volume: 145.3779945844526, center: [38.80427443680496 46.67855250263519 31.6304293144661]
cid: 414, volume: 216.01182670481526, center: [39.310656178759196 16.03183560490486 41.291431425956034]
cid: 415, volume: 151.98245741830573, center: [39.04357278426803 21.18461902918472 38.004001682906654]
cid: 416, volume: 72.50941975293725, center: [39.66210939026684 20.39271356821684 40.95501203948817]
cid: 417, volume: 259.6691218119773, center: [35.41700247680772 31.67732430449516 22.61446217662517]
cid: 418, volume: 100.36389140266219, center: [39.649321722368505 34.56058225091451 23.59130743884692]
cid: 419, volume: 148.39090663252458, center: [38.5542075571632 35.589068660266236 12.890373979104478]
cid: 420, volume: 145.47775988405766, center: [38.22893057751295 53.243382692497605 17.95205984100946]
cid: 421, volume: 43.93663794605609, center: [39.19917979389267 62.63993655490464 35.938293292370574]
cid: 422, volume: 208.42966393483283, center: [39.56644013579767 36.6673197046525 18.60525652340609]
cid: 423, volume: 549.6668947038843, center: [39.517517654344914 46.472014282198344 55.90980043033251]
cid: 424, volume: 118.04230249267385, center: [38.15654561262762 57.815833405476674 22.830998544117648]
cid: 425, volume: 175.5071150651723, center: [38.6356150120233 26.731890044713506 45.102964169440654]
cid: 426, volume: 186.64092250109385, center: [39.821124431563064 30.025878840699168 17.93051190920462]
cid: 427, volume: 186.54115720148883, center: [39.705199770381576 39.65328183266659 23.38892980708097]
cid: 428, volume: 115.32868634341698, center: [39.00882044191496 42.78436298766436 31.561594629134948]
cid: 429, volume: 198.71252375330272, center: [39.73153748748089 57.22024918511899 35.914056784385984]
cid: 430, volume: 292.6914359812429, center: [38.580483206365955 26.66841967720363 64.17432136029723]
cid: 431, volume: 346.24544880922406, center: [39.60954607836346 32.28445071371521 60.982683431181925]
cid: 432, volume: 199.49069309022198, center: [39.06029197575911 45.76577481991398 36.4500694974995]
cid: 433, volume: 197.49538709812134, center: [38.48270042076656 11.296603304384723 35.46249265226309]
cid: 434, volume: 152.38151861672586, center: [39.52248974178952 17.661022160128326 33.77753734949588]
cid: 435, volume: 316.09637526858336, center: [39.90742882278553 61.544445357303374 43.13123181067416]
cid: 436, volume: 132.46836481556147, center: [40.66032157066946 17.594815490917306 49.2812246561681]
cid: 437, volume: 124.4272816673959, center: [40.213076574401164 31.65786977982681 13.581217975304682]
cid: 438, volume: 227.24539944034186, center: [40.49079745497767 51.37553295654579 32.30431470534727]
cid: 439, volume: 85.19956586269733, center: [41.103422243524165 21.593937608852457 60.51739370065574]
cid: 440, volume: 321.40388920757107, center: [39.30866626794868 28.26990541815868 55.579884302663274]
cid: 441, volume: 296.44261124639206, center: [41.03676128368197 32.59995086884297 42.55965487974019]
cid: 442, volume: 204.97778456849872, center: [40.86900566680349 38.07890446306824 32.90536909968851]
cid: 443, volume: 147.05405161781715, center: [41.49229062499707 21.04300798147897 25.66570681542741]
cid: 444, volume: 132.46836481556147, center: [41.05278245202238 27.218257275417987 33.66342861003163]
cid: 445, volume: 283.83227737631603, center: [39.84156645055659 34.157662250425304 52.98083776987698]
cid: 446, volume: 198.25360337511958, center: [41.774761206651995 35.49266912789855 28.52847504580314]
cid: 447, volume: 199.19139719140688, center: [40.09128301326694 43.825148509956925 61.015726981328264]
cid: 448, volume: 150.74536770320333, center: [41.732727216406936 23.54274611261416 22.393338102409]
cid: 449, volume: 182.4507799176825, center: [42.0261075872145 18.137916306660106 29.33794115757874]
cid: 450, volume: 187.85805915627523, center: [41.5308227438994 27.789022706542752 38.523921043048325]
cid: 451, volume: 215.91206140521024, center: [40.30042236454999 55.34675137216524 58.40883801488772]
cid: 452, volume: 229.00126871339043, center: [41.65439864223006 5.463759755319335 30.594898379942492]
cid: 453, volume: 195.71956476515177, center: [42.085393649899785 40.86863940712611 18.525627537730657]
cid: 454, volume: 113.05403751242225, center: [41.13603571852977 44.90576194357572 25.701154498517475]
cid: 455, volume: 184.9050062879663, center: [41.87769349421615 52.92653380090644 25.483168382874716]
cid: 456, volume: 236.962539621872, center: [41.94910580107212 24.398706554580667 51.065965146749754]
cid: 457, volume: 160.3028834053654, center: [42.73269972883373 30.182321597610155 28.66176433442868]
cid: 458, volume: 153.45898385246022, center: [41.74722716987591 38.47689141005071 44.83653693241451]
cid: 459, volume: 227.664413698683, center: [41.46010292679695 48.62244061067484 39.40773587355828]
cid: 460, volume: 168.52354409282003, center: [40.79177101116594 49.77786777332465 62.94115845103007]
cid: 461, volume: 155.99302246242803, center: [41.82267629741368 18.22177301838066 57.41574304109747]
cid: 462, volume: 142.8240029145638, center: [41.71679168573331 21.97672577229673 31.91321575871752]
cid: 463, volume: 129.31578134804246, center: [41.38405929263108 26.181862333636786 58.68728502123129]
cid: 464, volume: 181.53293916131622, center: [43.300582647967374 49.379473709353704 23.107189546427787]
cid: 465, volume: 154.6960735675626, center: [42.70401940493716 42.210826960389525 41.23064597756997]
cid: 466, volume: 136.29935232039472, center: [40.92152197823408 31.86737949301713 46.96171110724637]
cid: 467, volume: 195.32050356673165, center: [43.126661762628295 36.95879987649403 48.18482706046583]
cid: 468, volume: 155.47424290448186, center: [43.486695728294286 40.823891526321866 26.04315033257187]
cid: 469, volume: 555.9720616389222, center: [41.968809811757694 46.40212944509044 47.09648794423988]
cid: 470, volume: 122.69136545426834, center: [42.45454026695487 59.758810558302166 27.135314707074322]
cid: 471, volume: 135.06226260529232, center: [42.70851967435512 14.229963855635988 52.65953930941055]
cid: 472, volume: 84.48125570554109, center: [42.36314452179422 21.845606092347662 46.843026776145486]
cid: 473, volume: 112.83455385329118, center: [41.625008151885034 23.835765436816974 56.21843138599469]
cid: 474, volume: 106.25004407935907, center: [43.65087304989271 31.888949109746477 23.630802619042253]
cid: 475, volume: 196.7770769409651, center: [43.38756211054441 52.32938290726019 40.67407107195295]
cid: 476, volume: 126.2629631801285, center: [43.13359992427766 56.400797552986724 31.105470139712388]
cid: 477, volume: 80.84979879991792, center: [42.50352640464795 22.969001376530105 17.148309639758146]
cid: 478, volume: 142.14559887724957, center: [44.31002308678847 31.871157943837733 18.377439002316112]
cid: 479, volume: 114.33103334736666, center: [42.74235668995158 42.80662551727748 14.065254450418848]
cid: 480, volume: 123.01061441300445, center: [42.899645342116315 56.58115391654501 22.327359549245745]
cid: 481, volume: 127.93902021349302, center: [42.99492813007733 56.96885649104803 53.267972231004364]
cid: 482, volume: 146.8545210186071, center: [42.87738310045507 12.680040451141304 32.32276414072011]
cid: 483, volume: 147.27353527694822, center: [43.7026355680635 47.7100884187373 16.382303032813983]
cid: 484, volume: 242.6292086394378, center: [42.61991076083629 55.009981479745065 46.43773305540296]
cid: 485, volume: 145.19841704516355, center: [43.47510725598104 31.617691185364848 64.8313071649306]
cid: 486, volume: 184.9050062879663, center: [44.66745258318381 36.34020450912917 37.43472299695694]
cid: 487, volume: 159.48480794860413, center: [42.874743330525334 40.923891617978235 64.67353720862005]
cid: 488, volume: 122.69136545426834, center: [43.847840618500285 52.218909816083915 18.62724448760774]
cid: 489, volume: 122.11272671655915, center: [43.38448121468949 12.432150464656862 48.40574308156863]
cid: 490, volume: 108.32516231114374, center: [44.794660013339936 22.46151386557377 36.00198254754098]
cid: 491, volume: 297.6996540214155, center: [44.08215055870851 38.1686784152815 57.458142765542895]
cid: 492, volume: 58.24298190941768, center: [44.38725807110924 1.5219109489208633 31.064618330215826]
cid: 493, volume: 111.27821517945269, center: [43.45987977777289 21.673921805379237 43.84853781915008]
cid: 494, volume: 175.76650484414537, center: [45.609549740764386 41.272525245226475 31.360224804574866]
cid: 495, volume: 114.53056394657672, center: [43.882357721199455 47.1069730002439 62.61680978341463]
cid: 496, volume: 192.28763845873866, center: [44.55249400639567 51.620349963847666 34.339557597727506]
cid: 497, volume: 224.79117307005808, center: [45.63259403556549 23.28341780892952 39.589313064290785]
cid: 498, volume: 136.9578032977879, center: [45.54792810271401 24.322024967875876 31.676829575743007]
cid: 499, volume: 184.6655695689142, center: [46.85596347172931 31.258285174878445 32.03045659779579]
cid: 500, volume: 86.31693721827368, center: [44.73239492616721 17.749931019417474 49.69596836213592]
cid: 501, volume: 106.72891751746323, center: [45.87902147698516 44.77083740246775 26.919212415872124]
cid: 502, volume: 332.93675784191277, center: [44.736879266485914 50.752466342646535 50.61124926817692]
cid: 503, volume: 104.41436256662648, center: [44.55484394386207 11.833398564742978 44.31133293416778]
cid: 504, volume: 44.87443176234339, center: [45.947516321607516 27.115143103912853 25.032065234459758]
cid: 505, volume: 204.95783150857773, center: [45.30156797685758 29.970837419626168 49.07196898428738]
cid: 506, volume: 88.91083500800451, center: [43.77500610576141 36.02522984838421 64.43456026521544]
cid: 507, volume: 121.25474513995589, center: [45.87950421131644 48.93009786891558 28.2764261758598]
cid: 508, volume: 227.22544638042086, center: [45.689356998953585 55.67749358798735 39.183112547391985]
cid: 509, volume: 110.97891928063758, center: [45.743872059392245 23.24852299007551 24.49472595231931]
cid: 510, volume: 163.0564056744643, center: [46.51174559129677 28.3399199856094 42.35879264397944]
cid: 511, volume: 168.363919613452, center: [46.05566690294295 36.16007226943589 21.270210649739276]
cid: 512, volume: 105.7113114614919, center: [46.42551459401395 38.32438463935448 62.2420352121744]
cid: 513, volume: 108.64441126987984, center: [44.87973817826282 38.583765096584024 14.0301380784573]
cid: 514, volume: 164.75241576774982, center: [45.3586393498674 60.94804171882039 36.637123203160954]
cid: 515, volume: 85.4589556416704, center: [45.99026327407071 29.102296704669627 14.688814166378707]
cid: 516, volume: 114.19136192791962, center: [46.29531313497537 34.41518087204263 14.30924358467587]
cid: 517, volume: 65.74533243971608, center: [44.97477592482804 35.13663703110774 55.24240963611533]
cid: 518, volume: 161.97894043872995, center: [46.82579638667786 35.059035233628975 42.15396190432373]
cid: 519, volume: 252.16677128167885, center: [44.62845776306734 44.98458462676056 21.39203289507042]
cid: 520, volume: 334.7325332348033, center: [46.6653015040604 44.46939224746066 53.18260513994993]
cid: 521, volume: 220.58107742672573, center: [45.82720917215265 52.202780332428766 57.34364278895522]
cid: 522, volume: 208.21018027570176, center: [44.95995735872473 58.04014906206037 49.794212855304266]
cid: 523, volume: 92.78172863267976, center: [46.31973298530214 22.36810554367742 53.671749522322585]
cid: 524, volume: 130.47305882346083, center: [46.34589053113784 46.16507441024621 37.6747028567365]
cid: 525, volume: 95.67492232122568, center: [46.88861946336015 54.363940238540145 28.670243125839416]
cid: 526, volume: 165.5305851046691, center: [45.41763333525583 60.27392009475651 43.117644699554]
cid: 527, volume: 114.73009454578678, center: [47.05860635169124 17.08279596568696 37.24067313594783]
cid: 528, volume: 116.0270434406522, center: [46.70828499552416 42.31083510846087 38.17592546182287]
cid: 529, volume: 196.7770769409651, center: [47.224861519564655 17.76999583664571 33.34354382086798]
cid: 530, volume: 130.3732935238558, center: [47.127720000786574 20.505460930348946 26.397670330348944]
cid: 531, volume: 100.14440774353112, center: [47.69513586988098 36.79725272635983 34.07420436945607]
cid: 532, volume: 205.43670494668189, center: [47.28853727982678 23.457086648251746 59.20914515282634]
cid: 533, volume: 111.57751107826778, center: [47.7794768060681 26.275612003701717 29.191159823766093]
cid: 534, volume: 227.54469533915696, center: [48.43670970550164 29.575937661908103 35.85436475100842]
cid: 535, volume: 202.04468476011078, center: [47.17570543680129 14.099649877602213 29.16208823117717]
cid: 536, volume: 165.9495993630102, center: [46.53851653497583 16.811767247865816 41.424157143910065]
cid: 537, volume: 146.9143801983701, center: [46.88372969173905 17.491516809900855 45.170161918321334]
cid: 538, volume: 169.58105626863338, center: [47.8773270660224 27.27786836388987 21.506353173914576]
cid: 539, volume: 132.00944443737833, center: [47.52609173541021 57.83029940069528 26.127247940432284]
cid: 540, volume: 154.19724706953744, center: [46.688640773402746 17.60558177336957 55.04531576793478]
cid: 541, volume: 115.70779448191611, center: [47.09809985306333 24.43573291453699 17.184109732540094]
cid: 542, volume: 181.01415960337005, center: [47.19039063376847 28.809279789583332 61.739244622222216]
cid: 543, volume: 184.8651001681243, center: [47.10126637928987 39.148026573998926 50.25202136940097]
cid: 544, volume: 113.95192520886754, center: [47.91934120783348 12.028938783855718 41.41345018476624]
cid: 545, volume: 96.01412433988278, center: [47.575897229629476 20.173125219077306 51.496220370261845]
cid: 546, volume: 75.04345836290507, center: [48.34783113586919 40.43949028588142 25.91590836955597]
cid: 547, volume: 165.39091368522205, center: [48.28355376072223 23.962743679225483 47.98067492167934]
cid: 548, volume: 129.7747017262256, center: [48.85694427331293 37.002801603966795 28.513520035516606]
cid: 549, volume: 200.5482052660353, center: [47.56171293977354 44.230155169147345 59.8896418844891]
cid: 550, volume: 160.6021793041805, center: [48.505395940498595 54.76003357368617 32.79217273574357]
cid: 551, volume: 210.4648760467755, center: [48.022344198785724 59.66613600730944 32.0695994205347]
cid: 552, volume: 231.61511956304227, center: [47.31738075853219 30.53201170976051 56.78678644039456]
cid: 553, volume: 187.6984346769072, center: [48.82551087597517 33.01990685673435 26.63563132097374]
cid: 554, volume: 120.25709214390557, center: [48.16645887308197 42.23487740452962 43.76047766480836]
cid: 555, volume: 74.80402164385299, center: [47.637751729208304 43.380371904774606 15.610018515924247]
cid: 556, volume: 233.73014391466896, center: [47.70490990378622 45.42770713996074 32.285332851989075]
cid: 557, volume: 68.55871388857798, center: [48.37306758316881 55.21436402156578 23.19897658821304]
cid: 558, volume: 191.09045486347827, center: [48.751624036906826 25.460830417771746 43.75910860663047]
cid: 559, volume: 135.26179320450237, center: [48.52644493341574 26.698498502124206 53.680628079377485]
cid: 560, volume: 185.80289398441158, center: [48.77336233662222 37.59090621314433 43.311466588917526]
cid: 561, volume: 97.96952421214142, center: [48.572774617948795 49.27129648014257 18.54824099395112]
cid: 562, volume: 84.32163122617304, center: [48.893865424340476 17.07867402359205 23.744896603928066]
cid: 563, volume: 231.9543215816994, center: [48.82022808639577 33.572115798967744 50.60381489736774]
cid: 564, volume: 111.6373702580308, center: [50.2611978191355 36.51997034675603 22.76248235308311]
cid: 565, volume: 154.07752871001142, center: [48.896040387107476 40.429565927583525 20.315018919891223]
cid: 566, volume: 114.05169050847257, center: [49.16983840646803 52.43219213303009 53.949663772673205]
cid: 567, volume: 232.3134766602775, center: [49.87094836808599 53.04140926526669 43.10275417052306]
cid: 568, volume: 104.83337682496762, center: [48.38369741358975 53.16996654130186 20.824342826437]
cid: 569, volume: 123.60920621063464, center: [49.21863645469143 32.50053472372881 20.207264910169492]
cid: 570, volume: 395.0506333760057, center: [49.982137570723964 45.89590645527046 43.712351140426286]
cid: 571, volume: 118.10216167243688, center: [49.2254509797094 50.251336239432334 25.316029858844402]
cid: 572, volume: 126.9413672174427, center: [49.88416605935357 39.05300012631248 15.718732778497328]
cid: 573, volume: 150.9049921825714, center: [50.11411419287336 15.844506834510115 50.34987236830622]
cid: 574, volume: 146.59513123963401, center: [50.688909201763565 25.182985242343815 33.69806152882809]
cid: 575, volume: 93.22069595094189, center: [49.69605791959472 45.1415218734375 17.003734034203767]
cid: 576, volume: 55.62913105976584, center: [50.24583859824749 34.96448355139886 15.233420920911048]
cid: 577, volume: 106.72891751746323, center: [49.90356273276771 13.873965551991025 46.217427434380255]
cid: 578, volume: 149.9671983662841, center: [50.97452967095602 21.22737638238425 29.01123472523949]
cid: 579, volume: 170.41908478531565, center: [50.65155746032539 29.590617782859148 46.30032558366702]
cid: 580, volume: 170.87800516349878, center: [49.98307274778297 34.045110105826716 36.34935402642457]
cid: 581, volume: 123.98831434913376, center: [50.46468705483688 20.330725711795942 20.690918194721597]
cid: 582, volume: 129.83456090598864, center: [51.713723413513435 20.65627824739511 46.79329002005532]
cid: 583, volume: 128.27822223215014, center: [51.411856411657226 20.350114379421374 42.54952716150257]
cid: 584, volume: 206.23482734352214, center: [51.819869142677014 29.37634027096556 24.25162203256579]
cid: 585, volume: 96.77234061688104, center: [51.20076236450271 40.05531681228866 37.65856261942268]
cid: 586, volume: 182.23129625855142, center: [50.527375370649736 48.89464016114092 36.86189496635279]
cid: 587, volume: 161.97894043872995, center: [51.96964326419276 24.600393241278642 24.515868165225427]
cid: 588, volume: 170.71838068413075, center: [52.668774948802124 27.51435031518233 37.810847882819075]
cid: 589, volume: 148.63034335157667, center: [51.30247134328302 54.666477598872326 49.06046882875553]
cid: 590, volume: 149.32870044881187, center: [50.69514605678222 30.046052266154465 16.204542091034206]
cid: 591, volume: 225.4496240474513, center: [50.49565736823717 34.85950907802461 59.68976086363395]
cid: 592, volume: 181.93200035973635, center: [52.30994906654429 44.654614573568765 23.009565894801494]
cid: 593, volume: 157.98832845452867, center: [52.879428988393954 46.54972608641071 27.090545226357666]
cid: 594, volume: 201.62567050176966, center: [52.739520410880075 20.262086535437902 34.851632743374566]
cid: 595, volume: 160.64208542402253, center: [52.38243838216168 38.85780397664887 46.319022626493606]
cid: 596, volume: 162.23833021770304, center: [53.1643352817303 52.58451523193949 35.122452231521336]
cid: 597, volume: 197.0564197798592, center: [51.17420401839759 57.62829854520049 45.03505419310449]
cid: 598, volume: 133.1866749727177, center: [52.60812695192858 34.863302236 30.01536006]
cid: 599, volume: 174.50946206912195, center: [51.98149101371979 50.813584353052825 28.563122941070205]
cid: 600, volume: 97.17140181530117, center: [51.90945653710463 16.878369664989734 26.515327267946613]
cid: 601, volume: 101.50121581815955, center: [52.11147092145998 24.622036992726557 18.23571260068803]
cid: 602, volume: 223.75361395416576, center: [51.4892262578998 37.3628956 53.647674783333336]
cid: 603, volume: 88.5516799294264, center: [54.53450927610545 40.00300597854889 26.26443468785489]
cid: 604, volume: 228.8615972939434, center: [52.116004947644555 42.46383665707062 57.24687493451613]
cid: 605, volume: 168.60335633250406, center: [50.874466070213444 58.669353398840244 40.062237886544374]
cid: 606, volume: 137.05756859739296, center: [52.67580664016445 20.043992682923278 38.857865099825304]
cid: 607, volume: 166.60805034040342, center: [54.311071000777446 27.82992819423952 28.36747602948503]
cid: 608, volume: 145.45780682413664, center: [53.521052545745455 31.173821674074073 41.95019432419753]
cid: 609, volume: 49.40377636441184, center: [52.870977461122415 33.3352460723748 21.418752303998385]
cid: 610, volume: 244.58460851169644, center: [52.35399693100447 44.42264781727851 50.551462386417036]
cid: 611, volume: 127.46014677538888, center: [52.44856005724709 13.65057580172198 38.41864253495617]
cid: 612, volume: 171.7758928599441, center: [52.53070165803129 21.023214486955514 54.16991782877221]
cid: 613, volume: 86.17726579882664, center: [52.55216052146912 22.98605345445705 49.5089332273906]
cid: 614, volume: 150.92494524249238, center: [52.70329183227833 28.250334077459016 51.90333699249074]
cid: 615, volume: 91.88384093623446, center: [53.71809457531226 32.01055732729642 38.71677682267101]
cid: 616, volume: 116.6256352382824, center: [53.66593872272344 40.54191977676647 22.13255714550898]
cid: 617, volume: 196.7770769409651, center: [54.01908262934226 43.12612572952748 36.94773012971]
cid: 618, volume: 122.83103687371539, center: [52.9813639480435 54.66112757982456 24.320721666179338]
cid: 619, volume: 141.94606827803952, center: [53.650868539129895 14.664564246359292 33.825162709347765]
cid: 620, volume: 68.47890164889395, center: [54.069692895911594 50.486379872115386 39.29200921888112]
cid: 621, volume: 118.08220861251587, center: [53.36371533059003 56.69760347311591 28.133810947634338]
cid: 622, volume: 116.86507195733448, center: [53.698558229190134 15.04810304183029 43.136401611917364]
cid: 623, volume: 186.36157966219977, center: [54.17467113427609 25.630451357119917 55.972576934229124]
cid: 624, volume: 156.45194284061117, center: [54.228518926551175 34.446276560936106 45.527464052735624]
cid: 625, volume: 125.46484078328824, center: [54.19474480099667 42.76123939413168 27.758373286975193]
cid: 626, volume: 187.19960817888202, center: [53.17830628958286 57.499883808782776 36.04943142876785]
cid: 627, volume: 291.39448708637747, center: [53.24175061717764 39.54271323481923 33.20625169808957]
cid: 628, volume: 152.38151861672586, center: [55.167880800023454 49.41819106691109 31.540262487442714]
cid: 629, volume: 126.20310400036547, center: [54.915559094697855 23.80071498896443 30.92472008746245]
cid: 630, volume: 168.80288693171414, center: [54.44017518529279 36.92799463326241 17.42263509868794]
cid: 631, volume: 184.2465553105731, center: [55.24230001730035 37.072847135315136 39.5856533719948]
cid: 632, volume: 195.46017498617869, center: [52.53604690507275 50.06483292203961 53.45204951585341]
cid: 633, volume: 81.62796813683718, center: [53.58805629948001 51.78154957589831 21.8164679969934]
cid: 634, volume: 151.92259823854272, center: [56.269409390463615 34.47045212013396 35.12303151209614]
cid: 635, volume: 123.64911233047665, center: [56.61564452486552 45.268542979635306 30.486243203275777]
cid: 636, volume: 148.82987395078672, center: [53.13551928224474 48.16586211372838 19.482553145904276]
cid: 637, volume: 160.08339974623433, center: [55.528827424975 29.373818559254644 18.888112066471393]
cid: 638, volume: 247.09869406174323, center: [55.171224492743775 31.092711135513564 56.11005453839632]
cid: 639, volume: 303.60575975803334, center: [54.65629153516089 49.358712441660096 45.05810294420347]
cid: 640, volume: 150.66555546351933, center: [54.90859238813589 17.40305449451728 28.847501303456497]
cid: 641, volume: 172.27471935796925, center: [55.2399594311963 17.737582732140375 47.57111931073663]
cid: 642, volume: 180.35570862597683, center: [55.70982663508709 35.775250216063725 24.73087618154663]
cid: 643, volume: 135.7007605227645, center: [57.070094786258174 27.477129359858846 32.6691510659903]
cid: 644, volume: 72.76880953191034, center: [56.191029410121935 30.68944127965451 27.194388935700577]
cid: 645, volume: 151.46367786035958, center: [57.44170289501501 30.904444603346068 31.157594879660124]
cid: 646, volume: 171.31697248176093, center: [55.8885601725273 32.74569514608665 50.47797261429071]
cid: 647, volume: 101.30168521894949, center: [55.03671978499043 20.5084695952531 23.77346703634036]
cid: 648, volume: 106.62915221785819, center: [56.26288661821825 25.51810604382485 44.34006853052021]
cid: 649, volume: 133.28644027232275, center: [56.37632735024498 28.05058133258982 46.67374790708084]
cid: 650, volume: 71.3920483973609, center: [55.25031075561727 40.55239238627725 40.96236787898267]
cid: 651, volume: 136.43902373984176, center: [55.56826059158891 56.16826279799649 31.594934236575025]
cid: 652, volume: 110.97891928063758, center: [57.13392976480641 24.51061648468177 36.541097770658034]
cid: 653, volume: 136.23949314063168, center: [57.954709198748155 39.89526587478032 28.678196203778562]
cid: 654, volume: 163.65499747209446, center: [57.16472621947084 48.19050386415508 37.199804633028535]
cid: 655, volume: 206.95313750067837, center: [56.60874308823578 53.62975977341882 46.31624568161396]
cid: 656, volume: 169.16204201029225, center: [56.887898402346394 24.43016364865534 40.72889130714791]
cid: 657, volume: 188.9554774519306, center: [56.714946999684486 37.26662653894403 55.44757401522703]
cid: 658, volume: 143.36273553243097, center: [57.40522179152143 38.00592482242171 48.570115402588726]
cid: 659, volume: 94.01881834778214, center: [57.416345177778986 49.858354463200335 23.20443959815365]
cid: 660, volume: 127.38033453570485, center: [58.40596930925141 35.185192840131585 28.05201486776316]
cid: 661, volume: 377.312363106231, center: [58.456084319824264 44.941912958519296 43.04372131338974]
cid: 662, volume: 150.6056962837563, center: [57.3018727635773 16.77514031629571 38.11999318485692]
cid: 663, volume: 125.32516936384118, center: [57.176048488857624 22.407852917958923 49.99696296046808]
cid: 664, volume: 150.24654120517818, center: [58.22789984462553 23.07888719262948 25.11757884051793]
cid: 665, volume: 117.70310047401675, center: [57.43783725298573 34.051937949855905 19.16550322391931]
cid: 666, volume: 94.57750402557033, center: [57.0262978105988 42.536011088607594 53.68018607664557]
cid: 667, volume: 37.57161183125505, center: [57.95115326659818 46.09111321561338 20.65900271598513]
cid: 668, volume: 83.72303942854285, center: [57.29543478768093 18.397452369709246 42.18937333755958]
cid: 669, volume: 82.82515173209755, center: [57.88459669338444 40.97086336897134 46.82074683035413]
cid: 670, volume: 192.68669965715878, center: [57.43114403633326 48.033235338831936 51.179163853525935]
cid: 671, volume: 99.52586288597992, center: [57.7371139704354 18.135285820970328 31.93780889212109]
cid: 672, volume: 118.76061264983008, center: [59.32852025464608 29.498980257913306 42.073742761340725]
cid: 673, volume: 100.26412610305715, center: [58.36745237160762 46.53363712555224 33.3309307440597]
cid: 674, volume: 169.3216664896603, center: [58.428113864951975 52.91039418376149 27.91792895426585]
cid: 675, volume: 144.79935584674342, center: [58.5401853577287 39.93880468404299 20.483781364861514]
cid: 676, volume: 217.12919806039162, center: [58.11179896521115 54.61994236130307 39.561636348106965]
cid: 677, volume: 159.6643854878932, center: [59.784211629729455 29.673515162909272 36.856164074718826]
cid: 678, volume: 140.84864998238416, center: [59.74747653332944 32.88847514555886 46.33328150858479]
cid: 679, volume: 94.97656522399046, center: [59.61068332955439 39.38760806338235 43.394220429264706]
cid: 680, volume: 176.94373537948474, center: [59.65185864489986 27.167024829397835 50.64531806261841]
cid: 681, volume: 121.35451043956091, center: [60.32210501117082 32.653137482999014 40.4285957186123]
cid: 682, volume: 140.82869692246317, center: [60.732663243172226 41.46419049011051 32.51879084613205]
cid: 683, volume: 124.48714084715891, center: [60.17694231085532 32.078580900865525 22.35200092998878]
cid: 684, volume: 145.13855786540054, center: [60.086648396915265 53.39053518035469 34.88962065647512]
cid: 685, volume: 130.85216696195997, center: [59.85039923358328 22.510922268984448 46.635059234172]
cid: 686, volume: 92.68196333307472, center: [60.798230043401745 43.551839965769645 36.643096152206674]
cid: 687, volume: 153.23950019332915, center: [59.96346042623574 21.07246024625 31.30811654824219]
cid: 688, volume: 160.36274258512842, center: [61.066438028968264 35.096159136655466 31.785819428443446]
cid: 689, volume: 107.46718073454046, center: [60.46242794159697 36.15037448967694 42.70434605670256]
cid: 690, volume: 125.46484078328824, center: [60.657509889333866 20.275638763979007 37.615097105009546]
cid: 691, volume: 85.97773519961657, center: [60.76026171678488 23.752941950754234 28.615857613924344]
cid: 692, volume: 133.2265810925597, center: [60.844383142980845 28.550545133548 24.012275554695226]
cid: 693, volume: 173.83105803180774, center: [61.8509498469164 39.792672684882916 37.579896951342974]
cid: 694, volume: 81.78759261620523, center: [61.63303850516062 41.66364030109783 24.210082061527203]
cid: 695, volume: 79.57280296497352, center: [59.943243536746394 20.32589277111334 42.73315868124373]
cid: 696, volume: 117.74300659385875, center: [60.71733637201566 35.22199767971531 52.303241407829184]
cid: 697, volume: 126.48244683925955, center: [62.27407667992193 35.49272622768576 36.073505461665874]
cid: 698, volume: 118.04230249267385, center: [61.70509514178805 37.23470524792089 22.59784900811359]
cid: 699, volume: 100.32398528282017, center: [61.698071853914406 48.182671981742246 27.68325275029833]
cid: 700, volume: 143.32282941258896, center: [62.610525027061676 24.199573138521508 33.29628149732702]
cid: 701, volume: 82.0070762753363, center: [62.05290186758828 26.197198293868613 27.366321594525548]
cid: 702, volume: 189.69374066900784, center: [62.18620738897075 47.75308448857684 46.54243679952666]
cid: 703, volume: 222.17732222040624, center: [62.871336589060896 50.18509020735518 41.150553531998206]
cid: 704, volume: 78.5751499689232, center: [62.376978758087304 24.23112966262062 43.96046879238192]
cid: 705, volume: 112.77469467352816, center: [62.37227262645903 32.20528581146497 50.37179418885351]
cid: 706, volume: 99.98478326416306, center: [62.01557452044461 50.820559952783874 32.16642211293155]
cid: 707, volume: 129.1362038087534, center: [63.381199700091 28.469852767861557 46.53957357019468]
cid: 708, volume: 121.0153084209038, center: [61.82554021065891 43.94471858854081 26.377915201384994]
cid: 709, volume: 238.91793949413062, center: [60.70790056914426 41.93923661767997 50.284035570461]
cid: 710, volume: 121.99300835703312, center: [63.64110566122398 24.698453710549558 40.74875361643768]
cid: 711, volume: 120.97540230106179, center: [63.779491733876874 32.014708802622465 26.91096330123701]
cid: 712, volume: 53.67373118750721, center: [63.17534863194116 34.486649596728626 24.663446422973976]
cid: 713, volume: 131.9096791377733, center: [63.95279428964162 25.153076324625626 36.43878706427167]
cid: 714, volume: 153.4390307925392, center: [64.00127617270618 28.841978421651497 30.92988515602081]
cid: 715, volume: 224.59164247084803, center: [64.35418075277053 47.397936339179104 35.923603767537315]
cid: 716, volume: 151.2242411413075, center: [64.57410003762905 37.728826964032194 27.59915151806307]
cid: 717, volume: 191.1503140432413, center: [65.1567404997503 41.3007087577453 44.11807164579332]
cid: 718, volume: 92.50238579378566, center: [63.699804041627274 46.07757203024159 29.72933687031924]
cid: 719, volume: 132.1890219766674, center: [65.95519608184476 43.84988299503396 40.58064670166038]
cid: 720, volume: 74.12561760653877, center: [65.14796998446354 29.11687218444145 43.030431082449525]
cid: 721, volume: 47.90729687033636, center: [65.64078034539341 31.608465181049564 30.818256340233237]
cid: 722, volume: 105.73126452141291, center: [65.8361048752387 29.352227781638046 38.60802759630119]
cid: 723, volume: 161.59983230023082, center: [65.48687611944408 34.78813631538462 45.213608146153845]
cid: 724, volume: 183.0493717153127, center: [66.58679965084228 34.54676629617397 41.001489771124916]
cid: 725, volume: 105.79112370117592, center: [65.60552452991041 41.38943202878159 29.38148671567333]
cid: 726, volume: 164.17377703004064, center: [66.66010619971883 43.026480944081186 33.63591055358532]
cid: 727, volume: 134.58338916718816, center: [66.22291494635698 31.05101835113417 34.96078657245367]
cid: 728, volume: 109.163190827826, center: [67.37159933981066 39.986269291244746 38.46825263079876]
cid: 729, volume: 76.06106441887638, center: [66.54613700995867 34.51239545729276 30.40996644286464]
cid: 730, volume: 93.51999184975699, center: [67.52950174586107 35.3231993549392 37.33204996161724]
cid: 731, volume: 129.6948894865416, center: [67.30983839503254 37.11898261970769 33.14886961195384]
cid: 732, volume: 30.149073540640668, center: [0.6918163706862039 2.856946967968233 38.178652520450036]
cid: 733, volume: 31.086867356927968, center: [0.8505558240858617 2.8704665818998714 41.48355396720154]
cid: 734, volume: 356.7208052677524, center: [2.0471033350891914 6.1252665388801875 47.245836962725136]
cid: 735, volume: 18.157284528115824, center: [0.612263091725792 8.241735256153847 39.99315056538462]
cid: 736, volume: 14.585686802255678, center: [0.5635548669811747 12.05627673898769 54.90577765608756]
cid: 737, volume: 5.806340437012862, center: [0.4932365324020204 13.980421865979382 40.502727126804125]
cid: 738, volume: 16.96010093285544, center: [0.47778493651692294 14.822215100823529 55.21819445470588]
cid: 739, volume: 159.0059345105, center: [2.439689696544722 36.41532480854561 16.963048362329026]
cid: 740, volume: 144.36038852848128, center: [2.14967488541717 43.877284781548035 14.044536615590879]
cid: 741, volume: 5.806340437012862, center: [1.8916959256271288 0.38655544329896907 49.552726350515464]
cid: 742, volume: 199.45078697037997, center: [4.181953908631314 3.1326677527310927 39.40001076869748]
cid: 743, volume: 29.69015316245752, center: [0.6916674148188809 14.735563268548386 51.050875486088714]
cid: 744, volume: 189.9132243281389, center: [2.879235748977436 2.1664272560411852 53.502508475730195]
cid: 745, volume: 94.11858364738718, center: [3.0685736541837034 13.149278298113208 50.678939949056605]
cid: 746, volume: 239.39681293223478, center: [4.542338770732131 14.20518118529755 55.35157886289382]
cid: 747, volume: 394.5917129978225, center: [3.0424441364829584 10.971550354323423 43.0368614912318]
cid: 748, volume: 458.22202108591193, center: [3.972617822911138 40.318442581293276 68.9761347680209]
cid: 749, volume: 11.433103334736666, center: [5.429265247202271 0.45899965340314136 50.50819098481676]
cid: 750, volume: 71.1127055584668, center: [6.025448504956829 15.131363273232322 43.63509908627946]
cid: 751, volume: 126.18315094044446, center: [5.09441091584977 14.932156592931689 48.947206214848194]
cid: 752, volume: 78.25590101018709, center: [8.605660065774172 1.1647978273584907 55.35640726988781]
cid: 753, volume: 332.27830686451955, center: [10.778248405015251 2.552283953593947 38.22946503417403]
cid: 754, volume: 86.01764131945858, center: [7.425924738210422 8.895967569171885 51.45193151433542]
cid: 755, volume: 169.0223705908452, center: [7.492851529218532 33.970075403706765 7.320001998784087]
cid: 756, volume: 10.375591158923328, center: [6.334080240124279 0.7040778190384616 43.773862298653846]
cid: 757, volume: 310.21022259188646, center: [10.489106243642537 14.212043388923908 49.84227500990545]
cid: 758, volume: 115.64793530215309, center: [9.974447119747852 11.554112855072464 42.92595061123188]
cid: 759, volume: 74.88383388353701, center: [8.990806709072476 16.690739664028776 55.82698204244605]
cid: 760, volume: 33.241797828396656, center: [9.087363971137323 16.080915264705883 43.66009488403361]
cid: 761, volume: 268.28884369785203, center: [9.247071063291244 34.40215534040607 68.25262067583668]
cid: 762, volume: 23.345080107577488, center: [7.519896329894469 10.514640806923076 47.64311414153846]
cid: 763, volume: 200.04937876801014, center: [13.3840646277593 15.859695341113106 55.874425274925194]
cid: 764, volume: 50.88030279856632, center: [11.400515818551748 0.8451801968235294 43.30962963847059]
cid: 765, volume: 103.87562994875931, center: [11.581945474173786 10.16644316323473 46.79617687641183]
cid: 766, volume: 62.15378165393493, center: [13.142752214402377 16.65716334 47.59431498]
cid: 767, volume: 9.63732794184609, center: [12.00993789699839 13.654776630434782 54.270875060869564]
cid: 768, volume: 307.8757145811287, center: [12.640762330472764 60.92354627504213 58.091220614154246]
cid: 769, volume: 252.2665365812839, center: [8.09903134103305 1.995944466819584 49.15848953313296]
cid: 770, volume: 248.67498579550275, center: [12.448523489394626 29.221220543127657 67.67885421076787]
cid: 771, volume: 366.17855567030944, center: [18.72520524343627 21.645416744006102 13.509114187875982]
cid: 772, volume: 250.0517469300522, center: [14.065183285170951 30.142349206216085 10.076408124609001]
cid: 773, volume: 20.2723088797425, center: [17.664137748938256 3.397141308956693 31.096219463681102]
cid: 774, volume: 24.602122882600888, center: [17.647411736704584 30.89011304890511 19.919386515085158]
cid: 775, volume: 29.929589881509596, center: [18.950837723677086 28.86289847 21.329262372600002]
cid: 776, volume: 75.92139299942934, center: [22.277706350089097 3.257643569960578 33.23611538538765]
cid: 777, volume: 335.15154749314445, center: [19.936682223320314 2.522191665993928 38.92489830894802]
cid: 778, volume: 22.906112789315344, center: [21.458489450649093 0.5461538725609756 34.138233175609756]
cid: 779, volume: 35.376775239944344, center: [26.526940539110715 0.8229697177664975 34.328622847208116]
cid: 780, volume: 106.86858893691027, center: [25.390063028599148 21.02527453274832 17.415401182673637]
cid: 781, volume: 321.38393614765005, center: [24.508639545590295 6.734751745501956 34.74551848435463]
cid: 782, volume: 88.65144522903142, center: [27.14491250006447 11.925717050911546 42.86919006900743]
cid: 783, volume: 129.7347956063836, center: [28.755376170057726 57.78104584286374 23.92633938534297]
cid: 784, volume: 31.106820416848976, center: [29.086444235040208 2.8694843316869787 34.81021383444516]
cid: 785, volume: 225.11042202879418, center: [27.863929888850333 47.716085225748984 15.711054905850025]
cid: 786, volume: 13.987095004625486, center: [30.82801962001425 3.855419858345221 36.518555237375175]
cid: 787, volume: 143.90146815029814, center: [32.242971258389026 10.33301696984193 41.42609723826955]
cid: 788, volume: 153.0798757139611, center: [33.40135843834462 1.902232973540146 35.30120594370438]
cid: 789, volume: 281.5775816052423, center: [33.12869205157809 5.4493599419642855 39.62227279419643]
cid: 790, volume: 40.10565044122286, center: [33.65350634936875 12.271438821641791 38.41168883686568]
cid: 791, volume: 158.56696719223785, center: [40.52071389059936 61.194871706379764 31.550049137221592]
cid: 792, volume: 107.92610111272361, center: [44.77762546565022 19.30543060183028 20.14040536705491]
cid: 793, volume: 109.08337858814198, center: [56.29668371706718 25.351677486299618 20.789347498079383]
cid: 794, volume: 66.68312625600338, center: [59.203742399184 48.053754924326746 25.052067723159784]
cid: 795, volume: 30.388510259692744, center: [0.8078217820281697 21.111259065856864 63.294561454235065]
cid: 796, volume: 15.483574498700966, center: [0.7717574522249636 47.012734958505156 16.550095193814432]
cid: 797, volume: 623.3734980520819, center: [4.113050746631775 58.84735736698675 57.67632914152102]
cid: 798, volume: 150.44607180438825, center: [2.456905001801436 7.608331372161804 53.67569035778515]
cid: 799, volume: 119.89793706532745, center: [3.8101637827283845 34.04861592626061 12.282055057363953]
cid: 800, volume: 32.54344073116143, center: [5.229658961789846 22.340869763948497 63.166284517596566]
cid: 801, volume: 98.8474588486657, center: [5.920694202217793 44.33083657896649 13.212112361081953]
cid: 802, volume: 30.96714899740193, center: [3.7012455053176323 41.99338155502577 17.317511290399487]
cid: 803, volume: 107.72657051351355, center: [7.670256500767444 5.134513476717911 43.980443496629]
cid: 804, volume: 46.17138065720881, center: [6.820149309885781 7.817351203846154 47.4145308]
cid: 805, volume: 138.09512771328528, center: [8.023666781753235 38.20010115916775 14.477555767750324]
cid: 806, volume: 24.642029002442904, center: [9.360898887800378 41.32440449052632 17.186948081295547]
cid: 807, volume: 47.36856425246919, center: [7.270187239573614 41.65769933656276 6.491832072914911]
cid: 808, volume: 98.38853847048254, center: [8.760622695237624 34.05941668357331 12.17217421478402]
cid: 809, volume: 60.577489920175424, center: [7.014165191219322 41.24890627440712 12.337894093083003]
cid: 810, volume: 20.55165171863659, center: [9.694636988576821 3.43287504407767 49.185386983980585]
cid: 811, volume: 53.67373118750721, center: [13.098556637853257 35.24931137442379 13.226904940371748]
cid: 812, volume: 170.15969500634256, center: [8.940763904973757 4.862573946845685 54.05484060576923]
cid: 813, volume: 81.3685783578641, center: [12.87248296656374 36.642283930137324 10.397205293526238]
cid: 814, volume: 46.849784694523024, center: [14.548204833383275 34.721214966567295 7.188230834156729]
cid: 815, volume: 230.757137986439, center: [19.155784892090033 44.763631014085604 16.15673784539559]
cid: 816, volume: 22.008225092870056, center: [21.001392053162498 26.215305507796916 13.23112545149592]
cid: 817, volume: 23.44484540718252, center: [22.8237627440123 22.748259114893617 16.218961696595745]
cid: 818, volume: 16.002354056647132, center: [26.6151532747534 1.1831839664588528 37.194655324937656]
cid: 819, volume: 94.25825506683422, center: [27.037697598241056 5.084814337404741 40.40779554862405]
cid: 820, volume: 68.63852612826201, center: [23.719818868706803 23.358312570697677 13.426887741627908]
cid: 821, volume: 104.41436256662648, center: [27.5925150204943 55.214269510376454 20.43136890796866]
cid: 822, volume: 12.590380810155038, center: [28.523775231452984 0.47835470348652936 43.666101890491284]
cid: 823, volume: 79.13383564671138, center: [29.08936910515526 1.2430419752647504 39.689215334417554]
cid: 824, volume: 159.7042916077352, center: [29.28990960776268 19.08847904284108 16.99899467267616]
cid: 825, volume: 112.77469467352816, center: [33.287414537218304 55.785827842091294 20.927332414437366]
cid: 826, volume: 66.88265685521344, center: [33.0372694319514 24.446708405459425 17.183559961127685]
cid: 827, volume: 96.15379575932984, center: [33.38151583593434 19.039553845797887 17.4653227599917]
cid: 828, volume: 39.54696476343468, center: [32.87102805549829 20.837995022149347 21.407162667154388]
cid: 829, volume: 143.26297023282595, center: [32.499138488260265 11.061880840529248 45.787308825668525]
cid: 830, volume: 54.431947464505456, center: [34.25599282745337 15.949296618695014 16.48946817492669]
cid: 831, volume: 332.6574150030187, center: [34.85661632665995 62.479357350359884 50.67763706086252]
cid: 832, volume: 158.84631003113194, center: [37.79857851307917 20.229486073558597 20.03298040898128]
cid: 833, volume: 44.196027725029175, center: [42.93522384374818 1.0605493258239278 34.85327105485327]
cid: 834, volume: 137.65616039502314, center: [47.59384337364661 12.324732748195391 36.01550784720974]
cid: 835, volume: 34.359169183973016, center: [57.66750463449167 44.4875496597561 23.631206303658537]
cid: 836, volume: 27.81456552988292, center: [60.52048951964444 44.94279453658537 22.098859312553802]
cid: 837, volume: 327.86868062197715, center: [2.2951788819928667 63.8507789059944 34.15378535139362]
cid: 838, volume: 19.653764022191304, center: [0.5913423325961138 9.22632438213198 63.96432432365482]
cid: 839, volume: 5.247654759224683, center: [0.43681025564942394 10.75180553840304 57.07988750076046]
cid: 840, volume: 236.46371312384682, center: [2.5551702009563657 29.17843917040756 68.25683061777909]
cid: 841, volume: 259.2700606135571, center: [2.9597094026120203 48.15562245410959 68.4835676239726]
cid: 842, volume: 206.93318444075734, center: [3.369679013028167 21.55138819765693 65.84819424654324]
cid: 843, volume: 44.694854223054335, center: [3.4869651616884534 9.2865667996875 55.405061948437506]
cid: 844, volume: 445.3722504967838, center: [6.224852466889801 9.114960999834237 59.5929051373236]
cid: 845, volume: 157.56931419618752, center: [8.652131225031019 39.17671133063188 9.301933785830062]
cid: 846, volume: 25.919024837387312, center: [21.004585065173014 31.168216635103928 15.574417861893764]
cid: 847, volume: 82.9648231515446, center: [17.92937030291754 33.131793745454544 7.062200343434343]
cid: 848, volume: 264.7771051517549, center: [13.668698008638795 10.325615610226075 55.34151819395629]
cid: 849, volume: 70.23477092194253, center: [23.854090697704827 14.874556976164774 20.0695013071875]
cid: 850, volume: 238.8780333742886, center: [15.969225218010594 8.354403226403274 44.988856784689276]
cid: 851, volume: 213.01886771666432, center: [18.76814977539237 10.161070857015737 51.87488391547396]
cid: 852, volume: 85.81811072024851, center: [20.194685360219186 7.1974101886538016 43.051948380097656]
cid: 853, volume: 137.43667673589206, center: [24.549170023223414 10.579310799695122 46.43276109237805]
cid: 854, volume: 214.8944553492389, center: [23.160550505536794 7.730049543064067 40.13180490036212]
cid: 855, volume: 162.4777669367551, center: [29.631014695507794 15.246641916848827 22.635864428171438]
cid: 856, volume: 163.33574851335837, center: [29.30566935317552 18.714599588040556 26.906083291143418]
cid: 857, volume: 19.913153801164384, center: [35.84226462643142 8.908625580360722 24.54514739218437]
cid: 858, volume: 108.32516231114374, center: [40.45380899220676 13.914805868852458 28.395409470491806]
cid: 859, volume: 156.5916142600582, center: [35.15795605264747 12.694957900879206 24.64786107331804]
cid: 860, volume: 242.88859841841088, center: [35.762145693957656 59.542764288096606 57.22001409367452]
cid: 861, volume: 275.49189832933536, center: [37.2871070178663 17.187974068711522 24.72134828065474]
cid: 862, volume: 60.677255219780456, center: [39.97389426530556 10.341090833015455 24.078775904176258]
cid: 863, volume: 70.7735035398097, center: [44.27833532411515 16.10129994933747 24.05284536910065]
cid: 864, volume: 85.81811072024851, center: [54.86390792764769 43.21976880592885 17.926770927481982]
cid: 865, volume: 97.9096650323784, center: [64.20978265962955 37.84988869129815 47.750071122967185]
cid: 866, volume: 1004.097834404805, center: [4.590650723676951 59.52659170470163 25.09136220692725]
cid: 867, volume: 394.5717599379015, center: [3.0298257257469556 42.026506902584075 8.739404077592921]
cid: 868, volume: 378.01072020346624, center: [16.95081966184538 61.76258029162312 30.75877788145685]
cid: 869, volume: 50.720678319198264, center: [16.527249254660994 35.584839910857596 12.298369830920535]
cid: 870, volume: 211.20313926385273, center: [35.4291206291093 14.02918687377421 20.171537477572038]
cid: 871, volume: 143.06343963361587, center: [39.1750124220995 10.759912478117155 42.46066395012553]
cid: 872, volume: 16.740617273724368, center: [0.5712442476985481 49.38180956352801 8.585809081287247]
cid: 873, volume: 471.1715569746451, center: [18.191170139481383 58.15786522665792 25.724139447675107]
cid: 874, volume: 233.47075413569587, center: [20.733979432505038 50.78931968504401 18.862591503999656]
cid: 875, volume: 108.44488067066978, center: [22.08768614065572 39.12654707464581 15.103215477019319]
cid: 876, volume: 250.77005708720841, center: [9.225928261742443 62.38203236505411 34.17490402320974]
cid: 877, volume: 10.994136016474526, center: [10.233955446026407 42.97346484446461 6.230031998003629]
cid: 878, volume: 195.79937700483578, center: [6.66118737158027 46.26369388853561 16.79920795139101]
cid: 879, volume: 347.7020221834575, center: [13.439256743971413 53.4695271661942 20.924158175588204]
cid: 880, volume: 82.80519867217656, center: [7.384978798881556 24.772642440506026 66.12407765819277]
cid: 881, volume: 121.09512066058784, center: [19.19490578291454 29.609192920069205 10.410858549134948]
cid: 882, volume: 74.02585230693374, center: [22.187167759547826 30.007025677924528 8.049774486226415]
cid: 883, volume: 27.535222690988828, center: [26.083777920129318 37.47821689804348 13.628160213043477]
cid: 884, volume: 230.11864006896678, center: [2.4010053787597405 52.78226067169861 18.20949687286916]
cid: 885, volume: 330.0236110934458, center: [12.65235585365118 23.176115398784763 65.08898062340387]
cid: 886, volume: 25.938977897308316, center: [29.80318217467951 25.12862492053846 7.501441834384615]
cid: 887, volume: 167.56579721661174, center: [32.30212113819314 32.52142017452965 14.185013520421528]
cid: 888, volume: 18.935453865035072, center: [31.94031991311094 19.838723046891463 13.7407745601686]
cid: 889, volume: 91.0657654794732, center: [42.875842596817066 10.751134369325154 39.29103951855828]
cid: 890, volume: 81.34862529794309, center: [1.6661092341067616 49.71524583156733 13.134856383738043]
cid: 891, volume: 205.67614166573395, center: [13.360055668103167 46.59375736222352 18.226755857363212]
cid: 892, volume: 164.9718994268809, center: [30.85440078216227 51.785626038715534 17.39869379433962]
cid: 893, volume: 48.685466207255615, center: [21.848293459731654 26.0791734602459 10.104568340655739]
cid: 894, volume: 136.9578032977879, center: [25.36943785513535 33.09533310222902 15.571621096328672]
cid: 895, volume: 115.36859246325899, center: [28.85293307612961 26.755440642857142 16.30571353220339]
cid: 896, volume: 58.6220900479168, center: [25.858789216468406 27.264094117086454 9.074509324880871]
cid: 897, volume: 82.86505785193957, center: [37.11114580948678 23.588507103611846 16.813104746352035]
cid: 898, volume: 241.59164952354547, center: [28.816441146601445 22.87367563040139 11.85447251043112]
cid: 899, volume: 156.97072239855734, center: [22.104881807754087 55.55472325706114 21.36582114302784]
cid: 900, volume: 105.81107676109693, center: [24.205694386571913 27.876606003507447 13.526384706222892]
cid: 901, volume: 196.63740552151805, center: [8.071707344562935 53.524856279360726 19.433610524200915]
cid: 902, volume: 68.21951186992088, center: [31.598572395544753 38.03576349529102 12.872728316262064]
cid: 903, volume: 173.87096415164976, center: [13.107344686594383 6.632193300068854 49.13992852987147]
cid: 904, volume: 10.654933997817416, center: [0.4156809840944909 14.43109815 73.69524925]
cid: 905, volume: 200.38858078666726, center: [2.930192135310674 8.60032800074679 74.32108002396694]
cid: 906, volume: 61.7547204555148, center: [1.1991992711960315 17.433376612051696 69.26309889499193]
cid: 907, volume: 16.181931595936188, center: [6.858368200938746 65.42822657422934 31.717602701726264]
cid: 908, volume: 133.06695661319168, center: [2.9448766742425807 22.100142620737742 77.51694270274405]
cid: 909, volume: 148.67024947141869, center: [4.4414903439639115 10.79545845775064 77.48085340194605]
cid: 910, volume: 80.80989268007592, center: [8.2123861403053 17.33790882237037 77.90697785162962]
cid: 911, volume: 133.68550147074288, center: [2.8589288850607337 16.532644152447762 76.35180105031343]