genotype,shape,angles,anisotropy
wt,control,-55.44,0.0097
wt,control,-53.58,0.0187
wt,control,-53.46,0.0191
wt,control,-39.18,0.0269
wt,control,-36.36,0.0291
wt,control,-29.66,0.0297
wt,control,-28.29,0.0306
wt,control,-26.22,0.0312
wt,control,-14.83,0.0346
wt,control,-1.55,0.0376
wt,control,-1.1,0.0397
wt,control,1.01,0.0417
wt,control,3.49,0.0441
wt,control,37.31,0.0498
wt,control,45.66,0.0511
wt,control,52.2,0.0604
wt,control,53.6,0.1002
wt,control,65.61,0.1139
wt,control,66.92,0.1358
oryz,control,-57.82,0.0102
oryz,control,-53.44,0.0251
oryz,control,-46.93,0.0274
oryz,control,-41.03,0.0301
oryz,control,-35.12,0.0479
oryz,control,-34.92,0.054
oryz,control,-10.31,0.0574
oryz,control,-0.96,0.0603
oryz,control,-0.79,0.0656
oryz,control,5.76,0.0702
oryz,control,15.07,0.0718
oryz,control,16.72,0.0773
oryz,control,24.22,0.0903
oryz,control,26.03,0.1031
oryz,control,35.06,0.1039
oryz,control,36.12,0.1117
oryz,control,41.08,0.1317
oryz,control,49.31,0.1725
oryz,control,63.43,0.1782
oryz,control,74.02,0.2668
wt,rectangle,-47.7,0.0273
wt,rectangle,-35.09,0.0275
wt,rectangle,-16.85,0.0395
wt,rectangle,-7.98,0.0399
wt,rectangle,-6.19,0.0399
wt,rectangle,-6.18,0.0684
wt,rectangle,-4.75,0.1382
wt,rectangle,-4.61,0.1438
wt,rectangle,-2.08,0.1623
wt,rectangle,-0.74,0.175
wt,rectangle,0.39,0.1833
wt,rectangle,0.51,0.1867
wt,rectangle,1.1,0.1894
wt,rectangle,1.65,0.1945
wt,rectangle,3.76,0.1972
wt,rectangle,3.84,0.2053
wt,rectangle,4.94,0.231
wt,rectangle,5.14,0.2556
wt,rectangle,7.29,0.2678
wt,rectangle,11.61,0.2701
wt,rectangle,13.79,0.3272
wt,rectangle,25.87,0.3672
oryz,rectangle,-85.61,0.0163
oryz,rectangle,-78.7,0.0273
oryz,rectangle,-28.32,0.0433
oryz,rectangle,-12.89,0.0462
oryz,rectangle,-7.95,0.0738
oryz,rectangle,-5.81,0.074
oryz,rectangle,-2.56,0.0752
oryz,rectangle,-1.67,0.0837
oryz,rectangle,-1.11,0.0932
oryz,rectangle,2.24,0.0945
oryz,rectangle,3.07,0.1049
oryz,rectangle,3.48,0.1091
oryz,rectangle,3.79,0.1211
oryz,rectangle,3.93,0.1226
oryz,rectangle,4.8,0.1277
oryz,rectangle,8.33,0.1329
oryz,rectangle,14.64,0.1468
oryz,rectangle,19.27,0.1612
oryz,rectangle,27.53,0.2001
oryz,rectangle,36.38,0.3127
oryz,rectangle,40.55,0.3898
