controls,controls,rectangles,rectangles,triangles,triangles,squares,squares,circles,circles,controls,controls
Average angle,anisotropy,Average angle,anisotropy,Average angle,anisotropy,Average angle,anisotropy,Average angle,anisotropy,Average angle,anisotropy
80.17,0.0214,-17.37,0.0881,-70.4,0.0081,11.13,0.0326,-44.88,0.0619,80.17,0.0214
-17.83,0.0351,-11.72,0.0467,84.92,0.0387,-12.33,0.0434,28.43,0.024,-17.83,0.0351
-30.02,0.0399,23.85,0.1608,10.53,0.0249,-18.92,0.0219,-28.86,0.0288,-30.02,0.0399
-63.62,0.0146,6.77,0.157,64.44,0.03,-14.7,0.0263,75.45,0.106,-63.62,0.0146
-36.63,0.02,16.43,0.1347,24.34,0.0299,-4.52,0.0305,-15.95,0.0381,-36.63,0.02
62.88,0.0285,5.09,0.0244,87.55,0.0945,-20.21,0.0876,3.43,0.0754,62.88,0.0285
49.18,0.0433,3.2,0.0854,-43.11,0.0261,-4.33,0.0393,42.56,0.0433,49.18,0.0433
-49.78,0.051,7.05,0.0359,-44.26,0.0546,30.35,0.0721,-33.92,0.1317,-49.78,0.051
-25.43,0.0691,-7.05,0.1006,77.09,0.0424,6.73,0.0284,49.85,0.0135,-25.43,0.0691
89.17,0.0023,9.03,0.1294,-42.8,0.0326,-86.16,0.0259,63.6,0.0121,89.17,0.0023
85.27,0.0131,-10.08,0.0612,27.82,0.0954,5.43,0.0725,-63.73,0.1109,85.27,0.0131
87.21,0.0258,12.01,0.0839,-21.31,0.061,52.92,0.0133,82.03,0.019,87.21,0.0258
-29.76,0.0493,52.64,0.0924,4.93,0.0645,-24.41,0.07,-84.82,0.0691,-29.76,0.0493
-18.74,0.0267,-3.65,0.0696,-3.68,0.0226,-74.88,0.085,-5.18,0.0415,-18.74,0.0267
43.77,0.1067,18.64,0.0506,33.61,0.0155,-6.82,0.047,6.91,0.0956,43.77,0.1067
-73.34,0.0341,-1.36,0.088,-59.9,0.0118,57.85,0.0288,22.25,0.1251,-73.34,0.0341
-29.53,0.0626,2.88,0.048,59.42,0.0559,76.4,0.0192,56.91,0.0202,-29.53,0.0626
-76.11,0.048,-46.42,0.0511,3.5,0.0405,-12.34,0.0459,-9.36,0.026,-76.11,0.048
-31.61,0.0402,-11.29,0.04,1.42,0.1049,67.46,0.0128,3.34,0.0248,-31.61,0.0402
34.96,0.0114,52.09,0.0211,-88.37,0.0191,22.66,0.0526,-40.12,0.0546,34.96,0.0114
,,-1.72,0.0699,58.08,0.0137,2.75,0.0879,3.51,0.0814,,
,,-69.93,0.0329,-50.48,0.0408,-68.71,0.0518,80.05,0.0575,,
,,1.32,0.0597,-34.63,0.0762,-26.4,0.0367,,,,
,,-31.69,0.0973,29.23,0.0087,-72.13,0.0648,,,,
,,29.56,0.0653,9.66,0.0087,-11.25,0.0167,,,,
,,5.39,0.2071,46.22,0.0082,-74.48,0.0435,,,,
,,-7.8,0.107,3.99,0.04,-20.55,0.0433,,,,
,,-18.67,0.0912,-13.27,0.0286,-8.85,0.0287,,,,
,,3.49,0.2283,3.64,0.0349,-19.88,0.1208,,,,
,,-4.87,0.1455,16.33,0.0676,29.03,0.0049,,,,
,,3.79,0.1081,-30.56,0.0231,-29.4,0.0192,,,,
,,-4.07,0.0839,-36.77,0.0643,20.83,0.0151,,,,
,,-47.06,0.0236,7.31,0.0662,-9.21,0.0629,,,,
,,-23.64,0.0449,-15.74,0.0525,24.99,0.0486,,,,
,,-2.1,0.0845,88.66,0.0252,,,,,,
,,7.49,0.12,50.84,0.0129,,,,,,
,,-33.99,0.0489,-88.33,0.0105,,,,,,
,,-22.75,0.0426,52.71,0.0154,,,,,,
,,-53.45,0.0845,-44.09,0.0315,,,,,,
,,-7.57,0.1126,25.33,0.0212,,,,,,
