{
	"Time": {
		"cmt": "https://discourse.gohugo.io/t/dateformat-force-a-specific-timezone/9860/2",
		"zone": "Asia/Ho_Chi_Minh",
		"Format": {
			"short": "02 Jan 2006",
			"full": "02 Jan 2006, 15:04 -0700"
		}
	},
	"wpm": 200
}