{
  "build": "py36ha15d459_0",
  "build_number": 0,
  "channel": "https://conda.anaconda.org/conda-forge/win-64",
  "constrains": [],
  "depends": [
    "python >=3.6,<3.7.0a0",
    "python_abi 3.6.* *_cp36m"
  ],
  "extracted_package_dir": "C:\\Users\\rafik\\anaconda3\\pkgs\\certifi-2020.12.5-py36ha15d459_0",
  "features": "",
  "files": [
    "Lib/site-packages/certifi-2020.12.5-py3.6.egg-info/PKG-INFO",
    "Lib/site-packages/certifi-2020.12.5-py3.6.egg-info/SOURCES.txt",
    "Lib/site-packages/certifi-2020.12.5-py3.6.egg-info/dependency_links.txt",
    "Lib/site-packages/certifi-2020.12.5-py3.6.egg-info/installed-files.txt",
    "Lib/site-packages/certifi-2020.12.5-py3.6.egg-info/not-zip-safe",
    "Lib/site-packages/certifi-2020.12.5-py3.6.egg-info/top_level.txt",
    "Lib/site-packages/certifi/__init__.py",
    "Lib/site-packages/certifi/__main__.py",
    "Lib/site-packages/certifi/__pycache__/__init__.cpython-36.pyc",
    "Lib/site-packages/certifi/__pycache__/__main__.cpython-36.pyc",
    "Lib/site-packages/certifi/__pycache__/core.cpython-36.pyc",
    "Lib/site-packages/certifi/cacert.pem",
    "Lib/site-packages/certifi/core.py",
    ".nonadmin"
  ],
  "fn": "certifi-2020.12.5-py36ha15d459_0.tar.bz2",
  "license": "ISC",
  "link": {
    "source": "C:\\Users\\rafik\\anaconda3\\pkgs\\certifi-2020.12.5-py36ha15d459_0",
    "type": 1
  },
  "md5": "3838761df9ef4e6da9b518483f35786e",
  "name": "certifi",
  "package_tarball_full_path": "C:\\Users\\rafik\\anaconda3\\pkgs\\certifi-2020.12.5-py36ha15d459_0.tar.bz2",
  "paths_data": {
    "paths": [
      {
        "_path": "Lib/site-packages/certifi-2020.12.5-py3.6.egg-info/PKG-INFO",
        "path_type": "hardlink",
        "sha256": "a5e3b21a991775e82c1aa0c585f592908ae9643434f39a8f251d216d11c8eb2b",
        "sha256_in_prefix": "a5e3b21a991775e82c1aa0c585f592908ae9643434f39a8f251d216d11c8eb2b",
        "size_in_bytes": 3534
      },
      {
        "_path": "Lib/site-packages/certifi-2020.12.5-py3.6.egg-info/SOURCES.txt",
        "path_type": "hardlink",
        "sha256": "c114f069d008d26b348202e02bfe15105bad6ff7bf233a1a3f874d4889c584b0",
        "sha256_in_prefix": "c114f069d008d26b348202e02bfe15105bad6ff7bf233a1a3f874d4889c584b0",
        "size_in_bytes": 278
      },
      {
        "_path": "Lib/site-packages/certifi-2020.12.5-py3.6.egg-info/dependency_links.txt",
        "path_type": "hardlink",
        "sha256": "01ba4719c80b6fe911b091a7c05124b64eeece964e09c058ef8f9805daca546b",
        "sha256_in_prefix": "01ba4719c80b6fe911b091a7c05124b64eeece964e09c058ef8f9805daca546b",
        "size_in_bytes": 1
      },
      {
        "_path": "Lib/site-packages/certifi-2020.12.5-py3.6.egg-info/installed-files.txt",
        "path_type": "hardlink",
        "sha256": "1efa06b05c19c82a822e0a38caa1c33378ebc0f5b02f05ab753aa64832eebb1e",
        "sha256_in_prefix": "1efa06b05c19c82a822e0a38caa1c33378ebc0f5b02f05ab753aa64832eebb1e",
        "size_in_bytes": 305
      },
      {
        "_path": "Lib/site-packages/certifi-2020.12.5-py3.6.egg-info/not-zip-safe",
        "path_type": "hardlink",
        "sha256": "01ba4719c80b6fe911b091a7c05124b64eeece964e09c058ef8f9805daca546b",
        "sha256_in_prefix": "01ba4719c80b6fe911b091a7c05124b64eeece964e09c058ef8f9805daca546b",
        "size_in_bytes": 1
      },
      {
        "_path": "Lib/site-packages/certifi-2020.12.5-py3.6.egg-info/top_level.txt",
        "path_type": "hardlink",
        "sha256": "28cbb8bd409fb232eb90f6d235d81d7a44bea552730402453bffe723c345ebe5",
        "sha256_in_prefix": "28cbb8bd409fb232eb90f6d235d81d7a44bea552730402453bffe723c345ebe5",
        "size_in_bytes": 8
      },
      {
        "_path": "Lib/site-packages/certifi/__init__.py",
        "path_type": "hardlink",
        "sha256": "4ac99d9851e31c263854bb6ac29a7d3ff8ec39c02e1e3fb97395aaa04cfea058",
        "sha256_in_prefix": "4ac99d9851e31c263854bb6ac29a7d3ff8ec39c02e1e3fb97395aaa04cfea058",
        "size_in_bytes": 62
      },
      {
        "_path": "Lib/site-packages/certifi/__main__.py",
        "path_type": "hardlink",
        "sha256": "c410688fdd394d45812d118034e71fee88ba7beddd30fe1c1281bd3b232cd758",
        "sha256_in_prefix": "c410688fdd394d45812d118034e71fee88ba7beddd30fe1c1281bd3b232cd758",
        "size_in_bytes": 243
      },
      {
        "_path": "Lib/site-packages/certifi/__pycache__/__init__.cpython-36.pyc",
        "path_type": "hardlink",
        "sha256": "74d1893bee9ce932e466083979922c7ab89a71c621889086f4f4b21d90d261ea",
        "sha256_in_prefix": "74d1893bee9ce932e466083979922c7ab89a71c621889086f4f4b21d90d261ea",
        "size_in_bytes": 204
      },
      {
        "_path": "Lib/site-packages/certifi/__pycache__/__main__.cpython-36.pyc",
        "path_type": "hardlink",
        "sha256": "f949937def44e46efa0218483e8f403c11c5bccc76c0a652a522b420fc571e6b",
        "sha256_in_prefix": "f949937def44e46efa0218483e8f403c11c5bccc76c0a652a522b420fc571e6b",
        "size_in_bytes": 369
      },
      {
        "_path": "Lib/site-packages/certifi/__pycache__/core.cpython-36.pyc",
        "path_type": "hardlink",
        "sha256": "f68da271f3298ca3cb24080c64657f8f53e5761ec5ea0fb08f6d3878d4a05c07",
        "sha256_in_prefix": "f68da271f3298ca3cb24080c64657f8f53e5761ec5ea0fb08f6d3878d4a05c07",
        "size_in_bytes": 1073
      },
      {
        "_path": "Lib/site-packages/certifi/cacert.pem",
        "path_type": "hardlink",
        "sha256": "bb77f13d3fbec9e98bbf28ac95046b44196c7d8f55ab7720061e99991a829197",
        "sha256_in_prefix": "bb77f13d3fbec9e98bbf28ac95046b44196c7d8f55ab7720061e99991a829197",
        "size_in_bytes": 263774
      },
      {
        "_path": "Lib/site-packages/certifi/core.py",
        "path_type": "hardlink",
        "sha256": "574bb2c4a398773eae9434aeb1c96b2e68db3e0397b03d019c47f4490ece9e81",
        "sha256_in_prefix": "574bb2c4a398773eae9434aeb1c96b2e68db3e0397b03d019c47f4490ece9e81",
        "size_in_bytes": 2303
      }
    ],
    "paths_version": 1
  },
  "requested_spec": "None",
  "sha256": "ec352d0505609f716dc4cc4b3a953627b6fb4f358c1fecaf599125db796b57ca",
  "size": 146930,
  "subdir": "win-64",
  "timestamp": 1607208431421,
  "track_features": "",
  "url": "https://conda.anaconda.org/conda-forge/win-64/certifi-2020.12.5-py36ha15d459_0.tar.bz2",
  "version": "2020.12.5"
}