Base(+0.00,+0.00,+0.00,-0.5,-4.0,+0.00)
'Kawasaki:
'X = -0.6
'Y = -1.7
'Mitsu:
'X = 0.8
'Y = 3.7
Tool(-47.5379,+0.0,+315.1825,+0.00,+0.00,+0.00)
'Tool(-40.00,+5.00,+300.00,+0.00,+0.00,+0.00)
'Tool(-47.5379,+4.2116,+315.1825,+0.00,+0.00,+0.00)
'Tool(-55.684342,-4.440892,+300.00,+0.00,+0.00,+0.00)
'Tool(+0.00,+0.00,+0.00,+0.00,+0.00,+0.00)
'M_Tool=1
Spd 100
JOvrd 50
Ovrd 50
Accel 50,50
Cnt 0,10,10
Servo On
Wait M_Svo(1)=1
Cmp Off
'Mov JFrontCube
'Mvr3 PStart, PEnd, PCenter
Mov PHoldCube
'Dly 1
'Base(+0.0,-860.0,+0.00,+0.00,+0.00,+0.00)
'Dly 1
'Mov Ptest
'Base(+0.0,+0.0,+0.00,+0.00,+0.00,+0.00)
'Dly 100