<?xml version="1.0" encoding="utf-8"?>
<!-- Generator: Adobe Illustrator 16.0.0, SVG Export Plug-In . SVG Version: 6.00 Build 0)  -->
<!DOCTYPE svg PUBLIC "-//W3C//DTD SVG 1.1//EN" "http://www.w3.org/Graphics/SVG/1.1/DTD/svg11.dtd">
<svg version="1.1" id="Layer_1" xmlns="http://www.w3.org/2000/svg" xmlns:xlink="http://www.w3.org/1999/xlink" x="0px" y="0px"
	 width="20px" height="20px" viewBox="0 0 20 20" enable-background="new 0 0 20 20" xml:space="preserve">
<g id="Page-1">
	<g id="Dribbble-Dark-Preview" transform="translate(-380.000000, -2399.000000)">
		<g id="icons" transform="translate(56.000000, 160.000000)">
			<path id="globe_x5F_network-_x5B__x23_1294_x5D_" fill="#EEA225" d="M336.311,2256.664c1.267-2.053,2.002-4.335,2.196-6.66h3.423
				C341.533,2253.168,339.289,2255.764,336.311,2256.664 M334.005,2256.506c-1.44-1.949-2.286-4.197-2.51-6.502h5.011
				C336.285,2252.307,335.441,2254.557,334.005,2256.506 M326.069,2250.004h3.424c0.196,2.326,0.936,4.611,2.206,6.664
				C328.716,2255.77,326.467,2253.172,326.069,2250.004 M331.288,2241.479c-1.112,2.034-1.714,4.267-1.821,6.522h-3.398
				C326.448,2244.981,328.512,2242.485,331.288,2241.479 M333.967,2240.997c0.009-0.012,0.018-0.024,0.027-0.036
				c0.009,0.012,0.017,0.024,0.026,0.036c1.535,2.091,2.373,4.529,2.512,7.005h-5.065
				C331.603,2245.527,332.437,2243.089,333.967,2240.997 M341.93,2248.001h-3.397c-0.11-2.258-0.716-4.492-1.833-6.527
				C339.482,2242.478,341.551,2244.976,341.93,2248.001 M334.855,2239.037c-5.914-0.502-10.855,4.162-10.855,9.965
				c0,5.437,4.335,9.839,9.71,9.994c5.677,0.164,10.29-4.4,10.29-9.994C344,2243.84,340.068,2239.482,334.855,2239.037"/>
		</g>
	</g>
</g>
</svg>
