{
  "type": "service_account",
  "project_id": "game-club-mobile-5895a",
  "private_key_id": "4d0e133e0235c92d2d4c21f087db0996764ab9c4",
  "private_key": "-----BEGIN PRIVATE KEY-----\nMIIEvQIBADANBgkqhkiG9w0BAQEFAASCBKcwggSjAgEAAoIBAQCFsrQbfMXOCA3o\nNwtsP991H1TrUT80J/thJ+XxsllXyDEF3d/Sy87qFLXlhXynP/CViV74KOTttpn1\nhAnCX4DrxmqfxW9UQqEMmS6K6BQ1lM2P3WnXXG8u8c4YJGZTAu2WD3FEcGDZNmom\nd3nVshLX4abK7EKh45fbuLCMYZcHM5FRyV6So1I/SN0RpT1IDN61/ipL/Nz7pYXn\ntws88mIYfcJNezgn6H6HFXUk4yt3JHQ40DzhK9Qsdujd1u5+Z/i7hHWSkzK81Kri\npWnFhbSH9DuiNB9VVGJeGVvV181n8cAWJeGz0lCZpun9+PvdhRvMhOWQVypaj7jP\nkf0Mk+nJAgMBAAECggEAAysN64zUXyJ/ud38Dk+hKvRYHc9qEQFViqLYZxbT2Sms\nR7hPQn6D47Yj7VFxd8EjIVgFARpu+lcWZOQBGzMKKgwkoK6cCcIecN78ZFxFhlOF\nX4BerrTJCbK/MIFET3lFSgYJqBaFpQAOGeVA5Nh4a9c0DaD1n0J2acWBoYH6gzgj\n18vzzwhLN/ChldEcndSnfEO37cLUwlrI3Ehzuipq97PcMjfxjV7YibmZwWw1xJ6K\nhSguGDdpDb5DPcOF/vTu164q9GWFv2MI8CH2vIa/nkN7L6Wh5v9NAjqvPALWeWCR\nIg5nr+zNHIFcToGzMU7mS+e+MbZuRm9EyoO3CfZDgQKBgQC5XAWIuuleQ0N5zFhp\nh28SVfdxb2wBBffgSXhfi9rdRS9K8KZ5xjUFeBeLD9dzD/MayE5WZOlaxPq7GHl1\nN0PFSpeHYotXhJB0MULoC+IAhU1uKTpS0hyUNo7LePssFfMnPrQwsvVIw3Epu2ov\nkxBpDvUZSDVh1MlDbWjdKaHNOQKBgQC4poJ1P2Uuy2rYEetVfiPthZOhX/wV9Brm\n4nAfJPO54oAZuCFu4Dv6M2YuKIC6FGQZCTNk2qGLLo/2YS4J7iNo6esDMcPq5Q6W\nG+OZi+XyJ2UfDF/pF2CvaAuPGBxYGEr/7hqIO6GucRV5Ee2hwpxTVDiUfXAV2xLo\neqOC2FiREQKBgCar7Temj1OsQuKhYHy71c+Egfh3n5fjD+EKUwPUINhzO7et132m\nfZ9je732kyOdW0HmMnnR2eGnIQxxwb1Tx17c/hov1BRxQtYLBQN2nzMunIX0Mgff\ncDj33PjUh8qd1boFWgCjBYulwvFK+Y9tZkoU5cvdhc2gYFEh/XPO4MP5AoGBAJ5U\nUHq+wEEOtW/Oda8Z+S6aogr2pc4hQMwHD8L0yXPzboofI7PR3DvexNgBbNeh0m7R\nP9tTyL7yTwkhLPvg0UYNhbF4g5ivjgFSqqcnmSU5eHDWCItyuznMilTJhMxZED5B\naUi1cR6F4rask8lneOnOxrE0md5zudPUDM6OOesxAoGAfUockmfKv/V+UkludU5z\n0rs1E4g+mxYJ095mgMPMOwsnfBk52J/Yf4UC68Wo5bqpzOo8t2JZNwyiEt70Gdb5\nlcUADdqrpEEQb1Y7/Ko1D4ueWu0SXlnZIDNEZ5Hs3fDwBGVIufaS4kk0ssVVk8Aa\nGcppm9ZYoSHUJIR3vWQ+Jto=\n-----END PRIVATE KEY-----\n",
  "client_email": "firebase-adminsdk-3uvsk@game-club-mobile-5895a.iam.gserviceaccount.com",
  "client_id": "117292173131725870913",
  "auth_uri": "https://accounts.google.com/o/oauth2/auth",
  "token_uri": "https://oauth2.googleapis.com/token",
  "auth_provider_x509_cert_url": "https://www.googleapis.com/oauth2/v1/certs",
  "client_x509_cert_url": "https://www.googleapis.com/robot/v1/metadata/x509/firebase-adminsdk-3uvsk%40game-club-mobile-5895a.iam.gserviceaccount.com"
}
