%YAML 1.1
%TAG !u! tag:unity3d.com,2011:
--- !u!114 &11400000
MonoBehaviour:
  m_ObjectHideFlags: 0
  m_CorrespondingSourceObject: {fileID: 0}
  m_PrefabInstance: {fileID: 0}
  m_PrefabAsset: {fileID: 0}
  m_GameObject: {fileID: 0}
  m_Enabled: 1
  m_EditorHideFlags: 0
  m_Script: {fileID: 11500000, guid: 78e1de636fd5cb2429da1d5befe4c076, type: 3}
  m_Name: CB_Numbers
  m_EditorClassIdentifier: 
  _cardData:
  - _identifier: 1
    _sprite: {fileID: 1422184923334757970, guid: c8af1a8b121e7d34ea1b027901ffcac3,
      type: 3}
    _isSpriteRotated: 0
  - _identifier: 2
    _sprite: {fileID: 1808195818850983521, guid: c8af1a8b121e7d34ea1b027901ffcac3,
      type: 3}
    _isSpriteRotated: 0
  - _identifier: 3
    _sprite: {fileID: -7900951133411543555, guid: c8af1a8b121e7d34ea1b027901ffcac3,
      type: 3}
    _isSpriteRotated: 0
  - _identifier: 4
    _sprite: {fileID: 2267071060405275165, guid: c8af1a8b121e7d34ea1b027901ffcac3,
      type: 3}
    _isSpriteRotated: 0
  - _identifier: 5
    _sprite: {fileID: -7398325283844340781, guid: c8af1a8b121e7d34ea1b027901ffcac3,
      type: 3}
    _isSpriteRotated: 0
  - _identifier: 6
    _sprite: {fileID: -7015292045520539579, guid: c8af1a8b121e7d34ea1b027901ffcac3,
      type: 3}
    _isSpriteRotated: 0
  - _identifier: 7
    _sprite: {fileID: -675344402919758444, guid: c8af1a8b121e7d34ea1b027901ffcac3,
      type: 3}
    _isSpriteRotated: 1
  - _identifier: 8
    _sprite: {fileID: 3547489320769246608, guid: c8af1a8b121e7d34ea1b027901ffcac3,
      type: 3}
    _isSpriteRotated: 1
  - _identifier: 9
    _sprite: {fileID: -1155199509967091035, guid: 4a4ed2f31a106fb4ba7a7193589107f0,
      type: 3}
    _isSpriteRotated: 0
