{
	"mcu":{
		"info":{
			"pn":"atsamd21j18a",
			"arch":"arm",
			"mfg":"atsam",
			"family":"d",
			"bit":"32",
			"addr_sz": "32"
		},

		"irq_vector":[
			"example"
		],
		
		"memory_map":{
			"rom_start": "0x0",
			"ram_start": "0x0",
			"periph_base": "0x0",
			"buses":{
				"example":{
					"base": "0x0"
				}
			},

			"system_start":			"0x1FFFF000",
			"system_end":       	"0x1FFFF800",
			"optbytes_start":   	"0x1FFFF800",
			"optbytes_end":     	"0x1FFFF80F",
			"cm3_periph_start": 	"0xE0000000",
			"cm3_periph_end":   	"0xE0100000"
		},
		"peripherals":[
			"adc",
			"dac",
			"dma",
			"gpio",
			"i2c",
			"spi",
			"timer",
			"usart",
			"usb"



		]

	}

}
