module gitlab.com/slagit/vault/gitlabci

go 1.14

require (
	github.com/armon/go-radix v1.0.0 // indirect
	github.com/fatih/color v1.9.0 // indirect
	github.com/frankban/quicktest v1.4.1 // indirect
	github.com/go-test/deep v1.0.2 // indirect
	github.com/google/go-cmp v0.4.0 // indirect
	github.com/hashicorp/errwrap v1.1.0
	github.com/hashicorp/go-hclog v0.15.0
	github.com/hashicorp/go-immutable-radix v1.1.0 // indirect
	github.com/hashicorp/go-multierror v1.1.0
	github.com/hashicorp/go-rootcerts v1.0.2 // indirect
	github.com/hashicorp/go-version v1.2.0 // indirect
	github.com/hashicorp/golang-lru v0.5.3 // indirect
	github.com/hashicorp/vault/api v1.0.5-0.20200317185738-82f498082f02
	github.com/hashicorp/vault/sdk v0.1.14-0.20200521112254-72d69106be02
	github.com/hashicorp/yamux v0.0.0-20181012175058-2f1d1f20f75d // indirect
	github.com/kr/pretty v0.2.0 // indirect
	github.com/mattn/go-isatty v0.0.12 // indirect
	github.com/mitchellh/mapstructure v1.4.1
	github.com/pierrec/lz4 v2.2.6+incompatible // indirect
	github.com/stretchr/testify v1.7.0
	golang.org/x/crypto v0.0.0-20200117160349-530e935923ad // indirect
	golang.org/x/net v0.0.0-20200114155413-6afb5195e5aa // indirect
	golang.org/x/sys v0.0.0-20200124204421-9fbb57f87de9 // indirect
	golang.org/x/text v0.3.2 // indirect
	google.golang.org/genproto v0.0.0-20190801165951-fa694d86fc64 // indirect
	google.golang.org/grpc v1.23.1 // indirect
	gopkg.in/check.v1 v1.0.0-20190902080502-41f04d3bba15 // indirect
	gopkg.in/square/go-jose.v2 v2.4.1 // indirect
)
