{
    "name": "com.skydragames.statemachine",
    "rootNamespace": "Skydra.StateMachine",
    "references": [
        "GUID:ad54e992d134b04478dea8e2314376c1"
    ],
    "includePlatforms": [],
    "excludePlatforms": [],
    "allowUnsafeCode": false,
    "overrideReferences": false,
    "precompiledReferences": [],
    "autoReferenced": true,
    "defineConstraints": [],
    "versionDefines": [],
    "noEngineReferences": false
}