%YAML 1.1
%TAG !u! tag:unity3d.com,2011:
--- !u!114 &11400000
MonoBehaviour:
  m_ObjectHideFlags: 0
  m_CorrespondingSourceObject: {fileID: 0}
  m_PrefabInstance: {fileID: 0}
  m_PrefabAsset: {fileID: 0}
  m_GameObject: {fileID: 0}
  m_Enabled: 1
  m_EditorHideFlags: 0
  m_Script: {fileID: 11500000, guid: 9bb7ef954067f5e4da07b6fc484d3be6, type: 3}
  m_Name: TestCharacter
  m_EditorClassIdentifier: 
  Stats:
  - {fileID: 11400000, guid: e73205953d6900f48a26b82c9c810000, type: 2}
  - {fileID: 11400000, guid: 7b6d0346018cef145b16ab86bd89458c, type: 2}
  - {fileID: 11400000, guid: c69a2d63dd4c5aa4898ce31ece8df1be, type: 2}
  - {fileID: 11400000, guid: 6186530c65444354db25c6f91a1b0350, type: 2}
