module gitlab.com/meisskywalker/echo-basic-auth

go 1.22.3

require github.com/labstack/echo/v4 v4.12.0

require (
	github.com/golang-jwt/jwt v3.2.2+incompatible // indirect
	github.com/joho/godotenv v1.5.1 // indirect
	github.com/labstack/gommon v0.4.2 // indirect
	github.com/mattn/go-colorable v0.1.13 // indirect
	github.com/mattn/go-isatty v0.0.20 // indirect
	github.com/valyala/bytebufferpool v1.0.0 // indirect
	github.com/valyala/fasttemplate v1.2.2 // indirect
	golang.org/x/crypto v0.24.0 // indirect
	golang.org/x/net v0.26.0 // indirect
	golang.org/x/sys v0.21.0 // indirect
	golang.org/x/text v0.16.0 // indirect
	golang.org/x/time v0.5.0 // indirect
)
