%YAML 1.1
%TAG !u! tag:unity3d.com,2011:
--- !u!114 &11400000
MonoBehaviour:
  m_ObjectHideFlags: 0
  m_CorrespondingSourceObject: {fileID: 0}
  m_PrefabInstance: {fileID: 0}
  m_PrefabAsset: {fileID: 0}
  m_GameObject: {fileID: 0}
  m_Enabled: 1
  m_EditorHideFlags: 0
  m_Script: {fileID: 11500000, guid: 6dcd730eacb2043e8a6f1c61c16243da, type: 3}
  m_Name: IronSourceMediatedNetworkSettings
  m_EditorClassIdentifier: 
  EnableAdmob: 1
  AdmobAndroidAppId: ca-app-pub-1370756799605534~5180791130
  AdmobIOSAppId: ca-app-pub-1370756799605534~1500490441
