com/example/demodemo/Service.class
serivce/UserService.class
dto/PostStd.class
com/example/demodemo/DemodemoApplication.class
models/Users.class
com/example/demodemo/DemodemoApplication$1.class
dto/BaseResp.class
com/example/demodemo/Stud.class
repository/UsersRepository.class
com/example/demodemo/SimpleCORSFilter.class
com/example/demodemo/DbRes.class
