../Core/Src/stm32f4xx_hal_msp.c:64:6:HAL_MspInit	16	static
../Core/Src/stm32f4xx_hal_msp.c:86:6:HAL_SPI_MspInit	48	static
../Core/Src/stm32f4xx_hal_msp.c:131:6:HAL_SPI_MspDeInit	16	static
../Core/Src/stm32f4xx_hal_msp.c:163:6:HAL_UART_MspInit	48	static
../Core/Src/stm32f4xx_hal_msp.c:199:6:HAL_UART_MspDeInit	16	static
