../Core/Src/main.cpp:70:5:int main()	32	static
../Core/Src/main.cpp:138:6:void SystemClock_Config()	88	static
../Core/Src/main.cpp:186:13:void MX_SPI1_Init()	8	static
../Core/Src/main.cpp:224:13:void MX_USART3_UART_Init()	8	static
../Core/Src/main.cpp:257:13:void MX_GPIO_Init()	56	static
../Core/Src/main.cpp:374:6:void Error_Handler()	4	static,ignoring_inline_asm
