../Core/Src/main.cpp:75:6:void HAL_FDCAN_RxFifo0Callback(FDCAN_HandleTypeDef*, uint32_t)	16	static
../Core/Src/main.cpp:98:5:int main()	200	static
../Core/Src/main.cpp:195:6:void SystemClock_Config()	120	static
../Core/Src/main.cpp:252:13:void MX_FDCAN1_Init()	8	static
../Core/Src/main.cpp:295:13:void MX_ICACHE_Init()	8	static
../Core/Src/main.cpp:323:13:void MX_MEMORYMAP_Init()	4	static
../Core/Src/main.cpp:344:13:void MX_SPI1_Init()	8	static
../Core/Src/main.cpp:391:13:void MX_USB_PCD_Init()	8	static
../Core/Src/main.cpp:427:13:void MX_GPIO_Init()	48	static
../Core/Src/main.cpp:506:6:void Error_Handler()	4	static,ignoring_inline_asm
