../Core/Src/stm32h5xx_hal_msp.c:64:6:HAL_MspInit	4	static
../Core/Src/stm32h5xx_hal_msp.c:83:6:HAL_FDCAN_MspInit	184	static
../Core/Src/stm32h5xx_hal_msp.c:143:6:HAL_FDCAN_MspDeInit	16	static
../Core/Src/stm32h5xx_hal_msp.c:174:6:HAL_SPI_MspInit	184	static
../Core/Src/stm32h5xx_hal_msp.c:228:6:HAL_SPI_MspDeInit	16	static
../Core/Src/stm32h5xx_hal_msp.c:257:6:HAL_PCD_MspInit	184	static
../Core/Src/stm32h5xx_hal_msp.c:303:6:HAL_PCD_MspDeInit	16	static
