(footprint "SOIC8-N_MC_MCH" (version 20211014) (generator pcbnew)
  (layer "F.Cu")
  (tags "MCP2562FD-E/SN ")
  (attr smd)
  (fp_text reference "REF**" (at 0 0 unlocked) (layer F.SilkS)
    (effects (font (size 1 1) (thickness 0.15)))
  )
  (fp_text value SOIC8-N_MC_MCH (at 0 0 unlocked) (layer F.Fab)
    (effects (font (size 1 1) (thickness 0.15)))
  )
  (fp_text user "${REFERENCE}" (at 0 0 unlocked) (layer F.Fab)
    (effects (font (size 1 1) (thickness 0.15)))
  )
  (fp_text user "*" (at -2.5654 -3.556) (layer F.SilkS)
    (effects (font (size 1 1) (thickness 0.15)))
  )
  (fp_text user "*" (at -1.5748 -2.3749) (layer F.Fab)
    (effects (font (size 1 1) (thickness 0.15)))
  )
  (fp_line (start -1.9558 -1.651) (end -1.9558 -2.159) (layer "F.Fab") (width 0.0254))
  (fp_line (start -1.9558 -2.159) (end -2.9972 -2.159) (layer "F.Fab") (width 0.0254))
  (fp_line (start -2.9972 -2.159) (end -2.9972 -1.651) (layer "F.Fab") (width 0.0254))
  (fp_line (start -2.9972 -1.651) (end -1.9558 -1.651) (layer "F.Fab") (width 0.0254))
  (fp_line (start -1.9558 -0.381) (end -1.9558 -0.889) (layer "F.Fab") (width 0.0254))
  (fp_line (start -1.9558 -0.889) (end -2.9972 -0.889) (layer "F.Fab") (width 0.0254))
  (fp_line (start -2.9972 -0.889) (end -2.9972 -0.381) (layer "F.Fab") (width 0.0254))
  (fp_line (start -2.9972 -0.381) (end -1.9558 -0.381) (layer "F.Fab") (width 0.0254))
  (fp_line (start -1.9558 0.889) (end -1.9558 0.381) (layer "F.Fab") (width 0.0254))
  (fp_line (start -1.9558 0.381) (end -2.9972 0.381) (layer "F.Fab") (width 0.0254))
  (fp_line (start -2.9972 0.381) (end -2.9972 0.889) (layer "F.Fab") (width 0.0254))
  (fp_line (start -2.9972 0.889) (end -1.9558 0.889) (layer "F.Fab") (width 0.0254))
  (fp_line (start -1.9558 2.159) (end -1.9558 1.651) (layer "F.Fab") (width 0.0254))
  (fp_line (start -1.9558 1.651) (end -2.9972 1.651) (layer "F.Fab") (width 0.0254))
  (fp_line (start -2.9972 1.651) (end -2.9972 2.159) (layer "F.Fab") (width 0.0254))
  (fp_line (start -2.9972 2.159) (end -1.9558 2.159) (layer "F.Fab") (width 0.0254))
  (fp_line (start 1.9558 1.651) (end 1.9558 2.159) (layer "F.Fab") (width 0.0254))
  (fp_line (start 1.9558 2.159) (end 2.9972 2.159) (layer "F.Fab") (width 0.0254))
  (fp_line (start 2.9972 2.159) (end 2.9972 1.651) (layer "F.Fab") (width 0.0254))
  (fp_line (start 2.9972 1.651) (end 1.9558 1.651) (layer "F.Fab") (width 0.0254))
  (fp_line (start 1.9558 0.381) (end 1.9558 0.889) (layer "F.Fab") (width 0.0254))
  (fp_line (start 1.9558 0.889) (end 2.9972 0.889) (layer "F.Fab") (width 0.0254))
  (fp_line (start 2.9972 0.889) (end 2.9972 0.381) (layer "F.Fab") (width 0.0254))
  (fp_line (start 2.9972 0.381) (end 1.9558 0.381) (layer "F.Fab") (width 0.0254))
  (fp_line (start 1.9558 -0.889) (end 1.9558 -0.381) (layer "F.Fab") (width 0.0254))
  (fp_line (start 1.9558 -0.381) (end 2.9972 -0.381) (layer "F.Fab") (width 0.0254))
  (fp_line (start 2.9972 -0.381) (end 2.9972 -0.889) (layer "F.Fab") (width 0.0254))
  (fp_line (start 2.9972 -0.889) (end 1.9558 -0.889) (layer "F.Fab") (width 0.0254))
  (fp_line (start 1.9558 -2.159) (end 1.9558 -1.651) (layer "F.Fab") (width 0.0254))
  (fp_line (start 1.9558 -1.651) (end 2.9972 -1.651) (layer "F.Fab") (width 0.0254))
  (fp_line (start 2.9972 -1.651) (end 2.9972 -2.159) (layer "F.Fab") (width 0.0254))
  (fp_line (start 2.9972 -2.159) (end 1.9558 -2.159) (layer "F.Fab") (width 0.0254))
  (fp_line (start -3.2512 2.2606) (end -3.2512 -2.2606) (layer "F.CrtYd") (width 0.1524))
  (fp_line (start -3.2512 -2.2606) (end -2.0574 -2.2606) (layer "F.CrtYd") (width 0.1524))
  (fp_line (start -2.0574 -2.2606) (end -2.0574 -2.5527) (layer "F.CrtYd") (width 0.1524))
  (fp_line (start -2.0574 -2.5527) (end 2.0574 -2.5527) (layer "F.CrtYd") (width 0.1524))
  (fp_line (start 2.0574 -2.5527) (end 2.0574 -2.2606) (layer "F.CrtYd") (width 0.1524))
  (fp_line (start 3.2512 -2.2606) (end 2.0574 -2.2606) (layer "F.CrtYd") (width 0.1524))
  (fp_line (start 3.2512 -2.2606) (end 3.2512 2.2606) (layer "F.CrtYd") (width 0.1524))
  (fp_line (start 3.2512 2.2606) (end 2.0574 2.2606) (layer "F.CrtYd") (width 0.1524))
  (fp_line (start 2.0574 2.2606) (end 2.0574 2.5527) (layer "F.CrtYd") (width 0.1524))
  (fp_line (start 2.0574 2.5527) (end -2.0574 2.5527) (layer "F.CrtYd") (width 0.1524))
  (fp_line (start -2.0574 2.5527) (end -2.0574 2.2606) (layer "F.CrtYd") (width 0.1524))
  (fp_line (start -3.2512 2.2606) (end -2.0574 2.2606) (layer "F.CrtYd") (width 0.1524))
  (fp_text user "*" (at -2.5654 -3.556 unlocked) (layer "F.SilkS")
    (effects (font (size 1 1) (thickness 0.15)))
  )
  (fp_text user "*" (at -1.5748 -2.3749 unlocked) (layer "F.Fab")
    (effects (font (size 1 1) (thickness 0.15)))
  )
  (fp_line (start -2.0828 2.5781) (end 2.0828 2.5781) (layer "F.SilkS") (width 0.1524))
  (fp_line (start 2.0828 -2.5781) (end -2.0828 -2.5781) (layer "F.SilkS") (width 0.1524))
  (fp_line (start -1.9558 2.4511) (end 1.9558 2.4511) (layer "F.Fab") (width 0.0254))
  (fp_line (start 1.9558 2.4511) (end 1.9558 -2.4511) (layer "F.Fab") (width 0.0254))
  (fp_line (start 1.9558 -2.4511) (end -1.9558 -2.4511) (layer "F.Fab") (width 0.0254))
  (fp_line (start -1.9558 -2.4511) (end -1.9558 2.4511) (layer "F.Fab") (width 0.0254))
  (fp_arc (start 0.3048 -2.4511) (mid 0 -2.1463) (end -0.3048 -2.4511) (layer "F.Fab") (width 0.0254))
  (pad "1" smd rect (at -2.3114 -1.905) (size 1.6764 0.508) (layers "F.Cu" "F.Paste" "F.Mask"))
  (pad "2" smd rect (at -2.3114 -0.635) (size 1.6764 0.508) (layers "F.Cu" "F.Paste" "F.Mask"))
  (pad "3" smd rect (at -2.3114 0.635) (size 1.6764 0.508) (layers "F.Cu" "F.Paste" "F.Mask"))
  (pad "4" smd rect (at -2.3114 1.905) (size 1.6764 0.508) (layers "F.Cu" "F.Paste" "F.Mask"))
  (pad "5" smd rect (at 2.3114 1.905) (size 1.6764 0.508) (layers "F.Cu" "F.Paste" "F.Mask"))
  (pad "6" smd rect (at 2.3114 0.635) (size 1.6764 0.508) (layers "F.Cu" "F.Paste" "F.Mask"))
  (pad "7" smd rect (at 2.3114 -0.635) (size 1.6764 0.508) (layers "F.Cu" "F.Paste" "F.Mask"))
  (pad "8" smd rect (at 2.3114 -1.905) (size 1.6764 0.508) (layers "F.Cu" "F.Paste" "F.Mask"))
)
