C:/Users/maksg/Documents/CE/agvfirmware/Drivers/STM32H7xx_HAL_Driver/Src/stm32h7xx_hal_dma_ex.c:120:19:HAL_DMAEx_MultiBufferStart	32	static
C:/Users/maksg/Documents/CE/agvfirmware/Drivers/STM32H7xx_HAL_Driver/Src/stm32h7xx_hal_dma_ex.c:217:19:HAL_DMAEx_MultiBufferStart_IT	32	static
C:/Users/maksg/Documents/CE/agvfirmware/Drivers/STM32H7xx_HAL_Driver/Src/stm32h7xx_hal_dma_ex.c:357:19:HAL_DMAEx_ChangeMemory	24	static
C:/Users/maksg/Documents/CE/agvfirmware/Drivers/STM32H7xx_HAL_Driver/Src/stm32h7xx_hal_dma_ex.c:396:19:HAL_DMAEx_ConfigMuxSync	24	static
C:/Users/maksg/Documents/CE/agvfirmware/Drivers/STM32H7xx_HAL_Driver/Src/stm32h7xx_hal_dma_ex.c:464:19:HAL_DMAEx_ConfigMuxRequestGenerator	24	static
C:/Users/maksg/Documents/CE/agvfirmware/Drivers/STM32H7xx_HAL_Driver/Src/stm32h7xx_hal_dma_ex.c:530:19:HAL_DMAEx_EnableMuxRequestGenerator	16	static
C:/Users/maksg/Documents/CE/agvfirmware/Drivers/STM32H7xx_HAL_Driver/Src/stm32h7xx_hal_dma_ex.c:556:19:HAL_DMAEx_DisableMuxRequestGenerator	16	static
C:/Users/maksg/Documents/CE/agvfirmware/Drivers/STM32H7xx_HAL_Driver/Src/stm32h7xx_hal_dma_ex.c:582:6:HAL_DMAEx_MUX_IRQHandler	16	static
C:/Users/maksg/Documents/CE/agvfirmware/Drivers/STM32H7xx_HAL_Driver/Src/stm32h7xx_hal_dma_ex.c:648:13:DMA_MultiBufferSetConfig	24	static
