C:/Users/maksg/Documents/CE/agvfirmware/Drivers/STM32H7xx_HAL_Driver/Src/stm32h7xx_hal_fdcan.c:287:19:HAL_FDCAN_Init	104	static
C:/Users/maksg/Documents/CE/agvfirmware/Drivers/STM32H7xx_HAL_Driver/Src/stm32h7xx_hal_fdcan.c:592:19:HAL_FDCAN_DeInit	16	static
C:/Users/maksg/Documents/CE/agvfirmware/Drivers/STM32H7xx_HAL_Driver/Src/stm32h7xx_hal_fdcan.c:638:13:HAL_FDCAN_MspInit	16	static
C:/Users/maksg/Documents/CE/agvfirmware/Drivers/STM32H7xx_HAL_Driver/Src/stm32h7xx_hal_fdcan.c:653:13:HAL_FDCAN_MspDeInit	16	static
C:/Users/maksg/Documents/CE/agvfirmware/Drivers/STM32H7xx_HAL_Driver/Src/stm32h7xx_hal_fdcan.c:668:19:HAL_FDCAN_EnterPowerDownMode	24	static
C:/Users/maksg/Documents/CE/agvfirmware/Drivers/STM32H7xx_HAL_Driver/Src/stm32h7xx_hal_fdcan.c:703:19:HAL_FDCAN_ExitPowerDownMode	24	static
C:/Users/maksg/Documents/CE/agvfirmware/Drivers/STM32H7xx_HAL_Driver/Src/stm32h7xx_hal_fdcan.c:1658:19:HAL_FDCAN_ConfigClockCalibration	16	static
C:/Users/maksg/Documents/CE/agvfirmware/Drivers/STM32H7xx_HAL_Driver/Src/stm32h7xx_hal_fdcan.c:1726:10:HAL_FDCAN_GetClockCalibrationState	16	static
C:/Users/maksg/Documents/CE/agvfirmware/Drivers/STM32H7xx_HAL_Driver/Src/stm32h7xx_hal_fdcan.c:1740:19:HAL_FDCAN_ResetClockCalibrationState	16	static
C:/Users/maksg/Documents/CE/agvfirmware/Drivers/STM32H7xx_HAL_Driver/Src/stm32h7xx_hal_fdcan.c:1776:10:HAL_FDCAN_GetClockCalibrationCounter	16	static
C:/Users/maksg/Documents/CE/agvfirmware/Drivers/STM32H7xx_HAL_Driver/Src/stm32h7xx_hal_fdcan.c:1807:19:HAL_FDCAN_ConfigFilter	32	static
C:/Users/maksg/Documents/CE/agvfirmware/Drivers/STM32H7xx_HAL_Driver/Src/stm32h7xx_hal_fdcan.c:1919:19:HAL_FDCAN_ConfigGlobalFilter	24	static
C:/Users/maksg/Documents/CE/agvfirmware/Drivers/STM32H7xx_HAL_Driver/Src/stm32h7xx_hal_fdcan.c:1959:19:HAL_FDCAN_ConfigExtendedIdMask	16	static
C:/Users/maksg/Documents/CE/agvfirmware/Drivers/STM32H7xx_HAL_Driver/Src/stm32h7xx_hal_fdcan.c:1993:19:HAL_FDCAN_ConfigRxFifoOverwrite	24	static
C:/Users/maksg/Documents/CE/agvfirmware/Drivers/STM32H7xx_HAL_Driver/Src/stm32h7xx_hal_fdcan.c:2036:19:HAL_FDCAN_ConfigFifoWatermark	24	static
C:/Users/maksg/Documents/CE/agvfirmware/Drivers/STM32H7xx_HAL_Driver/Src/stm32h7xx_hal_fdcan.c:2086:19:HAL_FDCAN_ConfigRamWatchdog	16	static
C:/Users/maksg/Documents/CE/agvfirmware/Drivers/STM32H7xx_HAL_Driver/Src/stm32h7xx_hal_fdcan.c:2116:19:HAL_FDCAN_ConfigTimestampCounter	16	static
C:/Users/maksg/Documents/CE/agvfirmware/Drivers/STM32H7xx_HAL_Driver/Src/stm32h7xx_hal_fdcan.c:2146:19:HAL_FDCAN_EnableTimestampCounter	16	static
C:/Users/maksg/Documents/CE/agvfirmware/Drivers/STM32H7xx_HAL_Driver/Src/stm32h7xx_hal_fdcan.c:2174:19:HAL_FDCAN_DisableTimestampCounter	16	static
C:/Users/maksg/Documents/CE/agvfirmware/Drivers/STM32H7xx_HAL_Driver/Src/stm32h7xx_hal_fdcan.c:2199:10:HAL_FDCAN_GetTimestampCounter	16	static
C:/Users/maksg/Documents/CE/agvfirmware/Drivers/STM32H7xx_HAL_Driver/Src/stm32h7xx_hal_fdcan.c:2210:19:HAL_FDCAN_ResetTimestampCounter	16	static
C:/Users/maksg/Documents/CE/agvfirmware/Drivers/STM32H7xx_HAL_Driver/Src/stm32h7xx_hal_fdcan.c:2241:19:HAL_FDCAN_ConfigTimeoutCounter	24	static
C:/Users/maksg/Documents/CE/agvfirmware/Drivers/STM32H7xx_HAL_Driver/Src/stm32h7xx_hal_fdcan.c:2270:19:HAL_FDCAN_EnableTimeoutCounter	16	static
C:/Users/maksg/Documents/CE/agvfirmware/Drivers/STM32H7xx_HAL_Driver/Src/stm32h7xx_hal_fdcan.c:2295:19:HAL_FDCAN_DisableTimeoutCounter	16	static
C:/Users/maksg/Documents/CE/agvfirmware/Drivers/STM32H7xx_HAL_Driver/Src/stm32h7xx_hal_fdcan.c:2320:10:HAL_FDCAN_GetTimeoutCounter	16	static
C:/Users/maksg/Documents/CE/agvfirmware/Drivers/STM32H7xx_HAL_Driver/Src/stm32h7xx_hal_fdcan.c:2331:19:HAL_FDCAN_ResetTimeoutCounter	16	static
C:/Users/maksg/Documents/CE/agvfirmware/Drivers/STM32H7xx_HAL_Driver/Src/stm32h7xx_hal_fdcan.c:2361:19:HAL_FDCAN_ConfigTxDelayCompensation	24	static
C:/Users/maksg/Documents/CE/agvfirmware/Drivers/STM32H7xx_HAL_Driver/Src/stm32h7xx_hal_fdcan.c:2390:19:HAL_FDCAN_EnableTxDelayCompensation	16	static
C:/Users/maksg/Documents/CE/agvfirmware/Drivers/STM32H7xx_HAL_Driver/Src/stm32h7xx_hal_fdcan.c:2415:19:HAL_FDCAN_DisableTxDelayCompensation	16	static
C:/Users/maksg/Documents/CE/agvfirmware/Drivers/STM32H7xx_HAL_Driver/Src/stm32h7xx_hal_fdcan.c:2441:19:HAL_FDCAN_EnableISOMode	16	static
C:/Users/maksg/Documents/CE/agvfirmware/Drivers/STM32H7xx_HAL_Driver/Src/stm32h7xx_hal_fdcan.c:2467:19:HAL_FDCAN_DisableISOMode	16	static
C:/Users/maksg/Documents/CE/agvfirmware/Drivers/STM32H7xx_HAL_Driver/Src/stm32h7xx_hal_fdcan.c:2493:19:HAL_FDCAN_EnableEdgeFiltering	16	static
C:/Users/maksg/Documents/CE/agvfirmware/Drivers/STM32H7xx_HAL_Driver/Src/stm32h7xx_hal_fdcan.c:2519:19:HAL_FDCAN_DisableEdgeFiltering	16	static
C:/Users/maksg/Documents/CE/agvfirmware/Drivers/STM32H7xx_HAL_Driver/Src/stm32h7xx_hal_fdcan.c:2579:19:HAL_FDCAN_Start	16	static
C:/Users/maksg/Documents/CE/agvfirmware/Drivers/STM32H7xx_HAL_Driver/Src/stm32h7xx_hal_fdcan.c:2610:19:HAL_FDCAN_Stop	24	static
C:/Users/maksg/Documents/CE/agvfirmware/Drivers/STM32H7xx_HAL_Driver/Src/stm32h7xx_hal_fdcan.c:2692:19:HAL_FDCAN_AddMessageToTxFifoQ	32	static
C:/Users/maksg/Documents/CE/agvfirmware/Drivers/STM32H7xx_HAL_Driver/Src/stm32h7xx_hal_fdcan.c:2770:19:HAL_FDCAN_AddMessageToTxBuffer	56	static,ignoring_inline_asm
C:/Users/maksg/Documents/CE/agvfirmware/Drivers/STM32H7xx_HAL_Driver/Src/stm32h7xx_hal_fdcan.c:2838:19:HAL_FDCAN_EnableTxBufferRequest	16	static
C:/Users/maksg/Documents/CE/agvfirmware/Drivers/STM32H7xx_HAL_Driver/Src/stm32h7xx_hal_fdcan.c:2865:10:HAL_FDCAN_GetLatestTxFifoQRequestBuffer	16	static
C:/Users/maksg/Documents/CE/agvfirmware/Drivers/STM32H7xx_HAL_Driver/Src/stm32h7xx_hal_fdcan.c:2879:19:HAL_FDCAN_AbortTxRequest	16	static
C:/Users/maksg/Documents/CE/agvfirmware/Drivers/STM32H7xx_HAL_Driver/Src/stm32h7xx_hal_fdcan.c:2908:19:HAL_FDCAN_GetRxMessage	48	static
C:/Users/maksg/Documents/CE/agvfirmware/Drivers/STM32H7xx_HAL_Driver/Src/stm32h7xx_hal_fdcan.c:3103:19:HAL_FDCAN_GetTxEvent	32	static
C:/Users/maksg/Documents/CE/agvfirmware/Drivers/STM32H7xx_HAL_Driver/Src/stm32h7xx_hal_fdcan.c:3198:19:HAL_FDCAN_GetHighPriorityMessageStatus	16	static
C:/Users/maksg/Documents/CE/agvfirmware/Drivers/STM32H7xx_HAL_Driver/Src/stm32h7xx_hal_fdcan.c:3216:19:HAL_FDCAN_GetProtocolStatus	24	static
C:/Users/maksg/Documents/CE/agvfirmware/Drivers/STM32H7xx_HAL_Driver/Src/stm32h7xx_hal_fdcan.c:3247:19:HAL_FDCAN_GetErrorCounters	24	static
C:/Users/maksg/Documents/CE/agvfirmware/Drivers/STM32H7xx_HAL_Driver/Src/stm32h7xx_hal_fdcan.c:3274:10:HAL_FDCAN_IsRxBufferMessageAvailable	24	static
C:/Users/maksg/Documents/CE/agvfirmware/Drivers/STM32H7xx_HAL_Driver/Src/stm32h7xx_hal_fdcan.c:3311:10:HAL_FDCAN_IsTxBufferMessagePending	16	static
C:/Users/maksg/Documents/CE/agvfirmware/Drivers/STM32H7xx_HAL_Driver/Src/stm32h7xx_hal_fdcan.c:3331:10:HAL_FDCAN_GetRxFifoFillLevel	24	static
C:/Users/maksg/Documents/CE/agvfirmware/Drivers/STM32H7xx_HAL_Driver/Src/stm32h7xx_hal_fdcan.c:3358:10:HAL_FDCAN_GetTxFifoFreeLevel	24	static
C:/Users/maksg/Documents/CE/agvfirmware/Drivers/STM32H7xx_HAL_Driver/Src/stm32h7xx_hal_fdcan.c:3376:10:HAL_FDCAN_IsRestrictedOperationMode	24	static
C:/Users/maksg/Documents/CE/agvfirmware/Drivers/STM32H7xx_HAL_Driver/Src/stm32h7xx_hal_fdcan.c:3392:19:HAL_FDCAN_ExitRestrictedOperationMode	24	static
C:/Users/maksg/Documents/CE/agvfirmware/Drivers/STM32H7xx_HAL_Driver/Src/stm32h7xx_hal_fdcan.c:3458:19:HAL_FDCAN_TT_ConfigOperation	32	static
C:/Users/maksg/Documents/CE/agvfirmware/Drivers/STM32H7xx_HAL_Driver/Src/stm32h7xx_hal_fdcan.c:3636:19:HAL_FDCAN_TT_ConfigReferenceMessage	24	static
C:/Users/maksg/Documents/CE/agvfirmware/Drivers/STM32H7xx_HAL_Driver/Src/stm32h7xx_hal_fdcan.c:3684:19:HAL_FDCAN_TT_ConfigTrigger	48	static,ignoring_inline_asm
C:/Users/maksg/Documents/CE/agvfirmware/Drivers/STM32H7xx_HAL_Driver/Src/stm32h7xx_hal_fdcan.c:3794:19:HAL_FDCAN_TT_SetGlobalTime	24	static
C:/Users/maksg/Documents/CE/agvfirmware/Drivers/STM32H7xx_HAL_Driver/Src/stm32h7xx_hal_fdcan.c:3868:19:HAL_FDCAN_TT_SetClockSynchronization	24	static
C:/Users/maksg/Documents/CE/agvfirmware/Drivers/STM32H7xx_HAL_Driver/Src/stm32h7xx_hal_fdcan.c:3944:19:HAL_FDCAN_TT_ConfigStopWatch	32	static
C:/Users/maksg/Documents/CE/agvfirmware/Drivers/STM32H7xx_HAL_Driver/Src/stm32h7xx_hal_fdcan.c:4005:19:HAL_FDCAN_TT_ConfigRegisterTimeMark	40	static
C:/Users/maksg/Documents/CE/agvfirmware/Drivers/STM32H7xx_HAL_Driver/Src/stm32h7xx_hal_fdcan.c:4126:19:HAL_FDCAN_TT_EnableRegisterTimeMarkPulse	24	static
C:/Users/maksg/Documents/CE/agvfirmware/Drivers/STM32H7xx_HAL_Driver/Src/stm32h7xx_hal_fdcan.c:4176:19:HAL_FDCAN_TT_DisableRegisterTimeMarkPulse	24	static
C:/Users/maksg/Documents/CE/agvfirmware/Drivers/STM32H7xx_HAL_Driver/Src/stm32h7xx_hal_fdcan.c:4226:19:HAL_FDCAN_TT_EnableTriggerTimeMarkPulse	24	static
C:/Users/maksg/Documents/CE/agvfirmware/Drivers/STM32H7xx_HAL_Driver/Src/stm32h7xx_hal_fdcan.c:4287:19:HAL_FDCAN_TT_DisableTriggerTimeMarkPulse	24	static
C:/Users/maksg/Documents/CE/agvfirmware/Drivers/STM32H7xx_HAL_Driver/Src/stm32h7xx_hal_fdcan.c:4348:19:HAL_FDCAN_TT_EnableHardwareGapControl	24	static
C:/Users/maksg/Documents/CE/agvfirmware/Drivers/STM32H7xx_HAL_Driver/Src/stm32h7xx_hal_fdcan.c:4409:19:HAL_FDCAN_TT_DisableHardwareGapControl	24	static
C:/Users/maksg/Documents/CE/agvfirmware/Drivers/STM32H7xx_HAL_Driver/Src/stm32h7xx_hal_fdcan.c:4472:19:HAL_FDCAN_TT_EnableTimeMarkGapControl	24	static
C:/Users/maksg/Documents/CE/agvfirmware/Drivers/STM32H7xx_HAL_Driver/Src/stm32h7xx_hal_fdcan.c:4533:19:HAL_FDCAN_TT_DisableTimeMarkGapControl	24	static
C:/Users/maksg/Documents/CE/agvfirmware/Drivers/STM32H7xx_HAL_Driver/Src/stm32h7xx_hal_fdcan.c:4594:19:HAL_FDCAN_TT_SetNextIsGap	24	static
C:/Users/maksg/Documents/CE/agvfirmware/Drivers/STM32H7xx_HAL_Driver/Src/stm32h7xx_hal_fdcan.c:4664:19:HAL_FDCAN_TT_SetEndOfGap	24	static
C:/Users/maksg/Documents/CE/agvfirmware/Drivers/STM32H7xx_HAL_Driver/Src/stm32h7xx_hal_fdcan.c:4738:19:HAL_FDCAN_TT_ConfigExternalSyncPhase	24	static
C:/Users/maksg/Documents/CE/agvfirmware/Drivers/STM32H7xx_HAL_Driver/Src/stm32h7xx_hal_fdcan.c:4779:19:HAL_FDCAN_TT_EnableExternalSynchronization	24	static
C:/Users/maksg/Documents/CE/agvfirmware/Drivers/STM32H7xx_HAL_Driver/Src/stm32h7xx_hal_fdcan.c:4829:19:HAL_FDCAN_TT_DisableExternalSynchronization	24	static
C:/Users/maksg/Documents/CE/agvfirmware/Drivers/STM32H7xx_HAL_Driver/Src/stm32h7xx_hal_fdcan.c:4880:19:HAL_FDCAN_TT_GetOperationStatus	24	static
C:/Users/maksg/Documents/CE/agvfirmware/Drivers/STM32H7xx_HAL_Driver/Src/stm32h7xx_hal_fdcan.c:4944:19:HAL_FDCAN_ConfigInterruptLines	32	static
C:/Users/maksg/Documents/CE/agvfirmware/Drivers/STM32H7xx_HAL_Driver/Src/stm32h7xx_hal_fdcan.c:4986:19:HAL_FDCAN_TT_ConfigInterruptLines	32	static
C:/Users/maksg/Documents/CE/agvfirmware/Drivers/STM32H7xx_HAL_Driver/Src/stm32h7xx_hal_fdcan.c:5032:19:HAL_FDCAN_ActivateNotification	32	static
C:/Users/maksg/Documents/CE/agvfirmware/Drivers/STM32H7xx_HAL_Driver/Src/stm32h7xx_hal_fdcan.c:5095:19:HAL_FDCAN_DeactivateNotification	24	static
C:/Users/maksg/Documents/CE/agvfirmware/Drivers/STM32H7xx_HAL_Driver/Src/stm32h7xx_hal_fdcan.c:5154:19:HAL_FDCAN_TT_ActivateNotification	24	static
C:/Users/maksg/Documents/CE/agvfirmware/Drivers/STM32H7xx_HAL_Driver/Src/stm32h7xx_hal_fdcan.c:5204:19:HAL_FDCAN_TT_DeactivateNotification	24	static
C:/Users/maksg/Documents/CE/agvfirmware/Drivers/STM32H7xx_HAL_Driver/Src/stm32h7xx_hal_fdcan.c:5250:6:HAL_FDCAN_IRQHandler	96	static
C:/Users/maksg/Documents/CE/agvfirmware/Drivers/STM32H7xx_HAL_Driver/Src/stm32h7xx_hal_fdcan.c:5680:13:HAL_FDCAN_ClockCalibrationCallback	16	static
C:/Users/maksg/Documents/CE/agvfirmware/Drivers/STM32H7xx_HAL_Driver/Src/stm32h7xx_hal_fdcan.c:5699:13:HAL_FDCAN_TxEventFifoCallback	16	static
C:/Users/maksg/Documents/CE/agvfirmware/Drivers/STM32H7xx_HAL_Driver/Src/stm32h7xx_hal_fdcan.c:5718:13:HAL_FDCAN_RxFifo0Callback	16	static
C:/Users/maksg/Documents/CE/agvfirmware/Drivers/STM32H7xx_HAL_Driver/Src/stm32h7xx_hal_fdcan.c:5737:13:HAL_FDCAN_RxFifo1Callback	16	static
C:/Users/maksg/Documents/CE/agvfirmware/Drivers/STM32H7xx_HAL_Driver/Src/stm32h7xx_hal_fdcan.c:5754:13:HAL_FDCAN_TxFifoEmptyCallback	16	static
C:/Users/maksg/Documents/CE/agvfirmware/Drivers/STM32H7xx_HAL_Driver/Src/stm32h7xx_hal_fdcan.c:5772:13:HAL_FDCAN_TxBufferCompleteCallback	16	static
C:/Users/maksg/Documents/CE/agvfirmware/Drivers/STM32H7xx_HAL_Driver/Src/stm32h7xx_hal_fdcan.c:5791:13:HAL_FDCAN_TxBufferAbortCallback	16	static
C:/Users/maksg/Documents/CE/agvfirmware/Drivers/STM32H7xx_HAL_Driver/Src/stm32h7xx_hal_fdcan.c:5808:13:HAL_FDCAN_RxBufferNewMessageCallback	16	static
C:/Users/maksg/Documents/CE/agvfirmware/Drivers/STM32H7xx_HAL_Driver/Src/stm32h7xx_hal_fdcan.c:5824:13:HAL_FDCAN_TimestampWraparoundCallback	16	static
C:/Users/maksg/Documents/CE/agvfirmware/Drivers/STM32H7xx_HAL_Driver/Src/stm32h7xx_hal_fdcan.c:5840:13:HAL_FDCAN_TimeoutOccurredCallback	16	static
C:/Users/maksg/Documents/CE/agvfirmware/Drivers/STM32H7xx_HAL_Driver/Src/stm32h7xx_hal_fdcan.c:5856:13:HAL_FDCAN_HighPriorityMessageCallback	16	static
C:/Users/maksg/Documents/CE/agvfirmware/Drivers/STM32H7xx_HAL_Driver/Src/stm32h7xx_hal_fdcan.c:5872:13:HAL_FDCAN_ErrorCallback	16	static
C:/Users/maksg/Documents/CE/agvfirmware/Drivers/STM32H7xx_HAL_Driver/Src/stm32h7xx_hal_fdcan.c:5890:13:HAL_FDCAN_ErrorStatusCallback	16	static
C:/Users/maksg/Documents/CE/agvfirmware/Drivers/STM32H7xx_HAL_Driver/Src/stm32h7xx_hal_fdcan.c:5909:13:HAL_FDCAN_TT_ScheduleSyncCallback	16	static
C:/Users/maksg/Documents/CE/agvfirmware/Drivers/STM32H7xx_HAL_Driver/Src/stm32h7xx_hal_fdcan.c:5928:13:HAL_FDCAN_TT_TimeMarkCallback	16	static
C:/Users/maksg/Documents/CE/agvfirmware/Drivers/STM32H7xx_HAL_Driver/Src/stm32h7xx_hal_fdcan.c:5950:13:HAL_FDCAN_TT_StopWatchCallback	24	static
C:/Users/maksg/Documents/CE/agvfirmware/Drivers/STM32H7xx_HAL_Driver/Src/stm32h7xx_hal_fdcan.c:5970:13:HAL_FDCAN_TT_GlobalTimeCallback	16	static
C:/Users/maksg/Documents/CE/agvfirmware/Drivers/STM32H7xx_HAL_Driver/Src/stm32h7xx_hal_fdcan.c:6006:24:HAL_FDCAN_GetState	16	static
C:/Users/maksg/Documents/CE/agvfirmware/Drivers/STM32H7xx_HAL_Driver/Src/stm32h7xx_hal_fdcan.c:6018:10:HAL_FDCAN_GetError	16	static
C:/Users/maksg/Documents/CE/agvfirmware/Drivers/STM32H7xx_HAL_Driver/Src/stm32h7xx_hal_fdcan.c:6042:26:FDCAN_CalcultateRamBlockAddresses	24	static
C:/Users/maksg/Documents/CE/agvfirmware/Drivers/STM32H7xx_HAL_Driver/Src/stm32h7xx_hal_fdcan.c:6141:13:FDCAN_CopyMessageToRAM	40	static
