../Core/Src/FD.cpp:11:1:FD::FD()	16	static
../Core/Src/FD.cpp:16:1:FD::~FD()	16	static
../Core/Src/FD.cpp:16:1:virtual FD::~FD()	16	static
../Core/Src/FD.cpp:20:6:void FD::bind(FDCAN_HandleTypeDef)	16	static
../Core/Src/FD.cpp:24:5:int FD::put_to_tx(uint32_t, uint8_t*)	24	static
../Core/Src/FD.cpp:42:5:int FD::put_to_tx(can_frame*)	16	static
