../Core/Src/moteus.cpp:13:1:moteus::moteus(uint8_t)	16	static
../Core/Src/moteus.cpp:21:1:moteus::~moteus()	16	static
../Core/Src/moteus.cpp:21:1:virtual moteus::~moteus()	16	static
../Core/Src/moteus.cpp:25:6:void moteus::velocity_payload(float, float, uint8_t*, uint8_t*)	48	static
../Core/Src/moteus.cpp:52:6:void moteus::velocity_frame(float, float, can_frame*)	40	static
../Core/Src/moteus.cpp:77:6:void moteus::stop_frame(can_frame*)	24	static
../Core/Src/moteus.cpp:90:6:void moteus::brake_frame(can_frame*)	24	static
../Core/Src/moteus.cpp:122:6:void moteus::standard_query(can_frame*)	24	static
../Core/Src/moteus.cpp:143:10:uint16_t moteus::make_identifier(uint8_t)	16	static
../Core/Src/moteus.cpp:159:6:void moteus::set_frame(can_frame)	32	static
../Core/Src/moteus.cpp:164:6:bool moteus::is_available()	16	static
../Core/Src/moteus.cpp:172:6:void moteus::log()	16	static
