title,salary,company,description
Завхоз,,компанія Авер-Тех,"Днепропетровскому филиалу торгово-производственной компании «Авер-ТЕХ» требуется ЗАВХОЗ.Требования: "
Завхоз,5000,компанія Омега,"Требования: "
Завхоз,8000,компанія Омега,"Национальная сеть супермаркетов «VARUS» приглашает в свою команду Завхоза.Требования:"
Заведующий,,компанія Crazy Land,"Crazy Land — успешная развивающаяся компания в сфере детских развлечений приглашает на работу заведующего хозяйством.Наши ожидания: опыт работы (желателен) и мастер на все руки .Мы предлагаем:"
Завідувач,3723,компанія Дніпропетровський коледж культури і мистецтв ДОР,"Требования:Условия работы:"
