%YAML 1.1
%TAG !u! tag:unity3d.com,2011:
--- !u!1045 &1
EditorBuildSettings:
  m_ObjectHideFlags: 0
  serializedVersion: 2
  m_Scenes:
  - enabled: 1
    path: Assets/Scenes/MainMenu.unity
    guid: 9fc0d4010bbf28b4594072e72b8655ab
  - enabled: 1
    path: Assets/Scenes/Levels/Level1.unity
    guid: b75a339366edd954c817207811b15a1a
  - enabled: 1
    path: Assets/Scenes/Levels/Level2.unity
    guid: 12106ed517a45204db166834c3946ea5
  - enabled: 1
    path: Assets/Scenes/Levels/Level3.unity
    guid: c5551a4962fc9bd4aad6ed1a564aebdf
  m_configObjects: {}
