[gd_scene load_steps=4 format=3 uid="uid://bcbidhdp5i4bc"]

[ext_resource type="ArrayMesh" uid="uid://cbs80y7eejkg0" path="res://assets/models/ships/rampart-class.obj" id="1_lvoh7"]
[ext_resource type="Script" path="res://scripts/ships/rampartClass.gd" id="1_p58g3"]

[sub_resource type="ConvexPolygonShape3D" id="ConvexPolygonShape3D_u7umd"]
points = PackedVector3Array(51.8424, 16.1948, 126.612, 13.2609, 59.0393, -79.0754, 28.9163, -24.5237, -115.547, -30.8306, -22.8661, 116.016, -51.0013, 16.1948, 126.612, -51.0013, 16.1948, -121.926, 51.8424, 16.1948, -121.926, -30.8306, -22.8661, -110.573, 28.9163, -24.5237, 120.658, -3.85508, 24.7519, 143.768, 64.0967, -3.69219, 34.4466, -58.3119, -11.2139, -59.9407, -16.7022, 46.1784, -19.0686, 56.8188, -12.003, -65.896, -16.7022, 20.465, -130.517, -63.8484, 7.62922, 32.3197, 17.5567, 59.0393, -70.5106, -58.3123, -11.2141, 30.1066, 60.4071, 7.62922, -70.5106, -24.157, -16.5864, 129.56, 4.69621, 59.0393, -70.5106, -63.8484, 7.62922, -66.2149, 17.5567, 20.465, -130.517, 4.69621, 24.7519, 143.768, 24.9987, -16.5864, 129.56, -42.4232, 20.465, 122.316, 43.2643, 20.465, 122.316, -53.3346, -14.5237, -58.649, -3.85508, 16.1948, 143.768, 4.69621, 59.0393, -79.0754, -61.2363, -6.92076, 25.8924, 50.3516, -14.5237, 29.6508)

[node name="RampartClass" type="RigidBody3D"]
script = ExtResource("1_p58g3")

[node name="MeshInstance3D" type="MeshInstance3D" parent="."]
mesh = ExtResource("1_lvoh7")

[node name="CollisionShape3D" type="CollisionShape3D" parent="."]
shape = SubResource("ConvexPolygonShape3D_u7umd")
