[
    {
        "model": "Ingredient",
        "data": {
            "Id": 1,
            "Label": "Tomate"
        }
    },
    {
        "model": "Ingredient",
        "data": {
            "Id": 2,
            "Label": "Oeuf"
        }
    },
    {
        "model": "Ingredient",
        "data": {
            "Id": 3,
            "Label": "Oignon"
        }
    },
    {
        "model": "Ingredient",
        "data": {
            "Id": 4,
            "Label": "Chocolat"
        }
    },
    {
        "model": "Ingredient",
        "data": {
            "Id": 5,
            "Label": "Beurre"
        }
    },
    {
        "model": "Ingredient",
        "data": {
            "Id": 6,
            "Label": "Farine"
        }
    },
    {
        "model": "Ingredient",
        "data": {
            "Id": 7,
            "Label": "Sucre en poudre"
        }
    }
]