[
    
    {
        "model": "Recipe",
        "data": {
            "Id": 1,
            "Title": "Gateau au chocolat",
            "Comment": "Attention a bien beurrer le moule avant de cuire ! A la sortie du four le gâteau ne paraît pas assez cuit. C'est normal, laissez-le refroidir puis démoulez- le.",
            "Duration": 40000,
            "User": 1
        }
    },
    {
        "model": "RecipeStep",
        "data": {
            "Text": "Préchauffez votre four à 180°C (thermostat 6). Dans une casserole, faites fondre le chocolat et le beurre coupé en morceaux à feu très doux.",
            "Order": 1,
            "Recipe": 1
        }
    },
    {
        "model": "RecipeStep",
        "data": {
            "Text": "Dans un saladier, ajoutez le sucre, les oeufs, la farine. Mélangez. Ajoutez le mélange chocolat/beurre. Mélangez bien.",
            "Order": 2,
            "Recipe": 1
        }
    },
    {
        "model": "RecipeStep",
        "data": {
            "Text": "Beurrez et farinez votre moule puis y versez la pâte à gâteau. Faites cuire au four environ 20 minutes.",
            "Order": 3,
            "Recipe": 1
        }
    },
    {
        "model": "RecipeIngredient",
        "data": {
            "Id": 1,
            "Amount": 200,
            "RecipeIngredientType": 2,
            "IngredientId": 4,
            "Recipe": 1
        }
    },
    {
        "model": "RecipeIngredient",
        "data": {
            "Id": 2,
            "Amount": 100,
            "RecipeIngredientType": 2,
            "Ingredient": 5,
            "Recipe": 1
        }
    },
    {
        "model": "RecipeIngredient",
        "data": {
            "Id": 3,
            "Amount": 3,
            "RecipeIngredientType": 1,
            "Ingredient": 2,
            "Recipe": 1
        }
    },
    {
        "model": "RecipeIngredient",
        "data": {
            "Id": 4,
            "Amount": 50,
            "RecipeIngredientType": 2,
            "Ingredient": 6,
            "Recipe": 1
        }
    },
    {
        "model": "RecipeIngredient",
        "data": {
            "Id": 5,
            "Amount": 100,
            "RecipeIngredientType": 2,
            "Ingredient": 7,
            "Recipe": 1
        }
    }
]