<?xml version="1.0" encoding="UTF-8"?>
<svg width="332px" height="305px" viewBox="0 0 332 305" version="1.1" xmlns="http://www.w3.org/2000/svg" xmlns:xlink="http://www.w3.org/1999/xlink">
    <!-- Generator: Sketch 63.1 (92452) - https://sketch.com -->
    <title>Page 1</title>
    <desc>Created with Sketch.</desc>
    <g id="Page-1" stroke="none" stroke-width="1" fill="none" fill-rule="evenodd">
        <g id="Vista-2" transform="translate(-914.000000, -357.000000)">
            <g id="Vista-General">
                <g id="Vista-1">
                    <rect id="Layout-Rectangle" fill="#970A44" x="150" y="0" width="1290" height="1024"></rect>
                    <rect id="Layout-Rectangle" fill="#720632" x="0" y="0" width="150" height="1024"></rect>
                    <rect id="Margen-Rectangle" stroke="#F6F4EB" stroke-width="2" x="181" y="120" width="1228" height="868" rx="60"></rect>
                    <g id="Icon-Projector" transform="translate(51.000000, 618.000000)" stroke="#F6F4EB" stroke-width="4">
                        <rect id="Combined-Shape" x="3" y="1" width="42" height="34" rx="2"></rect>
                        <g id="Group-25" stroke-linecap="round" transform="translate(14.000000, 35.000000)">
                            <line x1="17.5" y1="0" x2="17.5" y2="8" id="Path-60-Copy-4" transform="translate(17.500000, 4.000000) rotate(-45.000000) translate(-17.500000, -4.000000) "></line>
                            <line x1="3.5" y1="0" x2="3.5" y2="8" id="Path-60-Copy-4" transform="translate(3.500000, 4.000000) scale(-1, 1) rotate(-45.000000) translate(-3.500000, -4.000000) "></line>
                            <line x1="10.5" y1="0" x2="10.5" y2="8" id="Path-60-Copy-4" transform="translate(10.500000, 4.000000) scale(-1, 1) translate(-10.500000, -4.000000) "></line>
                        </g>
                        <line x1="48" y1="35" x2="1.42108547e-14" y2="35" id="Path-61" stroke-linecap="round"></line>
                        <line x1="48" y1="1" x2="1.42108547e-14" y2="1" id="Path-61-Copy" stroke-linecap="round"></line>
                        <polyline id="Path-62" stroke-linecap="round" stroke-linejoin="round" points="11 24.0234375 18.9082031 16.1152344 24.8774414 22.0844727 36.9619141 10"></polyline>
                    </g>
                    <g id="Icon-Plus-Sir" transform="translate(53.000000, 746.000000)">
                        <circle id="Oval" stroke="#F6F4EB" stroke-width="4" cx="22" cy="22" r="22"></circle>
                        <g id="Multipy" transform="translate(10.000000, 10.000000)" fill="#F6F4EB" fill-rule="nonzero">
                            <rect id="Rectangle" x="0.585786438" y="10" width="24" height="4" rx="2"></rect>
                            <path d="M2.58578602,10.0000004 L22.585786,10.0000004 C23.6903555,10.0000004 24.585786,10.8954309 24.585786,12.0000004 C24.585786,13.1045699 23.6903555,14.0000004 22.585786,14.0000004 L2.58578602,14.0000004 C1.48121652,14.0000004 0.585786019,13.1045699 0.585786019,12.0000004 C0.585786019,10.8954309 1.48121652,10.0000004 2.58578602,10.0000004 Z" id="Rectangle" transform="translate(12.585786, 12.000000) rotate(90.000000) translate(-12.585786, -12.000000) "></path>
                        </g>
                    </g>
                    <g id="Icon-Chart" transform="translate(43.000000, 875.000000)" stroke="#F6F4EB" stroke-width="4">
                        <g id="Chart" transform="translate(32.000000, 32.000000) rotate(45.000000) translate(-32.000000, -32.000000) translate(11.000000, 9.000000)">
                            <g id="Group-12" transform="translate(9.525126, 0.882991)">
                                <path d="M0.1626896,2.74924892 L10.4649294,14.2986162 L20.9780994,2.90290468 C17.8362005,1.01925589 14.2181623,0 10.44,0 C6.7669559,0 3.24467143,0.96311569 0.1626896,2.74924892 Z" id="Combined-Shape"></path>
                            </g>
                            <g id="Group-12" transform="translate(0.025126, 9.060660)">
                                <path d="M6.89884948,0.75148503 C2.55872439,4.5358591 0,9.9768448 0,15.8378378 C0,26.966263 9.1714464,36 20.5,36 C31.8285536,36 41,26.966263 41,15.8378378 C41,10.0830191 38.5338303,4.73107959 34.3288386,0.95322771 L20.475147,15.8638004 L6.89884948,0.75148503 Z" id="Combined-Shape"></path>
                            </g>
                        </g>
                    </g>
                    <g id="Icon-Multipy-Sir" transform="translate(51.000000, 33.000000)">
                        <circle id="Oval" stroke="#F6F4EB" stroke-width="4" cx="22" cy="22" r="22"></circle>
                        <g id="Multipy" transform="translate(22.500000, 22.000000) rotate(45.000000) translate(-22.500000, -22.000000) translate(10.000000, 10.000000)" fill="#F6F4EB" fill-rule="nonzero">
                            <rect id="Rectangle" x="0.585786438" y="10" width="24" height="4" rx="2"></rect>
                            <path d="M2.58578602,10.0000004 L22.585786,10.0000004 C23.6903555,10.0000004 24.585786,10.8954309 24.585786,12.0000004 C24.585786,13.1045699 23.6903555,14.0000004 22.585786,14.0000004 L2.58578602,14.0000004 C1.48121652,14.0000004 0.585786019,13.1045699 0.585786019,12.0000004 C0.585786019,10.8954309 1.48121652,10.0000004 2.58578602,10.0000004 Z" id="Rectangle" transform="translate(12.585786, 12.000000) rotate(90.000000) translate(-12.585786, -12.000000) "></path>
                        </g>
                    </g>
                    <g id="Icon-User" transform="translate(1366.000000, 33.000000)">
                        <circle id="Oval" stroke="#F6F4EB" stroke-width="4" cx="22" cy="22" r="22"></circle>
                        <path d="M22.1809068,28 C29.4825662,28 35.8703396,32.0106319 39.3618135,38 L34.942176,38 C31.9429757,34.1752608 27.3408477,31.7272727 22.1809068,31.7272727 C17.0209658,31.7272727 12.4188378,34.1752608 9.4196376,38 L5,38 C8.4914739,32.0106319 14.8792473,28 22.1809068,28 Z" id="Combined-Shape" fill="#F6F4EB" fill-rule="nonzero"></path>
                        <circle id="Oval" stroke="#F6F4EB" stroke-width="4" cx="22" cy="20" r="8"></circle>
                    </g>
                    <text id="Title-Page" font-family="AppleSymbols, Apple Symbols" font-size="40" font-weight="normal" letter-spacing="6.66666667" fill="#F9F8F1">
                        <tspan x="180" y="58">Title Page</tspan>
                    </text>
                    <text id="Joel-Aravena---Admin" font-family="AppleSymbols, Apple Symbols" font-size="26" font-weight="normal" letter-spacing="1" fill="#FBFBF6">
                        <tspan x="1118.86719" y="59">Joel Aravena - Admin</tspan>
                    </text>
                </g>
            </g>
            <g id="Grafico-2" transform="translate(889.000000, 259.000000)">
                <g id="Lineas-Grafico" transform="translate(25.000000, 98.000000)" stroke="#F6F4EB" stroke-linecap="square">
                    <path d="M0.5,304.5 L331.5,304.5 M0.5,0.5 L0.5,304.5" id="Line-8"></path>
                </g>
                <g id="Barras-grafico-2" transform="translate(52.000000, 185.000000)" fill="#F6F4EB" fill-opacity="0.69798951">
                    <rect id="Rectangle" x="0" y="83" width="52" height="135"></rect>
                    <rect id="Rectangle-Copy" x="249" y="39" width="52" height="179"></rect>
                    <rect id="Rectangle-Copy-2" x="166" y="0" width="52" height="218"></rect>
                    <rect id="Rectangle-Copy-3" x="83" y="138" width="52" height="80"></rect>
                </g>
                <rect id="Rectangle" stroke="#F6F4EB" transform="translate(188.000000, 239.000000) scale(-1, 1) translate(-188.000000, -239.000000) " x="0.5" y="48.5" width="375" height="381"></rect>
            </g>
        </g>
    </g>
</svg>