{
  "name": "echo",
  "type": "plugin",
  "expected_token_issuer": "https://ska-iam.stfc.ac.uk",
  "expected_service_token_scope": "echo-service",
  "version_number": 1,
  "description": "Permissions policy defining how to authorise echo service requests.",
  "plugin_module_name": "ska_src_permissions_api.plugins.echo",
  "plugin_class_name": "EchoServicePermissionPlugin"
}