{
  "name": "prepare_data",
  "type": "plugin",
  "expected_token_issuer": "https://ska-iam.stfc.ac.uk",
  "expected_service_token_scope": "prepare-data-service",
  "version_number": 1,
  "description": "Permissions policy defining how to authorise prepareData service requests.",
  "plugin_module_name": "ska_src_permissions_api.plugins.prepare_data",
  "plugin_class_name": "PrepareDataServicePermissionPlugin"
}