{
  "name": "gateway-backend-api",
  "type": "route",
  "iam_subgroup_name": "gateway-backend-api",
  "expected_token_issuer": "https://ska-iam.stfc.ac.uk",
  "expected_token_audience": "gateway-backend-api",
  "expected_service_token_scope": "gateway-backend-api-service",
  "version_number": 1,
  "description": "Permissions policy defining how to authorise routes for the science-gateway-backend API.",
  "roles": {
    "any": [],
    "admin": [
      "{service_group}/roles/admin"
    ]
  },
  "routes": {
    "/get_preferences": {
      "GET": "any"
    },
    "/get_preferences_for_user": {
      "GET": "admin"
    },
    "/set_preferences": {
      "PUT": "any"
    },
    "/set_preferences_for_user": {
      "PUT": "admin"
    },
    "/get_user_tokens": {
      "GET": "any"
    },
    "/set_user_token": {
      "PUT": "any"
    },
    "/site_capabilities/list_sites": {
      "GET": "any"
    },
    "/site_capabilities/list_compute": {
      "GET": "any"
    },
    "/site_capabilities/list_services": {
      "GET": "any"
    },
    "/data_management/move_data": {
      "POST": "any"
    },
    "/data_management/list_jobs": {
      "GET": "any"
    },
    "/data_management/clear_jobs": {
      "PUT": "any"
    },
    "/get_notifications": {
      "GET": "any"
    },
    "/add_notification": {
      "PUT": "any"
    },
    "/delete_notification": {
      "PUT": "any"
    }
  }
}
