{
  "name": "maltopuft-api",
  "type": "exchange",
  "iam_subgroup_name": "maltopuft-api",
  "expected_token_issuer": "https://ska-iam.stfc.ac.uk",
  "token_audience": "maltopuft-api",
  "version_number": 1,
  "description": "Permissions policy defining how to authorise token exchanges for the ska-src-maltopuft-backend API."
}