{
  "description": "Schema for permission policies with 'plugin' type. ",
  "properties": {
    "name": {
      "type": "string",
      "minLength": 1
    },
    "type": {
      "type": "string"
    },
    "expected_token_issuer": {
      "type": "string",
      "minLength": 1
    },
    "expected_service_token_scope": {
      "type": "string",
      "minLength": 1
    },
    "version_number": {
      "type": "number",
      "minLength": 1
    },
    "description": {
      "type": "string"
    },
    "plugin_module_name": {
      "type": "string"
    },
    "plugin_class_name": {
      "type": "string"
    }
  },
  "required": ["name", "type", "expected_token_issuer", "expected_service_token_scope", "version_number",
    "plugin_module_name", "plugin_class_name"],
  "additionalProperties": true
}

