{
  "description": "Schema for permission policies with 'exchange' type. ",
  "properties": {
    "name": {
      "type": "string",
      "minLength": 1
    },
    "type": {
      "type": "string"
    },
    "iam_subgroup_name": {
      "type": "string",
      "minLength": 1
    },
    "expected_token_issuer": {
      "type": "string",
      "minLength": 1
    },
    "token_audience": {
      "type": "string",
      "minLength": 1
    },
    "version_number": {
      "type": "number",
      "minLength": 1
    },
    "description": {
      "type": "string"
    }
  },
  "required": ["name", "type", "iam_subgroup_name", "expected_token_issuer", "token_audience","version_number"],
  "additionalProperties": true
}

