{
    "project": [
        {
            "name": "PI",
            "shortname": "pi",
            "description": "",
            "permitted_actions": [
                "version"
            ],
            "relative_weighting": 40
        },
        {
            "name": "Co-PI",
            "shortname": "copi",
            "description": "",
            "permitted_actions": [
                "version"
            ],
            "relative_weighting": 30
        },
        {
            "name": "Senior Scientist",
            "shortname": "ssci",
            "description": "",
            "permitted_actions": [
                "version"
            ],
            "relative_weighting": 20
        },
        {
            "name": "Junior Scientist",
            "shortname": "jsci",
            "description": "",
            "permitted_actions": [
                "version"
            ],
            "relative_weighting": 10
        },
        {
            "name": "Public",
            "shortname": "public",
            "description": "",
            "permitted_actions": [],
            "relative_weighting": 0
        }
    ]
}