{
    "interface": "https://schema.skao.int/ska-mid-cbf-initial-parameters/2.2",
    "tm_data_sources": ["car://gitlab.com/ska-telescope/ska-telmodel-data?main#tmdata"],
    "tm_data_filepath": "instrument/dishid_vcc_configuration/invalid_file_name.json"
}