{
    "pointing": {
        "target": {
            "reference_frame": "ICRS",
            "name": "Polaris Australis",
            "ra": "21:08:47.92",
            "dec": "-88:57:22.9"
        }
    },
    "dish": {
        "receiver_band": "2"
    }
}