{
    "interface": "https://schema.skao.int/ska-mid-cbf-initial-parameters/2.2",
    "tm_data_sources": ["gitlab://gitlab.com/ska-telescope/ska-tmc/ska-tmc-simulators?main#tmdata"],
    "tm_data_filepath": "instrument/dishid_vcc_map_configuration/mid_cbf_initial_parameters_invalid.json"
}