{
  "interface": "https://schema.skao.int/ska-csp-configure/2.0",
  "subarray": {
    "subarray_name": "science period 23"
  },
  "common": {
    "config_id": "sbi-mvp01-20200325-00001-science_A",
    "frequency_band": "1",
    "subarray_id": "1"
  },
  "cbf": {
    "delay_model_subscription_point": "mid-tmc/subarray-leaf-node-csp/01/delayModel",
    "fsp": [
      {
        "fsp_id": 1,
        "function_mode": "CORR",
        "frequency_slice_id": 1,
        "integration_factor": 1,
        "zoom_factor": 0,
        "channel_averaging_map": [
          [
            0,
            2
          ],
          [
            744,
            0
          ]
        ],
        "channel_offset": 0,
        "output_link_map": [
          [
            0,
            0
          ],
          [
            200,
            1
          ]
        ]

      },
      {
        "fsp_id": 2,
        "function_mode": "CORR",
        "frequency_slice_id": 2,
        "integration_factor": 1,
        "zoom_factor": 1,
        "zoom_window_tuning": 650000,
        "channel_averaging_map": [
          [
            0,
            2
          ],
          [
            744,
            0
          ]
        ],
        "channel_offset": 744,
        "output_link_map": [
          [
            0,
            4
          ],
          [
            200,
            5
          ]
        ],
        "output_host": [
          [
            0,
            "192.168.1.1"
          ]
        ],
        "output_port": [
          [
            0,
            9744,
            1
          ]
        ]
      }
    ],
    "vlbi": {

    }
  },
  "pss": {

  },
  "pst": {

  },
  "pointing": {
    "target": {
      "reference_frame": "SPECIAL",
      "target_name": "Sun"
    }
  }
}