nb_name,hostname,epoch,basename,npixel,pbtype,ra,dec,use_natural,integration_time,band,frequency,iscenario,onsource_I,onsource_Q,onsource_U,onsource_V
polarisation.py,MacBook-Pro,2020-04-30 15:18:28,exploratory,512,MID_FEKO_B1,0.1873412576635263,-0.8340802533340971,True,600.0,B1,[765000000.0],0,3.6155351649771756e-05,-0.00014836704770526804,-7.208411236014877e-05,6.116151388075172e-05
polarisation.py,MacBook-Pro,2020-04-30 15:18:36,exploratory,512,MID_FEKO_B1,0.18792170460434776,-0.8269433662598306,True,600.0,B1,[765000000.0],1,0.00010064674818007426,-5.6431019213707254e-05,4.4290318231497135e-05,1.3797217843330468e-05
polarisation.py,MacBook-Pro,2020-04-30 15:18:44,exploratory,512,MID_FEKO_B1,0.18848930310209377,-0.8198083682360582,True,600.0,B1,[765000000.0],2,0.00017897184954554122,5.2434796443900834e-05,0.0001143177738949102,-7.015781535735498e-05
polarisation.py,MacBook-Pro,2020-04-30 15:18:52,exploratory,512,MID_FEKO_B1,0.18904443879034333,-0.8126749014679151,True,600.0,B1,[765000000.0],3,0.000198758507209254,0.00014249860659661226,0.00014411853634670416,-0.00012822874169559072
polarisation.py,MacBook-Pro,2020-04-30 15:19:00,exploratory,512,MID_FEKO_B1,0.18958748115157215,-0.8055426086035331,True,600.0,B1,[765000000.0],4,0.00015024823028315123,0.00025550182422609335,0.00012047762936011293,-0.00013223122573613423
polarisation.py,MacBook-Pro,2020-04-30 15:19:09,exploratory,512,MID_FEKO_B1,0.19011878433517224,-0.7984111325846005,True,600.0,B1,[765000000.0],5,9.169953686090055e-05,0.00041760877574083217,8.787282034601834e-05,-9.914592203826391e-05
polarisation.py,MacBook-Pro,2020-04-30 15:19:16,exploratory,512,MID_FEKO_B1,0.19063868792556016,-0.7912801164965321,True,600.0,B1,[765000000.0],6,6.765698421878852e-05,0.0005848484601078972,9.789480300749881e-05,-6.863995661113261e-05
polarisation.py,MacBook-Pro,2020-04-30 15:19:24,exploratory,512,MID_FEKO_B1,0.19114751766386448,-0.7841492034181191,True,600.0,B1,[765000000.0],7,6.799022827175617e-05,0.0006873661443777803,0.00014252106558561512,-6.121805621614057e-05
polarisation.py,MacBook-Pro,2020-04-30 15:19:33,exploratory,512,MID_FEKO_B1,0.1916455861264041,-0.7770180362705266,True,600.0,B1,[765000000.0],8,7.660174106068842e-05,0.0006862584281341998,0.000172908516716909,-6.030539617373046e-05
polarisation.py,MacBook-Pro,2020-04-30 15:19:41,exploratory,512,MID_FEKO_B1,0.19213319336291879,-0.7698862576654946,True,600.0,B1,[765000000.0],9,0.00011166960494510768,0.0005923067037798864,0.00014625515294822884,-4.3158251338244436e-05
polarisation.py,MacBook-Pro,2020-04-30 15:19:49,exploratory,512,MID_FEKO_B1,0.19261062749727992,-0.7627535097525989,True,600.0,B1,[765000000.0],10,0.0001843334449203766,0.00045495347703127664,6.890188824749155e-05,1.696259068570415e-05
polarisation.py,MacBook-Pro,2020-04-30 15:19:59,exploratory,512,MID_FEKO_B1,0.19307816529320063,-0.7556194340654238,True,600.0,B1,[765000000.0],11,0.00025104675574018354,0.00032511665310838543,9.975567957829522e-06,4.208629384307176e-05
polarisation.py,MacBook-Pro,2020-04-30 15:20:07,exploratory,512,MID_FEKO_B1,0.1935360726872708,-0.7484836713664821,True,600.0,B1,[765000000.0],12,0.00025020821163690096,0.00022020673784814738,2.5829209114548742e-05,6.006375474412612e-05
polarisation.py,MacBook-Pro,2020-04-30 15:20:15,exploratory,512,MID_FEKO_B1,0.1939846052914662,-0.7413458614907299,True,600.0,B1,[765000000.0],13,0.0001756000090663465,0.00013791487715232568,9.68482974735756e-05,5.5634186329878545e-05
polarisation.py,MacBook-Pro,2020-04-30 15:20:22,exploratory,512,MID_FEKO_B1,0.19442400886711947,-0.7342056431875037,True,600.0,B1,[765000000.0],14,8.182327400930241e-05,8.731657107179467e-05,0.00013590243669889268,3.1246078492378855e-05
polarisation.py,MacBook-Pro,2020-04-30 15:20:31,exploratory,512,MID_FEKO_B1,0.19796916328475306,-0.8344298771769445,True,600.0,B1,[765000000.0],15,6.794661000444725e-05,-0.00014665238300217784,6.080574145159027e-05,2.5601119192044802e-05
polarisation.py,MacBook-Pro,2020-04-30 15:20:39,exploratory,512,MID_FEKO_B1,0.19846706140597767,-0.8272901526338322,True,600.0,B1,[765000000.0],16,0.00013190230549877993,-2.9599954896805642e-05,0.0001625957005945713,-5.704906635548191e-05
polarisation.py,MacBook-Pro,2020-04-30 15:20:47,exploratory,512,MID_FEKO_B1,0.1989539311881794,-0.8201523967989309,True,600.0,B1,[765000000.0],17,0.00014176964347041517,7.52333355385511e-05,0.00016316626370666023,-9.533065052674763e-05
polarisation.py,MacBook-Pro,2020-04-30 15:20:57,exploratory,512,MID_FEKO_B1,0.1994301039890223,-0.8130162495700227,True,600.0,B1,[765000000.0],18,6.57135662863314e-05,0.00023328723520372771,-1.8339382420586993e-05,-6.84603067724525e-05
polarisation.py,MacBook-Pro,2020-04-30 15:21:05,exploratory,512,MID_FEKO_B1,0.19989589727230517,-0.8058813513924449,True,600.0,B1,[765000000.0],19,-1.33179516972663e-05,0.0005038442149989961,-0.00018344308928370292,-3.4115324795253255e-05
polarisation.py,MacBook-Pro,2020-04-30 15:21:13,exploratory,512,MID_FEKO_B1,0.20035161531269519,-0.7987473431044568,True,600.0,B1,[765000000.0],20,1.5073275668802097e-05,0.0007885443195846239,-0.00021590330054278706,6.77512007923468e-05
polarisation.py,MacBook-Pro,2020-04-30 15:21:21,exploratory,512,MID_FEKO_B1,0.2007975498573937,-0.7916138657825426,True,600.0,B1,[765000000.0],21,0.0001409979787644135,0.0009578026381114616,-9.915090303841742e-05,7.178008376143646e-05
polarisation.py,MacBook-Pro,2020-04-30 15:21:29,exploratory,512,MID_FEKO_B1,0.20123398074775026,-0.7844805605864975,True,600.0,B1,[765000000.0],22,0.00022769817476546924,0.0010166112097019437,0.00011165020523383054,5.520489247771772e-05
polarisation.py,MacBook-Pro,2020-04-30 15:21:37,exploratory,512,MID_FEKO_B1,0.2016611765036027,-0.7773470686041477,True,600.0,B1,[765000000.0],23,0.00018096548655099963,0.0010247413487834462,0.0003004092364090372,6.379415655316985e-05
polarisation.py,MacBook-Pro,2020-04-30 15:21:46,exploratory,512,MID_FEKO_B1,0.2020793948729015,-0.7702130306955347,True,600.0,B1,[765000000.0],24,7.181043123597105e-05,0.0009667291438710613,0.0004367219331674766,7.567926649012568e-05
polarisation.py,MacBook-Pro,2020-04-30 15:21:54,exploratory,512,MID_FEKO_B1,0.20248888334897558,-0.7630780873364104,True,600.0,B1,[765000000.0],25,3.967720233671811e-05,0.0008136065830697294,0.00042869637964176237,7.211814771916557e-05
polarisation.py,MacBook-Pro,2020-04-30 15:22:02,exploratory,512,MID_FEKO_B1,0.20288987965761687,-0.7559418784608684,True,600.0,B1,[765000000.0],26,0.00011615949692770353,0.0006096832030778322,0.0002549388403039918,4.630440479584892e-05
polarisation.py,MacBook-Pro,2020-04-30 15:22:10,exploratory,512,MID_FEKO_B1,0.20328261221599128,-0.7488040433029459,True,600.0,B1,[765000000.0],27,0.00020649288600058305,0.0004074935901290718,5.036539704559964e-05,2.3970492526239434e-05
polarisation.py,MacBook-Pro,2020-04-30 15:22:19,exploratory,512,MID_FEKO_B1,0.20366730056523308,-0.7416642202370153,True,600.0,B1,[765000000.0],28,0.00021902269353099303,0.00021116727165579324,-3.690070794317218e-05,2.410862141404815e-05
polarisation.py,MacBook-Pro,2020-04-30 15:22:28,exploratory,512,MID_FEKO_B1,0.20404415577843893,-0.7345220466167899,True,600.0,B1,[765000000.0],29,0.00015365047960289182,4.6693302376475883e-05,6.212922488923907e-05,1.97572276056958e-05
polarisation.py,MacBook-Pro,2020-04-30 15:22:36,exploratory,512,MID_FEKO_B1,0.20860120075033808,-0.8347257271805181,True,600.0,B1,[765000000.0],30,8.628468100719085e-05,-9.717534083283284e-05,0.00015683004142948487,-4.544486209824163e-05
polarisation.py,MacBook-Pro,2020-04-30 15:22:44,exploratory,512,MID_FEKO_B1,0.2090163786512631,-0.8275835993213922,True,600.0,B1,[765000000.0],31,9.549635889046102e-05,-3.103813599316393e-05,0.00020258965596431166,-7.979461047788076e-05
polarisation.py,MacBook-Pro,2020-04-30 15:22:52,exploratory,512,MID_FEKO_B1,0.2094223553960123,-0.8204435076729383,True,600.0,B1,[765000000.0],32,2.7879819717094755e-05,2.310443283558137e-05,-4.840180935807394e-05,-2.795997775627803e-05
polarisation.py,MacBook-Pro,2020-04-30 15:22:59,exploratory,512,MID_FEKO_B1,0.20981940769202492,-0.8133050901746556,True,600.0,B1,[765000000.0],33,-7.133849207636872e-05,0.00018209334087129162,-0.0004074066877962299,7.610071751089572e-05
polarisation.py,MacBook-Pro,2020-04-30 15:23:07,exploratory,512,MID_FEKO_B1,0.21020780063308375,-0.8061679854024434,True,600.0,B1,[765000000.0],34,-7.014177322156438e-05,0.00038947330419075433,-0.00048308706966041117,0.00011107971675833075
polarisation.py,MacBook-Pro,2020-04-30 15:23:15,exploratory,512,MID_FEKO_B1,0.2105877882891255,-0.7990318324095442,True,600.0,B1,[765000000.0],35,0.00013564552715623202,0.00024834191053449227,-0.00021154549981864401,5.2550028774907455e-05
polarisation.py,MacBook-Pro,2020-04-30 15:23:23,exploratory,512,MID_FEKO_B1,0.21095961425995777,-0.7918962705677033,True,600.0,B1,[765000000.0],36,0.0004637301782871579,-0.0002711468501266072,0.00018914692991775205,-3.79286343221667e-05
polarisation.py,MacBook-Pro,2020-04-30 15:23:31,exploratory,512,MID_FEKO_B1,0.21132351219541362,-0.7847609394083715,True,600.0,B1,[765000000.0],37,0.0006546563961307297,-0.0006329804541895977,0.00021245230172010714,-7.105733912201859e-05
polarisation.py,MacBook-Pro,2020-04-30 15:23:38,exploratory,512,MID_FEKO_B1,0.21167970628427593,-0.7776254784637817,True,600.0,B1,[765000000.0],38,0.0005345392489619291,-0.0004261290928406762,0.00015189404760134346,-4.3585145826236764e-05
polarisation.py,MacBook-Pro,2020-04-30 15:23:48,exploratory,512,MID_FEKO_B1,0.21202841171411757,-0.7704895271077176,True,600.0,B1,[765000000.0],39,0.00022079823300512176,0.00010728676296808757,0.0003210916629465197,6.641439716933956e-05
polarisation.py,MacBook-Pro,2020-04-30 15:23:56,exploratory,512,MID_FEKO_B1,0.2123698351040357,-0.7633527243958005,True,600.0,B1,[765000000.0],40,-2.8144412115788984e-05,0.00045416003697125825,0.0006212839635599855,0.00013372705596097095
polarisation.py,MacBook-Pro,2020-04-30 15:24:04,exploratory,512,MID_FEKO_B1,0.21270417491210597,-0.7562147089051122,True,600.0,B1,[765000000.0],41,-4.3018819616509286e-05,0.0005345521936907257,0.0006711050565647738,0.00012791907523340357
polarisation.py,MacBook-Pro,2020-04-30 15:24:12,exploratory,512,MID_FEKO_B1,0.21303162181924165,-0.7490751185729687,True,600.0,B1,[765000000.0],42,6.751925128129197e-05,0.0004948441691657387,0.0003690150034648147,6.002830416752566e-05
polarisation.py,MacBook-Pro,2020-04-30 15:24:20,exploratory,512,MID_FEKO_B1,0.21335235909101463,-0.741933590534658,True,600.0,B1,[765000000.0],43,0.00017634467479628186,0.00036792854836363364,3.188717786627889e-05,-1.6533220356420193e-05
polarisation.py,MacBook-Pro,2020-04-30 15:24:29,exploratory,512,MID_FEKO_B1,0.21366656291887742,-0.7347897609599517,True,600.0,B1,[765000000.0],44,0.00020279780292796357,0.0001288640077253469,-7.826840367953474e-05,-1.3228277617224586e-05
polarisation.py,MacBook-Pro,2020-04-30 15:24:38,exploratory,512,MID_FEKO_B1,0.219236688254499,-0.8349677962039654,True,600.0,B1,[765000000.0],45,7.83525025326335e-05,-6.479886808592329e-05,0.00020573499259731148,-7.99477048034469e-05
polarisation.py,MacBook-Pro,2020-04-30 15:24:46,exploratory,512,MID_FEKO_B1,0.21956900279245364,-0.8278237003693459,True,600.0,B1,[765000000.0],46,3.433257041014524e-05,-0.00017342443654616937,7.225718290789041e-05,-4.1150979047245304e-05
polarisation.py,MacBook-Pro,2020-04-30 15:24:54,exploratory,512,MID_FEKO_B1,0.21989394927543834,-0.820681696042897,True,600.0,B1,[765000000.0],47,-2.8956083717779723e-05,-0.00027620072414837944,-0.00038273490945802156,0.00010479883043163358
polarisation.py,MacBook-Pro,2020-04-30 15:25:02,exploratory,512,MID_FEKO_B1,0.22021174944736416,-0.813541419557847,True,600.0,B1,[765000000.0],48,-6.720952909444337e-05,-0.00012151537002921849,-0.000553734085303925,0.0001252137103719934
polarisation.py,MacBook-Pro,2020-04-30 15:25:10,exploratory,512,MID_FEKO_B1,0.220522615737949,-0.8064025079567688,True,600.0,B1,[765000000.0],49,-4.256594781054153e-05,-0.00021303363802364567,0.00023990325536712284,-5.4999258960886405e-05
polarisation.py,MacBook-Pro,2020-04-30 15:25:19,exploratory,512,MID_FEKO_B1,0.2208267517362302,-0.7992645988288857,True,600.0,B1,[765000000.0],50,0.00022061248817661905,-0.0014279032607702948,0.0013999170833368967,-0.0003380306689765554
polarisation.py,MacBook-Pro,2020-04-30 15:25:28,exploratory,512,MID_FEKO_B1,0.22112435263506816,-0.792127330147823,True,600.0,B1,[765000000.0],51,0.0005760450693103574,-0.0034174874770257217,0.001908076498560194,-0.0004960466623162568
polarisation.py,MacBook-Pro,2020-04-30 15:25:36,exploratory,512,MID_FEKO_B1,0.22141560564867832,-0.7849903401096188,True,600.0,B1,[765000000.0],52,0.0007898671013406911,-0.00452589817135184,0.0011034534789707208,-0.00041346988830611835
polarisation.py,MacBook-Pro,2020-04-30 15:25:45,exploratory,512,MID_FEKO_B1,0.22170069040506785,-0.7778532669708029,True,600.0,B1,[765000000.0],53,0.0006591366556169363,-0.0037453238607439874,-0.00020980794401844673,-0.00020269996347260723
polarisation.py,MacBook-Pro,2020-04-30 15:25:54,exploratory,512,MID_FEKO_B1,0.22197977931510315,-0.77071574888636,True,600.0,B1,[765000000.0],54,0.0003109311833078596,-0.0019585627517546265,-0.000623250310097975,-0.00010958341032137507
polarisation.py,MacBook-Pro,2020-04-30 15:26:03,exploratory,512,MID_FEKO_B1,0.22225303791980056,-0.7635774237473767,True,600.0,B1,[765000000.0],55,-3.879446639503511e-05,-0.0006449784641526478,-7.248989547416039e-05,6.951295690665081e-05
polarisation.py,MacBook-Pro,2020-04-30 15:26:11,exploratory,512,MID_FEKO_B1,0.22252062521730845,-0.7564379290181925,True,600.0,B1,[765000000.0],56,-7.245862434990358e-05,-0.0001493648334356543,0.0006545229792299313,0.0001638326369726161
polarisation.py,MacBook-Pro,2020-04-30 15:26:19,exploratory,512,MID_FEKO_B1,0.22278269397093595,-0.7492969015728494,True,600.0,B1,[765000000.0],57,-2.6972630207640534e-05,0.00010996773196061842,0.0006987731182220479,0.0001327091440766895
polarisation.py,MacBook-Pro,2020-04-30 15:26:27,exploratory,512,MID_FEKO_B1,0.22303939099948003,-0.742153977530647,True,600.0,B1,[765000000.0],58,8.614439173413243e-05,0.00031917168025140234,0.0002558682175394951,3.5020189923859036e-05
polarisation.py,MacBook-Pro,2020-04-30 15:26:35,exploratory,512,MID_FEKO_B1,0.22329085745100924,-0.7350087920906064,True,600.0,B1,[765000000.0],59,0.00020169926591874252,0.00025545511745234914,-7.417431471574888e-05,-3.3799554466910597e-05
polarisation.py,MacBook-Pro,2020-04-30 15:26:43,exploratory,512,MID_FEKO_B1,0.22987494026923894,-0.8351560783309055,True,600.0,B1,[765000000.0],60,5.979323701019881e-05,-0.00010528585389227077,0.000168865844239335,-7.736314958543217e-05
polarisation.py,MacBook-Pro,2020-04-30 15:26:51,exploratory,512,MID_FEKO_B1,0.23012427672750285,-0.8280104508355361,True,600.0,B1,[765000000.0],61,2.0932476586829336e-05,-0.0004803413826536542,-0.0001227225376572585,6.406745589202378e-05
polarisation.py,MacBook-Pro,2020-04-30 15:27:00,exploratory,512,MID_FEKO_B1,0.23036808297940425,-0.8208669579000399,True,600.0,B1,[765000000.0],62,6.291307578646875e-05,-0.0006170252763365827,-0.000509565389943412,0.0001564184152792576
polarisation.py,MacBook-Pro,2020-04-30 15:27:07,exploratory,512,MID_FEKO_B1,0.23060652555377747,-0.8137252346058028,True,600.0,B1,[765000000.0],63,0.00010582251675102942,-0.00011838249065651259,0.00012940160895582486,-1.20084726712419e-05
polarisation.py,MacBook-Pro,2020-04-30 15:27:15,exploratory,512,MID_FEKO_B1,0.23083976398020412,-0.8065849168004487,True,600.0,B1,[765000000.0],64,5.750723919282282e-05,-0.00018296134115627783,0.0021609446036188204,-0.00045898404289455364
polarisation.py,MacBook-Pro,2020-04-30 15:27:23,exploratory,512,MID_FEKO_B1,0.2310679511451219,-0.7994456409323037,True,600.0,B1,[765000000.0],65,5.353993245613746e-05,-0.0023428412268832956,0.00463618778103381,-0.0009187120310965611
polarisation.py,MacBook-Pro,2020-04-30 15:27:31,exploratory,512,MID_FEKO_B1,0.23129123362609752,-0.7923070438854883,True,600.0,B1,[765000000.0],66,0.0002105375304932299,-0.005874795377023183,0.005232414570128954,-0.001021922307815226
polarisation.py,MacBook-Pro,2020-04-30 15:27:40,exploratory,512,MID_FEKO_B1,0.23150975200579976,-0.785168762815432,True,600.0,B1,[765000000.0],67,0.00034589510492728575,-0.007625075153108584,0.0030789231954623303,-0.0007179527904260456
polarisation.py,MacBook-Pro,2020-04-30 15:27:49,exploratory,512,MID_FEKO_B1,0.23172364116708577,-0.7780304349846163,True,600.0,B1,[765000000.0],68,0.0002757353894164919,-0.005907406720456526,-0.00035525308540478663,-0.0002955892337706261
polarisation.py,MacBook-Pro,2020-04-30 15:27:57,exploratory,512,MID_FEKO_B1,0.23193303057050152,-0.7708916975983415,True,600.0,B1,[765000000.0],69,0.00013848634752991666,-0.0026437080706756327,-0.0019012518922169868,-0.0003437420578781239
polarisation.py,MacBook-Pro,2020-04-30 15:28:06,exploratory,512,MID_FEKO_B1,0.23213804451539494,-0.763752187640319,True,600.0,B1,[765000000.0],70,0.00012032842581503315,-0.0007157504759613998,-0.0014230716031632068,-0.00019493204352032817
polarisation.py,MacBook-Pro,2020-04-30 15:28:14,exploratory,512,MID_FEKO_B1,0.23233880238574853,-0.7566115417078878,True,600.0,B1,[765000000.0],71,0.0001380881609898282,-0.0005420563949543166,-0.0001037317649786644,9.247583657298708e-05
polarisation.py,MacBook-Pro,2020-04-30 15:28:23,exploratory,512,MID_FEKO_B1,0.23253541888175147,-0.7494693958466518,True,600.0,B1,[765000000.0],72,7.449380627536375e-05,-0.0005871451233470492,0.0006701950157651114,0.00015047488229463275
polarisation.py,MacBook-Pro,2020-04-30 15:28:31,exploratory,512,MID_FEKO_B1,0.2327280042380543,-0.7423253853843316,True,600.0,B1,[765000000.0],73,4.603987340403215e-05,-0.00011549564313319101,0.00044525353425813827,7.090748975589468e-05
polarisation.py,MacBook-Pro,2020-04-30 15:28:40,exploratory,512,MID_FEKO_B1,0.23291666442957804,-0.7351791447636277,True,600.0,B1,[765000000.0],74,0.00016325731688908584,0.0002435720746362766,2.473203090206642e-05,-3.759901345809705e-05
polarisation.py,MacBook-Pro,2020-04-30 15:28:48,exploratory,512,MID_FEKO_B1,0.24051526828286005,-0.8352905689137273,True,600.0,B1,[765000000.0],75,4.8823776276646184e-05,-0.00020406511381502063,9.432692607214261e-05,-6.224287292541647e-05
polarisation.py,MacBook-Pro,2020-04-30 15:28:56,exploratory,512,MID_FEKO_B1,0.24068154050548904,-0.8281438468316282,True,600.0,B1,[765000000.0],76,7.48398051834072e-05,-0.0008083452052812021,-0.00021029652850766735,0.00010696193316080443
polarisation.py,MacBook-Pro,2020-04-30 15:29:04,exploratory,512,MID_FEKO_B1,0.24084412393834992,-0.8209992900834452,True,600.0,B1,[765000000.0],77,0.0002732084226021317,-0.0006607500117153904,-0.0003228037803125708,0.0001222019795805765
polarisation.py,MacBook-Pro,2020-04-30 15:29:12,exploratory,512,MID_FEKO_B1,0.24100312970600835,-0.813856532855038,True,600.0,B1,[765000000.0],78,0.00037044981876102856,0.0008730511910023964,0.0009664538960674052,-0.00018670768332719486
polarisation.py,MacBook-Pro,2020-04-30 15:29:21,exploratory,512,MID_FEKO_B1,0.24115866426036936,-0.8067152101392272,True,600.0,B1,[765000000.0],79,0.00014060355124175813,0.0018483204606117142,0.004023225320547867,-0.0007572384334346324
polarisation.py,MacBook-Pro,2020-04-30 15:29:30,exploratory,512,MID_FEKO_B1,0.24131082961854808,-0.7995749575682242,True,600.0,B1,[765000000.0],80,-0.00015477701330751192,-0.0004977778921531854,0.00713987987073958,-0.0012125259639990634
polarisation.py,MacBook-Pro,2020-04-30 15:29:38,exploratory,512,MID_FEKO_B1,0.24145972358614567,-0.7924354112468147,True,600.0,B1,[765000000.0],81,-0.00021285383562986583,-0.004609876642984822,0.007613540115070369,-0.0011645591504470256
polarisation.py,MacBook-Pro,2020-04-30 15:29:47,exploratory,512,MID_FEKO_B1,0.24160543996695816,-0.7852962075860891,True,600.0,B1,[765000000.0],82,-0.00017446897459563306,-0.006507224673020827,0.00457319051605898,-0.0007081762842996262
polarisation.py,MacBook-Pro,2020-04-30 15:29:58,exploratory,512,MID_FEKO_B1,0.24174806876006277,-0.7781569831375084,True,600.0,B1,[765000000.0],83,-0.00020358564240864293,-0.003772817571736945,-0.00040564765523865817,-0.0003294776087119736
polarisation.py,MacBook-Pro,2020-04-30 15:30:06,exploratory,512,MID_FEKO_B1,0.24188769634515186,-0.7710173744271002,True,600.0,B1,[765000000.0],84,-8.644130833313029e-05,0.0005244794382634147,-0.002519639438908995,-0.0006280095065356944
polarisation.py,MacBook-Pro,2020-04-30 15:30:15,exploratory,512,MID_FEKO_B1,0.2420244056569169,-0.7638770177895766,True,600.0,B1,[765000000.0],85,0.0002969884751581891,0.0019700352043481276,-0.0023716829884923686,-0.00047964402861385894
polarisation.py,MacBook-Pro,2020-04-30 15:30:23,exploratory,512,MID_FEKO_B1,0.24215827634922066,-0.7567355492021677,True,600.0,B1,[765000000.0],86,0.0005544704199661084,0.0004987464705798763,-0.0008037801868639271,0.0001432959369546996
polarisation.py,MacBook-Pro,2020-04-30 15:30:32,exploratory,512,MID_FEKO_B1,0.2422893849497417,-0.7495926041179596,True,600.0,B1,[765000000.0],87,0.00039306267836091276,-0.000930171689052376,0.0003465615510781239,0.00010024184733833102
polarisation.py,MacBook-Pro,2020-04-30 15:30:40,exploratory,512,MID_FEKO_B1,0.24241780500572044,-0.7424478172985256,True,600.0,B1,[765000000.0],88,0.00011629610936145195,-0.0007005850291163338,0.00042163395199105807,7.37179535715423e-05
polarisation.py,MacBook-Pro,2020-04-30 15:30:48,exploratory,512,MID_FEKO_B1,0.24254360722139,-0.7353008226456456,True,600.0,B1,[765000000.0],89,0.00012587665257934947,5.194547599871041e-05,8.763297308902405e-05,-3.833124929581747e-05
polarisation.py,MacBook-Pro,2020-04-30 15:30:56,exploratory,512,MID_FEKO_B1,0.2511569815424184,-0.8353712646080674,True,600.0,B1,[765000000.0],90,4.676312805846908e-05,-0.00029260592874935014,4.750520101527592e-05,-5.0345915367814675e-05
polarisation.py,MacBook-Pro,2020-04-30 15:31:04,exploratory,512,MID_FEKO_B1,0.2512401320356512,-0.8282238855564295,True,600.0,B1,[765000000.0],91,0.00014842203160682742,-0.001007275065700284,-0.00014835363799434826,9.862890714127526e-05
polarisation.py,MacBook-Pro,2020-04-30 15:31:13,exploratory,512,MID_FEKO_B1,0.2513214375379158,-0.8210786903122751,True,600.0,B1,[765000000.0],92,0.00048224240201606423,-0.00038122250826675644,-0.00010439914317343941,6.635579469972187e-05
polarisation.py,MacBook-Pro,2020-04-30 15:31:21,exploratory,512,MID_FEKO_B1,0.2514009536431282,-0.8139353125236063,True,600.0,B1,[765000000.0],93,0.0006239626647510694,0.002478762223446613,0.0010845509903502548,-0.0002154307824811208
polarisation.py,MacBook-Pro,2020-04-30 15:31:29,exploratory,512,MID_FEKO_B1,0.2514787336069242,-0.8067933866698542,True,600.0,B1,[765000000.0],94,0.0002880772981339507,0.004998355309019839,0.003502743013158348,-0.0006449841544461481
polarisation.py,MacBook-Pro,2020-04-30 15:31:38,exploratory,512,MID_FEKO_B1,0.25155482846573385,-0.7996525478930843,True,600.0,B1,[765000000.0],95,-0.00013725616261736908,0.0036556709742908526,0.0057299620817618255,-0.0009607809487312457
polarisation.py,MacBook-Pro,2020-04-30 15:31:46,exploratory,512,MID_FEKO_B1,0.2516292871485485,-0.7925124318300355,True,600.0,B1,[765000000.0],96,-0.0002553338991016614,-0.0005205968721767015,0.005797296507500708,-0.0008459633097152697
polarisation.py,MacBook-Pro,2020-04-30 15:31:54,exploratory,512,MID_FEKO_B1,0.2517021565818929,-0.785372674444774,True,600.0,B1,[765000000.0],97,-0.00026204160333543415,-0.002177539154337461,0.003285532337300463,0.0005483183469860592
polarisation.py,MacBook-Pro,2020-04-30 15:32:03,exploratory,512,MID_FEKO_B1,0.2517734817884774,-0.7782329118617541,True,600.0,B1,[765000000.0],98,-0.00032776231369647884,0.0012769533968527355,-0.0004897991680561704,0.0005723273258174268
polarisation.py,MacBook-Pro,2020-04-30 15:32:11,exploratory,512,MID_FEKO_B1,0.2518433059799654,-0.7710927801990682,True,600.0,B1,[765000000.0],99,-0.00010313637304877215,0.005818822883540626,-0.0019865006452347562,-0.0008436640060000743
polarisation.py,MacBook-Pro,2020-04-30 15:32:19,exploratory,512,MID_FEKO_B1,0.2519116706442573,-0.7639519154016796,True,600.0,B1,[765000000.0],100,0.0005419352669463733,0.00616575595715646,-0.0018646689450989942,-0.0006644471091010654
polarisation.py,MacBook-Pro,2020-04-30 15:32:27,exploratory,512,MID_FEKO_B1,0.2519786156276627,-0.756809953074423,True,600.0,B1,[765000000.0],101,0.0009939431326853384,0.002509915585061961,-0.0007645635473461883,-0.00023595118081636373
polarisation.py,MacBook-Pro,2020-04-30 15:32:35,exploratory,512,MID_FEKO_B1,0.25204417921230116,-0.7496665283145629,True,600.0,B1,[765000000.0],102,0.0007564690415086158,-0.0007328800342453715,0.00012686111279484248,3.238103099706319e-05
polarisation.py,MacBook-Pro,2020-04-30 15:32:44,exploratory,512,MID_FEKO_B1,0.25210839818904834,-0.7425212755436907,True,600.0,B1,[765000000.0],103,0.00024303711475165106,-0.0011229628942317493,0.00021870619501301736,4.4738777926033186e-05
polarisation.py,MacBook-Pro,2020-04-30 15:32:52,exploratory,512,MID_FEKO_B1,0.2521713079263191,-0.7353738283387563,True,600.0,B1,[765000000.0],104,0.00011002453785464307,-0.00017258091959851602,6.095396602496916e-05,-2.755042451332535e-05
polarisation.py,MacBook-Pro,2020-04-30 15:33:00,exploratory,512,MID_FEKO_B1,0.2617993877991494,-0.8353981633974484,True,600.0,B1,[765000000.0],105,4.486144358378167e-05,-0.000308727033455796,4.1489976656471905e-05,-4.709330306477643e-05
polarisation.py,MacBook-Pro,2020-04-30 15:33:09,exploratory,512,MID_FEKO_B1,0.2617993877991494,-0.8282505653196972,True,600.0,B1,[765000000.0],106,0.00017711669840859577,-0.001052101025340922,-3.898319833657359e-05,7.293432081115764e-05
polarisation.py,MacBook-Pro,2020-04-30 15:33:17,exploratory,512,MID_FEKO_B1,0.2617993877991494,-0.8211051572088104,True,600.0,B1,[765000000.0],107,0.0005612355594580331,-0.00020173916379520205,-5.154949768257072e-05,2.5682954012684615e-05
polarisation.py,MacBook-Pro,2020-04-30 15:33:26,exploratory,512,MID_FEKO_B1,0.2617993877991494,-0.8139615725334134,True,600.0,B1,[765000000.0],108,0.0007265285439332498,0.0032687972414787003,0.00011266713291106663,-7.762646324839874e-05
polarisation.py,MacBook-Pro,2020-04-30 15:33:35,exploratory,512,MID_FEKO_B1,0.2617993877991494,-0.8068194456017226,True,600.0,B1,[765000000.0],109,0.00038122377075737457,0.006563383725914679,0.0003489699113832591,-0.0002573759032656261
polarisation.py,MacBook-Pro,2020-04-30 15:33:43,exploratory,512,MID_FEKO_B1,0.2617993877991494,-0.7996784113923424,True,600.0,B1,[765000000.0],110,-3.8823677761537923e-05,0.0057702963793885235,0.00033981896953862086,-0.0004545888523354231
polarisation.py,MacBook-Pro,2020-04-30 15:33:53,exploratory,512,MID_FEKO_B1,0.2617993877991494,-0.7925381053859216,True,600.0,B1,[765000000.0],111,-0.00012909067392818124,0.0018208689418655738,-0.0002478672293380952,-0.00039455936538643514
polarisation.py,MacBook-Pro,2020-04-30 15:34:01,exploratory,512,MID_FEKO_B1,0.2617993877991494,-0.7853981633974482,True,600.0,B1,[765000000.0],112,-0.00014198060784542337,0.0003196259516375975,-0.0007915241181565505,-0.00011617474123759447
polarisation.py,MacBook-Pro,2020-04-30 15:34:11,exploratory,512,MID_FEKO_B1,0.2617993877991494,-0.7782582214089749,True,600.0,B1,[765000000.0],113,-0.00026126476173835716,0.003959785037387872,-0.0009748695487823893,-0.000616643303210057
polarisation.py,MacBook-Pro,2020-04-30 15:34:20,exploratory,512,MID_FEKO_B1,0.2617993877991494,-0.7711179154025539,True,600.0,B1,[765000000.0],114,-5.864201850966627e-05,0.008434917896329957,-0.000724896876332322,-0.0008233166401006184
polarisation.py,MacBook-Pro,2020-04-30 15:34:28,exploratory,512,MID_FEKO_B1,0.2617993877991494,-0.763976881193174,True,600.0,B1,[765000000.0],115,0.0006429030889007507,0.00815635865821169,-0.00045445293939595154,-0.0005791264470972121
polarisation.py,MacBook-Pro,2020-04-30 15:34:36,exploratory,512,MID_FEKO_B1,0.2617993877991494,-0.7568347542614831,True,600.0,B1,[765000000.0],116,0.0011587140067302782,0.0035080407753016736,0.0002765559565082522,-0.00020702145969964055
polarisation.py,MacBook-Pro,2020-04-30 15:34:44,exploratory,512,MID_FEKO_B1,0.2617993877991494,-0.7496911695860862,True,600.0,B1,[765000000.0],117,0.0009006070376548119,-0.0005480006800414252,8.940196011820835e-05,-1.6321782160173108e-05
polarisation.py,MacBook-Pro,2020-04-30 15:34:52,exploratory,512,MID_FEKO_B1,0.2617993877991494,-0.7425457614751991,True,600.0,B1,[765000000.0],118,0.0002998589085170775,-0.0012505898998525567,-5.8812435995428466e-05,2.1700333494788817e-05
polarisation.py,MacBook-Pro,2020-04-30 15:35:00,exploratory,512,MID_FEKO_B1,0.2617993877991494,-0.7353981633974482,True,600.0,B1,[765000000.0],119,0.00010417086936823345,-0.00025774289694281265,-3.496835182493056e-05,2.170985498189237e-05
polarisation.py,MacBook-Pro,2020-04-30 15:35:09,exploratory,512,MID_FEKO_B1,0.2724417940558804,-0.8353712646080674,True,600.0,B1,[765000000.0],120,3.988175207643274e-05,-0.00023745017978539298,3.6365423487414104e-05,-4.052861872671282e-05
polarisation.py,MacBook-Pro,2020-04-30 15:35:16,exploratory,512,MID_FEKO_B1,0.2723586435626476,-0.8282238855564295,True,600.0,B1,[765000000.0],121,0.0001372565323251982,-0.0009645219808151899,0.0001419152013491712,-6.848981745562874e-05
polarisation.py,MacBook-Pro,2020-04-30 15:35:27,exploratory,512,MID_FEKO_B1,0.272277338060383,-0.8210786903122751,True,600.0,B1,[765000000.0],122,0.0004611686790938312,-0.0003903419851026897,4.256524943602829e-05,-2.4403732344374166e-05
polarisation.py,MacBook-Pro,2020-04-30 15:35:35,exploratory,512,MID_FEKO_B1,0.2721978219551706,-0.8139353125236063,True,600.0,B1,[765000000.0],123,0.0006033632184650977,0.002430389534173519,-0.000935516808929588,-0.00011018758756613758
polarisation.py,MacBook-Pro,2020-04-30 15:35:43,exploratory,512,MID_FEKO_B1,0.27212004199137463,-0.8067933866698542,True,600.0,B1,[765000000.0],124,0.0002898512931745137,0.004997540248322068,-0.0028880878923391523,0.0003708190322739377
polarisation.py,MacBook-Pro,2020-04-30 15:35:52,exploratory,512,MID_FEKO_B1,0.27204394713256497,-0.7996525478930843,True,600.0,B1,[765000000.0],125,-9.845495641839674e-05,0.0037867891677709838,-0.0050917855727585885,0.0007236564894959749
polarisation.py,MacBook-Pro,2020-04-30 15:36:00,exploratory,512,MID_FEKO_B1,0.27196948844975033,-0.7925124318300355,True,600.0,B1,[765000000.0],126,-0.0001876920641865519,-0.00035256511703899183,-0.006006575107491961,-0.0009183117118623945
polarisation.py,MacBook-Pro,2020-04-30 15:36:08,exploratory,512,MID_FEKO_B1,0.27189661901640594,-0.785372674444774,True,600.0,B1,[765000000.0],127,-0.000197353226434375,-0.0019787256763408095,-0.004615640727943736,-0.000769385621856193
polarisation.py,MacBook-Pro,2020-04-30 15:36:16,exploratory,512,MID_FEKO_B1,0.2718252938098214,-0.7782329118617541,True,600.0,B1,[765000000.0],128,-0.0003049379240359299,0.0012968010714439033,-0.0016176996200534372,-0.0006068938829111168
polarisation.py,MacBook-Pro,2020-04-30 15:36:24,exploratory,512,MID_FEKO_B1,0.2717554696183334,-0.7710927801990682,True,600.0,B1,[765000000.0],129,-0.00014099870178527045,0.005653409856236045,0.001076881898940028,-0.0005795396106854469
polarisation.py,MacBook-Pro,2020-04-30 15:36:32,exploratory,512,MID_FEKO_B1,0.2716871049540415,-0.7639519154016796,True,600.0,B1,[765000000.0],130,0.000462141622672241,0.0059441248564864,0.0017715862580400322,0.0004923584042142841
polarisation.py,MacBook-Pro,2020-04-30 15:36:40,exploratory,512,MID_FEKO_B1,0.2716201599706361,-0.756809953074423,True,600.0,B1,[765000000.0],131,0.0009154124006374971,0.0023699437833364133,0.0010016172676779185,-0.0002095823681990323
polarisation.py,MacBook-Pro,2020-04-30 15:36:50,exploratory,512,MID_FEKO_B1,0.27155459638599766,-0.7496665283145629,True,600.0,B1,[765000000.0],132,0.0007099575439572939,-0.0007567434041163107,-8.064920944590336e-05,-3.6959570410786364e-05
polarisation.py,MacBook-Pro,2020-04-30 15:36:59,exploratory,512,MID_FEKO_B1,0.27149037740925047,-0.7425212755436907,True,600.0,B1,[765000000.0],133,0.0002244134314149889,-0.0010883985348499859,-0.0003195950706113874,-5.827395541900097e-05
polarisation.py,MacBook-Pro,2020-04-30 15:37:08,exploratory,512,MID_FEKO_B1,0.2714274676719797,-0.7353738283387563,True,600.0,B1,[765000000.0],134,9.724152699287067e-05,-0.00014244987053417535,-0.00012462665699679952,3.3641460383927906e-05
polarisation.py,MacBook-Pro,2020-04-30 15:37:16,exploratory,512,MID_FEKO_B1,0.28308350731543874,-0.8352905689137273,True,600.0,B1,[765000000.0],135,3.787711672046766e-05,-0.00011648033164509712,-2.4421874901755927e-05,3.2449319098463867e-05
polarisation.py,MacBook-Pro,2020-04-30 15:37:24,exploratory,512,MID_FEKO_B1,0.28291723509280975,-0.8281438468316282,True,600.0,B1,[765000000.0],136,6.336187048580543e-05,-0.0007283706497991174,0.00022240203205482146,-9.448979309922634e-05
polarisation.py,MacBook-Pro,2020-04-30 15:37:33,exploratory,512,MID_FEKO_B1,0.2827546516599489,-0.8209992900834452,True,600.0,B1,[765000000.0],137,0.00024959270695563225,-0.000648731862964989,0.00024854495435767254,-9.374287105114331e-05
polarisation.py,MacBook-Pro,2020-04-30 15:37:41,exploratory,512,MID_FEKO_B1,0.28259564589229047,-0.813856532855038,True,600.0,B1,[765000000.0],138,0.00033463260414904136,0.0008323928477488002,-0.0009179569415038468,-9.938290731912067e-05
polarisation.py,MacBook-Pro,2020-04-30 15:37:50,exploratory,512,MID_FEKO_B1,0.28244011133792946,-0.8067152101392272,True,600.0,B1,[765000000.0],139,0.00010088226613114387,0.0018840303449487886,-0.0036155357224315447,0.0004868609223110383
polarisation.py,MacBook-Pro,2020-04-30 15:37:58,exploratory,512,MID_FEKO_B1,0.2822879459797507,-0.7995749575682242,True,600.0,B1,[765000000.0],140,-0.0001933780679921063,-0.00041549764424873706,-0.006631992622496483,0.000946565699067763
polarisation.py,MacBook-Pro,2020-04-30 15:38:06,exploratory,512,MID_FEKO_B1,0.28213905201215317,-0.7924354112468147,True,600.0,B1,[765000000.0],141,-0.00025248881185910505,-0.004187492371367824,-0.007621897040646836,0.0010671392982944266
polarisation.py,MacBook-Pro,2020-04-30 15:38:14,exploratory,512,MID_FEKO_B1,0.28199333563134066,-0.7852962075860891,True,600.0,B1,[765000000.0],142,-0.00022373910250796485,-0.006124628671065058,-0.005343308509474519,-0.0007750200701277614
polarisation.py,MacBook-Pro,2020-04-30 15:38:23,exploratory,512,MID_FEKO_B1,0.2818507068382361,-0.7781569831375084,True,600.0,B1,[765000000.0],143,-0.00027633516895097745,-0.0036520839952170906,-0.0011970612280135125,0.0003603554048999301
polarisation.py,MacBook-Pro,2020-04-30 15:38:32,exploratory,512,MID_FEKO_B1,0.281711079253147,-0.7710173744271002,True,600.0,B1,[765000000.0],144,-0.00018732637199044523,0.000431876064324992,0.0019131589682153981,0.0004683110827886512
polarisation.py,MacBook-Pro,2020-04-30 15:38:40,exploratory,512,MID_FEKO_B1,0.2815743699413819,-0.7638770177895766,True,600.0,B1,[765000000.0],145,0.00017650712342233353,0.001708953617684754,0.0023317878657982335,0.0004492659422614713
polarisation.py,MacBook-Pro,2020-04-30 15:38:49,exploratory,512,MID_FEKO_B1,0.2814404992490782,-0.7567355492021677,True,600.0,B1,[765000000.0],146,0.00045354680244030895,0.0003471330801517834,0.0009465203946540835,0.0001415042069890182
polarisation.py,MacBook-Pro,2020-04-30 15:38:58,exploratory,512,MID_FEKO_B1,0.2813093906485571,-0.7495926041179596,True,600.0,B1,[765000000.0],147,0.00033539763896993065,-0.0009327326288932061,-0.0003485305923997589,-8.792597934580382e-05
polarisation.py,MacBook-Pro,2020-04-30 15:39:08,exploratory,512,MID_FEKO_B1,0.2811809705925784,-0.7424478172985256,True,600.0,B1,[765000000.0],148,8.958811079365268e-05,-0.000634708172843737,-0.0005196055336118574,-8.475349083660673e-05
polarisation.py,MacBook-Pro,2020-04-30 15:39:16,exploratory,512,MID_FEKO_B1,0.2810551683769088,-0.7353008226456456,True,600.0,B1,[765000000.0],149,0.0001021474880697197,0.00010314416998249288,-0.00013370458648014318,4.35565144987602e-05
polarisation.py,MacBook-Pro,2020-04-30 15:39:24,exploratory,512,MID_FEKO_B1,0.2937238353290599,-0.8351560783309055,True,600.0,B1,[765000000.0],150,4.447245027328162e-05,-1.922628058596494e-05,-0.00010628166720292504,4.530706568151391e-05
polarisation.py,MacBook-Pro,2020-04-30 15:39:32,exploratory,512,MID_FEKO_B1,0.29347449887079596,-0.8280104508355361,True,600.0,B1,[765000000.0],151,1.4890396455957715e-05,-0.00038383008244902215,0.0001545628084745495,-7.334153012043716e-05
polarisation.py,MacBook-Pro,2020-04-30 15:39:40,exploratory,512,MID_FEKO_B1,0.29323069261889456,-0.8208669579000399,True,600.0,B1,[765000000.0],152,5.4739577669478034e-05,-0.0005690485580175559,0.0004556135372201767,-0.00013783417034107527
polarisation.py,MacBook-Pro,2020-04-30 15:39:49,exploratory,512,MID_FEKO_B1,0.29299225004452134,-0.8137252346058028,True,600.0,B1,[765000000.0],153,7.368662678263413e-05,-0.0001122998986176949,-0.00014074732987814028,-7.277155471318244e-05
polarisation.py,MacBook-Pro,2020-04-30 15:39:58,exploratory,512,MID_FEKO_B1,0.2927590116180947,-0.8065849168004487,True,600.0,B1,[765000000.0],154,-5.2096544729814665e-05,-0.00016068116514578073,-0.001981201160335923,0.0002724354445429838
polarisation.py,MacBook-Pro,2020-04-30 15:40:05,exploratory,512,MID_FEKO_B1,0.2925308244531769,-0.7994456409323037,True,600.0,B1,[765000000.0],155,-0.00011552749496362845,-0.0020539498672038346,-0.004328017626965351,0.00068955699656787
polarisation.py,MacBook-Pro,2020-04-30 15:40:13,exploratory,512,MID_FEKO_B1,0.2923075419722013,-0.7923070438854883,True,600.0,B1,[765000000.0],156,-2.6910659795801367e-05,-0.005395326310908926,-0.005126711839722072,0.0008877634258516628
polarisation.py,MacBook-Pro,2020-04-30 15:40:21,exploratory,512,MID_FEKO_B1,0.2920890235924991,-0.785168762815432,True,600.0,B1,[765000000.0],157,9.424190129381918e-05,-0.007154739807520017,-0.003359139121807609,0.0007060308957118964
polarisation.py,MacBook-Pro,2020-04-30 15:40:30,exploratory,512,MID_FEKO_B1,0.29187513443121305,-0.7780304349846163,True,600.0,B1,[765000000.0],158,6.696524023634465e-05,-0.005667222059661059,-0.0003294292234003064,0.0003559119777532492
polarisation.py,MacBook-Pro,2020-04-30 15:40:39,exploratory,512,MID_FEKO_B1,0.2916657450277973,-0.7708916975983415,True,600.0,B1,[765000000.0],159,-4.578650448596958e-05,-0.0026741980391575926,0.0016366616393133373,0.0003623501746684308
polarisation.py,MacBook-Pro,2020-04-30 15:40:47,exploratory,512,MID_FEKO_B1,0.2914607310829039,-0.763752187640319,True,600.0,B1,[765000000.0],160,-4.4295142394885774e-05,-0.0008577766510582369,0.0014099803272005957,0.00025069672169519445
polarisation.py,MacBook-Pro,2020-04-30 15:40:56,exploratory,512,MID_FEKO_B1,0.29125997321255026,-0.7566115417078878,True,600.0,B1,[765000000.0],161,7.731241044002757e-05,-0.0006146095845262798,0.0001503276726190281,-4.0537470021614926e-05
polarisation.py,MacBook-Pro,2020-04-30 15:41:05,exploratory,512,MID_FEKO_B1,0.2910633567165474,-0.7494693958466518,True,600.0,B1,[765000000.0],162,3.8042629161806705e-05,-0.000548744459462984,-0.0007123939910324908,-0.00013585837067675913
polarisation.py,MacBook-Pro,2020-04-30 15:41:13,exploratory,512,MID_FEKO_B1,0.29087077136024453,-0.7423253853843316,True,600.0,B1,[765000000.0],163,1.888311840350297e-05,-6.893714118202167e-05,-0.0005217173621974284,-7.284317228771466e-05
polarisation.py,MacBook-Pro,2020-04-30 15:41:21,exploratory,512,MID_FEKO_B1,0.29068211116872084,-0.7351791447636277,True,600.0,B1,[765000000.0],164,0.00013176746455267245,0.00029236910036055754,-4.6816740981383084e-05,4.231995691284979e-05
polarisation.py,MacBook-Pro,2020-04-30 15:41:29,exploratory,512,MID_FEKO_B1,0.3043620873437998,-0.8349677962039654,True,600.0,B1,[765000000.0],165,5.455602600253644e-05,1.7745226243082168e-05,-0.00016282879238891764,5.357584895445111e-05
polarisation.py,MacBook-Pro,2020-04-30 15:41:37,exploratory,512,MID_FEKO_B1,0.30402977280584514,-0.8278237003693459,True,600.0,B1,[765000000.0],166,2.484953172350978e-05,-8.929196190064041e-05,-3.349921216130932e-05,2.9309384790271257e-05
polarisation.py,MacBook-Pro,2020-04-30 15:41:46,exploratory,512,MID_FEKO_B1,0.30370482632286044,-0.820681696042897,True,600.0,B1,[765000000.0],167,-2.428773765593044e-05,-0.00021454022409262113,0.00036529226449702587,-0.00010126765440978244
polarisation.py,MacBook-Pro,2020-04-30 15:41:54,exploratory,512,MID_FEKO_B1,0.30338702615093466,-0.813541419557847,True,600.0,B1,[765000000.0],168,-7.450738083238621e-05,-9.742583671919473e-05,0.000510155293475644,-0.00013113916258905965
polarisation.py,MacBook-Pro,2020-04-30 15:42:03,exploratory,512,MID_FEKO_B1,0.30307615986034986,-0.8064025079567688,True,600.0,B1,[765000000.0],169,-9.675393535559929e-05,-0.0001394768090979415,-0.000207925182739161,-4.679381215706461e-05
polarisation.py,MacBook-Pro,2020-04-30 15:42:11,exploratory,512,MID_FEKO_B1,0.3027720238620686,-0.7992645988288857,True,600.0,B1,[765000000.0],170,-2.7769960705944327e-05,-0.0012046252080924733,-0.001283889952831919,0.00023231278055359567
polarisation.py,MacBook-Pro,2020-04-30 15:42:20,exploratory,512,MID_FEKO_B1,0.30247442296323074,-0.792127330147823,True,600.0,B1,[765000000.0],171,0.000267542935746249,-0.003049903113534154,-0.0018226908187429331,0.0004192428464869401
polarisation.py,MacBook-Pro,2020-04-30 15:42:29,exploratory,512,MID_FEKO_B1,0.30218316994962047,-0.7849903401096188,True,600.0,B1,[765000000.0],172,0.00047137833048668375,-0.004140338844416887,-0.0011504567114176834,0.00041096960050472593
polarisation.py,MacBook-Pro,2020-04-30 15:42:37,exploratory,512,MID_FEKO_B1,0.30189808519323097,-0.7778532669708029,True,600.0,B1,[765000000.0],173,0.0004317190050131648,-0.0034992646299659164,0.00014434741132518896,0.0002817510613612294
polarisation.py,MacBook-Pro,2020-04-30 15:42:45,exploratory,512,MID_FEKO_B1,0.30161899628319566,-0.77071574888636,True,600.0,B1,[765000000.0],174,0.000205382802288355,-0.0018960280182652829,0.0005413565518346351,0.0001904427064800711
polarisation.py,MacBook-Pro,2020-04-30 15:42:53,exploratory,512,MID_FEKO_B1,0.3013457376784983,-0.7635774237473767,True,600.0,B1,[765000000.0],175,-4.197556164574914e-05,-0.0006716812037976459,7.559277341639701e-05,3.046200314638342e-05
polarisation.py,MacBook-Pro,2020-04-30 15:43:02,exploratory,512,MID_FEKO_B1,0.30107815038099034,-0.7564379290181925,True,600.0,B1,[765000000.0],176,-7.748876308926505e-05,-0.00014976353246417737,-0.0006644012234157168,-0.00011825022561252511
polarisation.py,MacBook-Pro,2020-04-30 15:43:11,exploratory,512,MID_FEKO_B1,0.30081608162736284,-0.7492969015728494,True,600.0,B1,[765000000.0],177,-4.293187164885793e-05,0.00015351960662081051,-0.0007428047001540816,-0.00011763096707364605
polarisation.py,MacBook-Pro,2020-04-30 15:43:19,exploratory,512,MID_FEKO_B1,0.3005593845988188,-0.742153977530647,True,600.0,B1,[765000000.0],178,5.750190574927987e-05,0.0003745488517324281,-0.0002984180362904439,3.9587831027654486e-05
polarisation.py,MacBook-Pro,2020-04-30 15:43:27,exploratory,512,MID_FEKO_B1,0.30030791814728963,-0.7350087920906064,True,600.0,B1,[765000000.0],179,0.00016888074160545348,0.00028897334156486004,6.6263490832134e-05,3.391103615693123e-05
polarisation.py,MacBook-Pro,2020-04-30 15:43:37,exploratory,512,MID_FEKO_B1,0.31499757484796076,-0.8347257271805181,True,600.0,B1,[765000000.0],180,5.423121402004583e-05,-4.120480992717359e-05,-0.00013497092167105032,3.2554630696889565e-05
polarisation.py,MacBook-Pro,2020-04-30 15:43:45,exploratory,512,MID_FEKO_B1,0.3145823969470357,-0.8275835993213922,True,600.0,B1,[765000000.0],181,7.043173250849217e-05,2.9757004888853245e-05,-0.00017306666642162745,5.817394419915056e-05
polarisation.py,MacBook-Pro,2020-04-30 15:43:54,exploratory,512,MID_FEKO_B1,0.31417642020228653,-0.8204435076729383,True,600.0,B1,[765000000.0],182,2.4556933261051037e-05,5.494064277457712e-05,5.5656892694710894e-05,3.0877794247126526e-05
polarisation.py,MacBook-Pro,2020-04-30 15:44:03,exploratory,512,MID_FEKO_B1,0.31377936790627386,-0.8133050901746556,True,600.0,B1,[765000000.0],183,-6.517106498511873e-05,0.00021172984669883097,0.0003842863571297639,-6.810737340436546e-05
polarisation.py,MacBook-Pro,2020-04-30 15:44:11,exploratory,512,MID_FEKO_B1,0.3133909749652151,-0.8061679854024434,True,600.0,B1,[765000000.0],184,-0.00010317609965240876,0.0004277650971917719,0.0004607270644155597,-0.000103520759159063
polarisation.py,MacBook-Pro,2020-04-30 15:44:19,exploratory,512,MID_FEKO_B1,0.3130109873091733,-0.7990318324095442,True,600.0,B1,[765000000.0],185,1.7684391515993076e-05,0.0003413587682134665,0.00020674078963166503,-5.136460192432095e-05
polarisation.py,MacBook-Pro,2020-04-30 15:44:27,exploratory,512,MID_FEKO_B1,0.3126391613383411,-0.7918962705677033,True,600.0,B1,[765000000.0],186,0.0002637141748324985,-0.00011798186122154511,-0.0001579839348694247,4.481254245236069e-05
polarisation.py,MacBook-Pro,2020-04-30 15:44:36,exploratory,512,MID_FEKO_B1,0.31227526340288525,-0.7847609394083715,True,600.0,B1,[765000000.0],187,0.0004530391888718391,-0.00045262974016501643,-0.0002063704678146963,0.00010347366970302482
polarisation.py,MacBook-Pro,2020-04-30 15:44:45,exploratory,512,MID_FEKO_B1,0.31191906931402297,-0.7776254784637817,True,600.0,B1,[765000000.0],188,0.0004129951806427001,-0.0003025421368377657,-0.00017037837056240086,0.00010045639460721552
polarisation.py,MacBook-Pro,2020-04-30 15:44:53,exploratory,512,MID_FEKO_B1,0.31157036388418125,-0.7704895271077176,True,600.0,B1,[765000000.0],189,0.00019429786386269884,0.00014065035237553837,-0.00034162497794671125,7.103797952592304e-05
polarisation.py,MacBook-Pro,2020-04-30 15:45:03,exploratory,512,MID_FEKO_B1,0.3112289404942631,-0.7633527243958005,True,600.0,B1,[765000000.0],190,-2.096901649814061e-05,0.00045379174673357655,-0.0006320933301883445,-9.38856331470262e-05
polarisation.py,MacBook-Pro,2020-04-30 15:45:11,exploratory,512,MID_FEKO_B1,0.31089460068619285,-0.7562147089051122,True,600.0,B1,[765000000.0],191,-3.655803329557112e-05,0.0005454993254472183,-0.0006851890389076689,-0.00010626249321234996
polarisation.py,MacBook-Pro,2020-04-30 15:45:20,exploratory,512,MID_FEKO_B1,0.3105671537790572,-0.7490751185729687,True,600.0,B1,[765000000.0],192,4.777351290155031e-05,0.0005261966967178774,-0.0003902323508144239,-5.1372905658269986e-05
polarisation.py,MacBook-Pro,2020-04-30 15:45:28,exploratory,512,MID_FEKO_B1,0.3102464165072842,-0.741933590534658,True,600.0,B1,[765000000.0],193,0.00014576520463391746,0.0003997658807918651,-4.738984223217054e-05,2.1479938144181137e-05
polarisation.py,MacBook-Pro,2020-04-30 15:45:37,exploratory,512,MID_FEKO_B1,0.3099322126794214,-0.7347897609599517,True,600.0,B1,[765000000.0],194,0.0001785336826805425,0.00015366224022515937,7.35295553487068e-05,1.6402202697957546e-05
polarisation.py,MacBook-Pro,2020-04-30 15:45:45,exploratory,512,MID_FEKO_B1,0.32562961231354576,-0.8344298771769445,True,600.0,B1,[765000000.0],195,3.703582732821183e-05,-0.00010982825566596479,-5.2789679324280516e-05,-2.3083802218177818e-05
polarisation.py,MacBook-Pro,2020-04-30 15:45:54,exploratory,512,MID_FEKO_B1,0.3251317141923211,-0.8272901526338322,True,600.0,B1,[765000000.0],196,9.340244209019625e-05,4.704730191851608e-06,-0.0001495050649528674,4.123687906616156e-05
polarisation.py,MacBook-Pro,2020-04-30 15:46:03,exploratory,512,MID_FEKO_B1,0.3246448444101194,-0.8201523967989309,True,600.0,B1,[765000000.0],197,0.00011564131711246855,9.986933021740435e-05,-0.00014935817908277255,7.170364597994926e-05
polarisation.py,MacBook-Pro,2020-04-30 15:46:11,exploratory,512,MID_FEKO_B1,0.32416867160927654,-0.8130162495700227,True,600.0,B1,[765000000.0],198,6.0771510997044495e-05,0.0002461694833598773,1.8099925913178327e-05,5.924437133037637e-05
polarisation.py,MacBook-Pro,2020-04-30 15:46:19,exploratory,512,MID_FEKO_B1,0.3237028783259937,-0.8058813513924449,True,600.0,B1,[765000000.0],199,-1.5250795649706395e-05,0.0005061110777824615,0.0001747565214109277,3.9500275475507346e-05
polarisation.py,MacBook-Pro,2020-04-30 15:46:27,exploratory,512,MID_FEKO_B1,0.32324716028560363,-0.7987473431044568,True,600.0,B1,[765000000.0],200,-1.2561000579409713e-05,0.0007905652774541493,0.00020432985171592416,-4.0200349505325514e-05
polarisation.py,MacBook-Pro,2020-04-30 15:46:35,exploratory,512,MID_FEKO_B1,0.3228012257409051,-0.7916138657825426,True,600.0,B1,[765000000.0],201,8.401601429573635e-05,0.0009680759363850451,8.647842403692215e-05,-4.0266007403480414e-05
polarisation.py,MacBook-Pro,2020-04-30 15:46:43,exploratory,512,MID_FEKO_B1,0.3223647948505486,-0.7844805605864975,True,600.0,B1,[765000000.0],202,0.00017193376331578852,0.0010284721246477501,-0.00011687412324522176,-4.345193216051088e-05
polarisation.py,MacBook-Pro,2020-04-30 15:46:51,exploratory,512,MID_FEKO_B1,0.3219375990946961,-0.7773470686041477,True,600.0,B1,[765000000.0],203,0.00015721040126068556,0.001023230673704235,-0.00031163715338136064,6.150099868507278e-05
polarisation.py,MacBook-Pro,2020-04-30 15:47:00,exploratory,512,MID_FEKO_B1,0.3215193807253973,-0.7702130306955347,True,600.0,B1,[765000000.0],204,7.576153965901822e-05,0.0009501389923381785,-0.00044724198698603475,6.587870641916681e-05
polarisation.py,MacBook-Pro,2020-04-30 15:47:08,exploratory,512,MID_FEKO_B1,0.32110989224932324,-0.7630780873364104,True,600.0,B1,[765000000.0],205,4.0505471049869235e-05,0.0007987874175086169,-0.00043525877630628277,-5.667385992093741e-05
polarisation.py,MacBook-Pro,2020-04-30 15:47:16,exploratory,512,MID_FEKO_B1,0.320708895940682,-0.7559418784608684,True,600.0,B1,[765000000.0],206,9.475002229766156e-05,0.0006119444532832418,-0.0002585621449637812,-3.461059355448536e-05
polarisation.py,MacBook-Pro,2020-04-30 15:47:23,exploratory,512,MID_FEKO_B1,0.3203161633823075,-0.7488040433029459,True,600.0,B1,[765000000.0],207,0.00017300582547009828,0.0004249383249309247,-5.411423389758707e-05,-1.3474201382517353e-05
polarisation.py,MacBook-Pro,2020-04-30 15:47:32,exploratory,512,MID_FEKO_B1,0.31993147503306574,-0.7416642202370153,True,600.0,B1,[765000000.0],208,0.0001941013930386296,0.00023442402497609414,3.0730985811871464e-05,-1.4684449291341362e-05
polarisation.py,MacBook-Pro,2020-04-30 15:47:40,exploratory,512,MID_FEKO_B1,0.3195546198198599,-0.7345220466167899,True,600.0,B1,[765000000.0],209,0.00014479274862400378,7.251683498571575e-05,-6.614446713030164e-05,-1.506279417916486e-05
polarisation.py,MacBook-Pro,2020-04-30 15:47:48,exploratory,512,MID_FEKO_B1,0.33625751793477254,-0.8340802533340971,True,600.0,B1,[765000000.0],210,1.7653906449062e-05,-0.00013248206357816458,6.203146271300564e-05,-5.253981966612319e-05
polarisation.py,MacBook-Pro,2020-04-30 15:47:55,exploratory,512,MID_FEKO_B1,0.33567707099395105,-0.8269433662598306,True,600.0,B1,[765000000.0],211,6.516478900857427e-05,-4.558536371431712e-05,-4.3545639593218005e-05,-1.850549884805233e-05
polarisation.py,MacBook-Pro,2020-04-30 15:48:03,exploratory,512,MID_FEKO_B1,0.33510947249620504,-0.8198083682360582,True,600.0,B1,[765000000.0],212,0.00013839509135188366,6.048341654507702e-05,-0.00010614575632255438,4.8929961781583884e-05
polarisation.py,MacBook-Pro,2020-04-30 15:48:11,exploratory,512,MID_FEKO_B1,0.3345543368079555,-0.8126749014679151,True,600.0,B1,[765000000.0],213,0.00016892704332672172,0.0001504567750998262,-0.00013194828787353773,0.0001033139562452083
polarisation.py,MacBook-Pro,2020-04-30 15:48:19,exploratory,512,MID_FEKO_B1,0.33401129444672667,-0.8055426086035331,True,600.0,B1,[765000000.0],214,0.0001363481002255265,0.00026073834028195344,-0.00010788909745155663,0.00011999468228746866
polarisation.py,MacBook-Pro,2020-04-30 15:48:28,exploratory,512,MID_FEKO_B1,0.33347999126312655,-0.7984111325846005,True,600.0,B1,[765000000.0],215,8.68191566568296e-05,0.00041412441830265974,-8.306790844015479e-05,0.00010260183109914837
polarisation.py,MacBook-Pro,2020-04-30 15:48:36,exploratory,512,MID_FEKO_B1,0.33296008767273866,-0.7912801164965321,True,600.0,B1,[765000000.0],216,6.383777083977312e-05,0.0005689497221482836,-0.00010359824006362762,7.812977435713978e-05
polarisation.py,MacBook-Pro,2020-04-30 15:48:46,exploratory,512,MID_FEKO_B1,0.3324512579344344,-0.7841492034181191,True,600.0,B1,[765000000.0],217,6.239526048687482e-05,0.0006606443283936463,-0.0001569737669949747,6.900875222283887e-05
polarisation.py,MacBook-Pro,2020-04-30 15:48:55,exploratory,512,MID_FEKO_B1,0.3319531894718947,-0.7770180362705266,True,600.0,B1,[765000000.0],218,6.574214825848365e-05,0.0006552480376073646,-0.0001908246395553542,6.84574145861211e-05
polarisation.py,MacBook-Pro,2020-04-30 15:49:02,exploratory,512,MID_FEKO_B1,0.33146558223538003,-0.7698862576654946,True,600.0,B1,[765000000.0],219,8.762014403473973e-05,0.0005662701719811787,-0.0001604278497683882,5.595720145163962e-05
polarisation.py,MacBook-Pro,2020-04-30 15:49:11,exploratory,512,MID_FEKO_B1,0.3309881481010189,-0.7627535097525989,True,600.0,B1,[765000000.0],220,0.0001437388429286891,0.0004413860060157862,-7.426698401885128e-05,2.561171629543761e-05
polarisation.py,MacBook-Pro,2020-04-30 15:49:19,exploratory,512,MID_FEKO_B1,0.33052061030509816,-0.7556194340654238,True,600.0,B1,[765000000.0],221,0.00020485219617284964,0.0003253015155893146,-1.0716506199149216e-05,-1.9927531406086416e-05
polarisation.py,MacBook-Pro,2020-04-30 15:49:26,exploratory,512,MID_FEKO_B1,0.330062702911028,-0.7484836713664821,True,600.0,B1,[765000000.0],222,0.00021719580561506256,0.00023043921683788712,-2.3787252176956987e-05,-4.215874651754193e-05
polarisation.py,MacBook-Pro,2020-04-30 15:49:34,exploratory,512,MID_FEKO_B1,0.3296141703068326,-0.7413458614907299,True,600.0,B1,[765000000.0],223,0.00016481125666257775,0.00015490685239656147,-9.64455601296132e-05,-4.777054224237546e-05
polarisation.py,MacBook-Pro,2020-04-30 15:49:42,exploratory,512,MID_FEKO_B1,0.32917476673117935,-0.7342056431875037,True,600.0,B1,[765000000.0],224,8.519494088712313e-05,0.00010877598460053564,-0.00013966238614035993,-3.129113114885314e-05
