nb_name,hostname,epoch,basename,npixel,pbtype,ra,dec,use_natural,integration_time,band,frequency,iscenario,onsource_I,onsource_Q,onsource_U,onsource_V
polarisation.py,MacBook-Pro,2020-05-01 00:20:31,exploratory,512,MID_FEKO_B2,0.23679157163492784,-0.025000000000000005,True,600.0,B2,[1360000000.0],0,7.625895784024735e-06,-1.0443746667881278e-05,9.779807017842748e-07,-1.3681063381864358e-06
polarisation.py,MacBook-Pro,2020-05-01 00:20:40,exploratory,512,MID_FEKO_B2,0.23679364602560923,-0.021427979123527924,True,600.0,B2,[1360000000.0],1,6.991565766555886e-06,-3.829752707022037e-05,-9.155154296921285e-05,-1.426536087075532e-05
polarisation.py,MacBook-Pro,2020-05-01 00:20:48,exploratory,512,MID_FEKO_B2,0.23679540087612724,-0.017856231676155937,True,600.0,B2,[1360000000.0],2,2.5055939036999272e-05,-7.436639559296584e-05,-0.0002689823061796353,3.8897309874276335e-05
polarisation.py,MacBook-Pro,2020-05-01 00:20:56,exploratory,512,MID_FEKO_B2,0.23679683638814603,-0.014284712038408203,True,600.0,B2,[1360000000.0],3,6.594658574026766e-05,-7.49178624774109e-05,-0.00043737758817291957,6.629350937048864e-05
polarisation.py,MacBook-Pro,2020-05-01 00:21:04,exploratory,512,MID_FEKO_B2,0.2367979527265759,-0.010713374616978435,True,600.0,B2,[1360000000.0],4,0.00011810603930126157,4.638048398727369e-05,-0.0005119124417492727,8.048924696110213e-05
polarisation.py,MacBook-Pro,2020-05-01 00:21:11,exploratory,512,MID_FEKO_B2,0.2367987500196258,-0.007142173839485973,True,600.0,B2,[1360000000.0],5,0.0001622106646301537,9.324434285321167e-05,-0.0004867194488331034,7.858044271887025e-05
polarisation.py,MacBook-Pro,2020-05-01 00:21:19,exploratory,512,MID_FEKO_B2,0.23679922835884448,-0.003571064149238539,True,600.0,B2,[1360000000.0],6,0.00018424185330220307,0.00012325949352579767,-0.0004203150077688715,6.844446681259365e-05
polarisation.py,MacBook-Pro,2020-05-01 00:21:27,exploratory,512,MID_FEKO_B2,0.2367993877991494,0.0,True,600.0,B2,[1360000000.0],7,0.00018132778589646957,0.00012521290231369832,-0.0003731078025602436,6.094136314194612e-05
polarisation.py,MacBook-Pro,2020-05-01 00:21:35,exploratory,512,MID_FEKO_B2,0.23679922835884448,0.003571064149238539,True,600.0,B2,[1360000000.0],8,0.00015753796341551216,0.0001237421052859123,-0.00036372694140548767,6.0682946659066965e-05
polarisation.py,MacBook-Pro,2020-05-01 00:21:42,exploratory,512,MID_FEKO_B2,0.2367987500196258,0.007142173839485973,True,600.0,B2,[1360000000.0],9,0.00011823993651398636,0.0001369955805777209,-0.00036673003340983475,6.306343940616608e-05
polarisation.py,MacBook-Pro,2020-05-01 00:21:50,exploratory,512,MID_FEKO_B2,0.2367979527265759,0.010713374616978435,True,600.0,B2,[1360000000.0],10,7.088567377469672e-05,0.00015254134727108755,-0.00033770843553107376,5.882729680107493e-05
polarisation.py,MacBook-Pro,2020-05-01 00:21:58,exploratory,512,MID_FEKO_B2,0.23679683638814603,0.014284712038408203,True,600.0,B2,[1360000000.0],11,2.8302092601938966e-05,0.00014292096761723609,-0.00025239860007234504,4.334607473099334e-05
polarisation.py,MacBook-Pro,2020-05-01 00:22:06,exploratory,512,MID_FEKO_B2,0.23679540087612724,0.017856231676155937,True,600.0,B2,[1360000000.0],12,4.217642271380433e-06,9.766217406298117e-05,-0.0001341365482362819,2.2053291143630743e-05
polarisation.py,MacBook-Pro,2020-05-01 00:22:13,exploratory,512,MID_FEKO_B2,0.23679364602560923,0.021427979123527924,True,600.0,B2,[1360000000.0],13,1.2416012170667659e-06,3.707286789975871e-05,-3.8819308487184835e-05,5.8351084065275444e-06
polarisation.py,MacBook-Pro,2020-05-01 00:22:21,exploratory,512,MID_FEKO_B2,0.23679157163492784,0.025000000000000005,True,600.0,B2,[1360000000.0],14,7.010913149470716e-06,-6.696773675014874e-06,-3.6229811307259486e-06,-5.395025864278625e-07
polarisation.py,MacBook-Pro,2020-05-01 00:22:29,exploratory,512,MID_FEKO_B2,0.2403647096620739,-0.025000000000000005,True,600.0,B2,[1360000000.0],15,8.409555550479847e-06,-5.765840582202521e-05,-6.646455089990349e-05,-9.825729653628228e-06
polarisation.py,MacBook-Pro,2020-05-01 00:22:36,exploratory,512,MID_FEKO_B2,0.2403664875636915,-0.021427979123527924,True,600.0,B2,[1360000000.0],16,3.6923505452277105e-05,-0.0001401863305215043,-0.00024627340746241367,3.7254528483602975e-05
polarisation.py,MacBook-Pro,2020-05-01 00:22:44,exploratory,512,MID_FEKO_B2,0.24036799159648636,-0.017856231676155937,True,600.0,B2,[1360000000.0],17,0.00010553998855385026,-0.00017723007019766117,-0.0004329297135069317,6.834342734727067e-05
polarisation.py,MacBook-Pro,2020-05-01 00:22:52,exploratory,512,MID_FEKO_B2,0.24036922193328966,-0.014284712038408203,True,600.0,B2,[1360000000.0],18,0.00020140769741897914,-0.00013678033194054368,-0.0004890269855883781,8.170952193061723e-05
polarisation.py,MacBook-Pro,2020-05-01 00:23:00,exploratory,512,MID_FEKO_B2,0.24037017871543348,-0.010713374616978435,True,600.0,B2,[1360000000.0],19,0.00029371656433461486,-5.1086661723088276e-05,-0.0003809545880102593,6.91255715861696e-05
polarisation.py,MacBook-Pro,2020-05-01 00:23:07,exploratory,512,MID_FEKO_B2,0.24037086205279606,-0.007142173839485973,True,600.0,B2,[1360000000.0],20,0.0003560114663189807,5.7363962091866454e-05,-0.000203066254994918,4.11657622041566e-05
polarisation.py,MacBook-Pro,2020-05-01 00:23:15,exploratory,512,MID_FEKO_B2,0.24037127202383685,-0.003571064149238539,True,600.0,B2,[1360000000.0],21,0.0003807191247708341,3.3495344658430245e-05,-7.377176097551114e-05,1.5234810572091954e-05
polarisation.py,MacBook-Pro,2020-05-01 00:23:23,exploratory,512,MID_FEKO_B2,0.24037140867562148,0.0,True,600.0,B2,[1360000000.0],22,0.000374902321590341,-1.956097347878427e-05,-4.135288626283926e-05,-9.873304613714705e-06
polarisation.py,MacBook-Pro,2020-05-01 00:23:30,exploratory,512,MID_FEKO_B2,0.24037127202383685,0.003571064149238539,True,600.0,B2,[1360000000.0],23,0.0003459888453152535,-3.092605108077872e-05,-8.534705334732815e-05,-1.91147247074692e-05
polarisation.py,MacBook-Pro,2020-05-01 00:23:38,exploratory,512,MID_FEKO_B2,0.24037086205279606,0.007142173839485973,True,600.0,B2,[1360000000.0],24,0.00029303919791413266,2.7328603212567658e-05,-0.00016993491125872953,-2.8191593758100153e-05
polarisation.py,MacBook-Pro,2020-05-01 00:23:46,exploratory,512,MID_FEKO_B2,0.24037017871543348,0.010713374616978435,True,600.0,B2,[1360000000.0],25,0.00021405993958766083,0.00010811759233536379,-0.00025026233349139315,3.8249445733316616e-05
polarisation.py,MacBook-Pro,2020-05-01 00:23:54,exploratory,512,MID_FEKO_B2,0.24036922193328966,0.014284712038408203,True,600.0,B2,[1360000000.0],26,0.00012137060104605596,0.0001586538539932784,-0.00027538691434587546,4.4280921369441886e-05
polarisation.py,MacBook-Pro,2020-05-01 00:24:01,exploratory,512,MID_FEKO_B2,0.24036799159648636,0.017856231676155937,True,600.0,B2,[1360000000.0],27,4.3650777398842556e-05,0.0001480303437636787,-0.00022003970769410958,3.5085288468173014e-05
polarisation.py,MacBook-Pro,2020-05-01 00:24:09,exploratory,512,MID_FEKO_B2,0.2403664875636915,0.021427979123527924,True,600.0,B2,[1360000000.0],28,4.813893121937208e-06,9.122856712433462e-05,-0.00011675008772408595,1.780931162902748e-05
polarisation.py,MacBook-Pro,2020-05-01 00:24:17,exploratory,512,MID_FEKO_B2,0.2403647096620739,0.025000000000000005,True,600.0,B2,[1360000000.0],29,1.3421961973786037e-06,2.940397794455805e-05,-3.124239297381109e-05,-4.735104232926224e-06
polarisation.py,MacBook-Pro,2020-05-01 00:24:25,exploratory,512,MID_FEKO_B2,0.24393757400351357,-0.025000000000000005,True,600.0,B2,[1360000000.0],30,3.527524355276669e-05,-0.00016859428347327525,-0.00016372258513959318,2.6711899707295084e-05
polarisation.py,MacBook-Pro,2020-05-01 00:24:32,exploratory,512,MID_FEKO_B2,0.2439390554841857,-0.021427979123527924,True,600.0,B2,[1360000000.0],31,0.00011881140880822665,-0.0002716687454140606,-0.00034441513559854226,5.676336263902329e-05
polarisation.py,MacBook-Pro,2020-05-01 00:24:40,exploratory,512,MID_FEKO_B2,0.24394030875687397,-0.017856231676155937,True,600.0,B2,[1360000000.0],32,0.00024924967507422726,-0.000247679078982865,-0.00040372885115046885,6.902235107909934e-05
polarisation.py,MacBook-Pro,2020-05-01 00:24:48,exploratory,512,MID_FEKO_B2,0.2439413339655875,-0.014284712038408203,True,600.0,B2,[1360000000.0],33,0.00038200016738150407,-0.00010715207135912018,-0.0002542137021638046,4.918261640137091e-05
polarisation.py,MacBook-Pro,2020-05-01 00:24:55,exploratory,512,MID_FEKO_B2,0.2439421312280893,-0.010713374616978435,True,600.0,B2,[1360000000.0],34,0.000470889543380495,3.312557625603118e-05,-1.236128666916211e-05,1.4290176310802548e-05
polarisation.py,MacBook-Pro,2020-05-01 00:25:03,exploratory,512,MID_FEKO_B2,0.24394270063593382,-0.007142173839485973,True,600.0,B2,[1360000000.0],35,0.0005016748690439667,5.1864810043397766e-05,0.00012694594405688852,2.018329909769845e-05
polarisation.py,MacBook-Pro,2020-05-01 00:25:11,exploratory,512,MID_FEKO_B2,0.24394304225449628,-0.003571064149238539,True,600.0,B2,[1360000000.0],36,0.0004942351203708651,-0.00012831467027031983,8.502886974372593e-05,-3.167643733744831e-05
polarisation.py,MacBook-Pro,2020-05-01 00:25:19,exploratory,512,MID_FEKO_B2,0.24394315612299347,0.0,True,600.0,B2,[1360000000.0],37,0.00047731672286007506,-0.0002620079458055012,-6.176826852303409e-05,-4.806604015724033e-05
polarisation.py,MacBook-Pro,2020-05-01 00:25:27,exploratory,512,MID_FEKO_B2,0.24394304225449628,0.003571064149238539,True,600.0,B2,[1360000000.0],38,0.00046343020450168043,-0.0002716955524840956,-9.877126845489558e-05,-5.435173426940547e-05
polarisation.py,MacBook-Pro,2020-05-01 00:26:06,exploratory,512,MID_FEKO_B2,0.24394270063593382,0.007142173839485973,True,600.0,B2,[1360000000.0],39,0.0004386930172120902,-0.00015675290774858585,-8.083403286968059e-05,-4.5063757034082264e-05
polarisation.py,MacBook-Pro,2020-05-01 01:58:29,exploratory,512,MID_FEKO_B2,0.2439421312280893,0.010713374616978435,True,600.0,B2,[1360000000.0],40,0.00037583261366425335,-1.113737623621168e-05,-8.464345950805802e-05,-3.195470237320058e-05
polarisation.py,MacBook-Pro,2020-05-01 01:58:54,exploratory,512,MID_FEKO_B2,0.2439413339655875,0.014284712038408203,True,600.0,B2,[1360000000.0],41,0.0002652063419427055,9.815961508026085e-05,-0.00013895457676081502,-2.6806044932796986e-05
polarisation.py,MacBook-Pro,2020-05-01 01:59:26,exploratory,512,MID_FEKO_B2,0.24394030875687397,0.017856231676155937,True,600.0,B2,[1360000000.0],42,0.00013634942411562887,0.0001296347941077457,-0.00018248684352423843,2.6815842483161952e-05
polarisation.py,MacBook-Pro,2020-05-01 01:59:56,exploratory,512,MID_FEKO_B2,0.2439390554841857,0.021427979123527924,True,600.0,B2,[1360000000.0],43,3.992524092417539e-05,0.00010494384177466621,-0.00015628762351067025,2.4276385494031552e-05
polarisation.py,MacBook-Pro,2020-05-01 02:00:27,exploratory,512,MID_FEKO_B2,0.24393757400351357,0.025000000000000005,True,600.0,B2,[1360000000.0],44,2.0789659175965325e-06,5.635545554547397e-05,-7.956766473924572e-05,1.1932779716347452e-05
polarisation.py,MacBook-Pro,2020-05-01 02:01:02,exploratory,512,MID_FEKO_B2,0.2475102103215655,-0.025000000000000005,True,600.0,B2,[1360000000.0],45,9.346847267572973e-05,-0.00030622927141286564,-0.00022576603915526193,4.1327174355470016e-05
polarisation.py,MacBook-Pro,2020-05-01 02:01:37,exploratory,512,MID_FEKO_B2,0.24751139543803746,-0.021427979123527924,True,600.0,B2,[1360000000.0],46,0.00023861434279866267,-0.0003585438880613883,-0.0003200178738909837,5.7707199134157834e-05
polarisation.py,MacBook-Pro,2020-05-01 02:02:14,exploratory,512,MID_FEKO_B2,0.24751239799861605,-0.017856231676155937,True,600.0,B2,[1360000000.0],47,0.0004079211763833463,-0.00018966801528305367,-0.00021256658465772585,3.9670133868573844e-05
polarisation.py,MacBook-Pro,2020-05-01 02:02:47,exploratory,512,MID_FEKO_B2,0.24751321811849752,-0.014284712038408203,True,600.0,B2,[1360000000.0],48,0.0005233907357365068,7.643938407467906e-05,3.428411210075379e-05,6.609233479527072e-06
polarisation.py,MacBook-Pro,2020-05-01 02:03:23,exploratory,512,MID_FEKO_B2,0.2475138558918832,-0.010713374616978435,True,600.0,B2,[1360000000.0],49,0.0005417611696109611,0.00022162950383478752,0.00011498474742330186,-2.4127390389777743e-05
polarisation.py,MacBook-Pro,2020-05-01 02:03:59,exploratory,512,MID_FEKO_B2,0.24751431139200974,-0.007142173839485973,True,600.0,B2,[1360000000.0],50,0.000487326675822674,0.00014623018776110697,-0.00021905911502220605,-4.7419292380909896e-05
polarisation.py,MacBook-Pro,2020-05-01 02:04:35,exploratory,512,MID_FEKO_B2,0.24751458467117227,-0.003571064149238539,True,600.0,B2,[1360000000.0],51,0.00041920046564746346,-0.00026806879052137763,-0.0008241851758380935,-0.00014468860791811084
polarisation.py,MacBook-Pro,2020-05-01 02:05:28,exploratory,512,MID_FEKO_B2,0.2475146757607412,0.0,True,600.0,B2,[1360000000.0],52,0.000385196230258316,-0.000451368364517146,-0.0012724132408450891,-0.0002228377768952345
polarisation.py,MacBook-Pro,2020-05-01 02:06:02,exploratory,512,MID_FEKO_B2,0.24751458467117227,0.003571064149238539,True,600.0,B2,[1360000000.0],53,0.0003997270393786216,-0.0003914718048655489,-0.001225538870474114,-0.00022780083725631051
polarisation.py,MacBook-Pro,2020-05-01 02:06:45,exploratory,512,MID_FEKO_B2,0.24751431139200974,0.007142173839485973,True,600.0,B2,[1360000000.0],54,0.000439886943891016,-0.00021182357744592195,-0.0007735269117439572,-0.000163854347235042
polarisation.py,MacBook-Pro,2020-05-01 02:07:20,exploratory,512,MID_FEKO_B2,0.2475138558918832,0.010713374616978435,True,600.0,B2,[1360000000.0],55,0.00045311872836531275,8.422298440575391e-05,-0.000293734813332473,-8.224141755178274e-05
polarisation.py,MacBook-Pro,2020-05-01 02:08:01,exploratory,512,MID_FEKO_B2,0.24751321811849752,0.014284712038408203,True,600.0,B2,[1360000000.0],56,0.0003904872527602395,9.135213994115167e-05,-6.42526992757803e-05,-3.129345170830199e-05
polarisation.py,MacBook-Pro,2020-05-01 02:08:49,exploratory,512,MID_FEKO_B2,0.24751239799861605,0.017856231676155937,True,600.0,B2,[1360000000.0],57,0.0002551421405427848,7.537857112633947e-05,-6.773997782518134e-05,-1.4098471376716634e-05
polarisation.py,MacBook-Pro,2020-05-01 02:09:23,exploratory,512,MID_FEKO_B2,0.24751139543803746,0.021427979123527924,True,600.0,B2,[1360000000.0],58,0.00011018669519835199,6.306201795920495e-05,-0.00011604343498620977,1.9114216290086177e-05
polarisation.py,MacBook-Pro,2020-05-01 02:09:56,exploratory,512,MID_FEKO_B2,0.2475102103215655,0.025000000000000005,True,600.0,B2,[1360000000.0],59,2.218826665650209e-05,4.4999527050601486e-05,-0.00010183197771966124,1.6632468935883257e-05
polarisation.py,MacBook-Pro,2020-05-01 02:10:33,exploratory,512,MID_FEKO_B2,0.2510826642523378,-0.025000000000000005,True,600.0,B2,[1360000000.0],60,0.00016577215139064715,-0.00041856507483014363,-0.00021898557791413876,4.528135237667098e-05
polarisation.py,MacBook-Pro,2020-05-01 02:11:07,exploratory,512,MID_FEKO_B2,0.2510835530499928,-0.021427979123527924,True,600.0,B2,[1360000000.0],61,0.0003547133157781341,-0.0003450954233326817,-0.0002123207064455541,4.318102408300637e-05
polarisation.py,MacBook-Pro,2020-05-01 02:12:02,exploratory,512,MID_FEKO_B2,0.2510843049368482,-0.017856231676155937,True,600.0,B2,[1360000000.0],62,0.0005204058442796858,1.6937814644447424e-05,-3.110238632807095e-05,6.359882798444206e-06
polarisation.py,MacBook-Pro,2020-05-01 02:12:46,exploratory,512,MID_FEKO_B2,0.2510849199992947,-0.014284712038408203,True,600.0,B2,[1360000000.0],63,0.0005652477475703979,0.00038104438003347315,9.32079535176038e-05,-2.7699835707174405e-05
polarisation.py,MacBook-Pro,2020-05-01 02:13:31,exploratory,512,MID_FEKO_B2,0.25108539830797805,-0.010713374616978435,True,600.0,B2,[1360000000.0],64,0.0004772886419737457,0.0004552496316279841,-0.0002815261449810515,-6.55687871583392e-05
polarisation.py,MacBook-Pro,2020-05-01 02:14:17,exploratory,512,MID_FEKO_B2,0.2510857399178217,-0.007142173839485973,True,600.0,B2,[1360000000.0],65,0.0003322472767724336,0.00022940952876548588,-0.0013461107412077818,-0.00022004646054875395
polarisation.py,MacBook-Pro,2020-05-01 02:15:49,exploratory,512,MID_FEKO_B2,0.2510859448680439,-0.003571064149238539,True,600.0,B2,[1360000000.0],66,0.00021761481642205177,-0.0003383788391185402,-0.002693386899674565,-0.00041354202061488
polarisation.py,MacBook-Pro,2020-05-01 02:17:03,exploratory,512,MID_FEKO_B2,0.251086013182171,0.0,True,600.0,B2,[1360000000.0],67,0.00017457535304731494,-0.00046045200170004573,-0.0035247078689622908,-0.0005395045237640621
polarisation.py,MacBook-Pro,2020-05-01 02:18:39,exploratory,512,MID_FEKO_B2,0.2510859448680439,0.003571064149238539,True,600.0,B2,[1360000000.0],68,0.00020833048075056927,-0.0002416671120475785,-0.0033115635876425843,-0.0005201154818691843
polarisation.py,MacBook-Pro,2020-05-01 02:19:50,exploratory,512,MID_FEKO_B2,0.2510857399178217,0.007142173839485973,True,600.0,B2,[1360000000.0],69,0.0003038673511383646,0.0003077278456884414,-0.002246660291038379,-0.0003745695939175274
polarisation.py,MacBook-Pro,2020-05-01 02:21:01,exploratory,512,MID_FEKO_B2,0.25108539830797805,0.010713374616978435,True,600.0,B2,[1360000000.0],70,0.0004093885591233763,0.00042915878143613646,-0.0010271227101420026,-0.0001926125984195524
polarisation.py,MacBook-Pro,2020-05-01 02:22:15,exploratory,512,MID_FEKO_B2,0.2510849199992947,0.014284712038408203,True,600.0,B2,[1360000000.0],71,0.00044224252378133474,0.0003183693578096149,-0.0002460058222157966,-6.199799337147855e-05
polarisation.py,MacBook-Pro,2020-05-01 02:23:27,exploratory,512,MID_FEKO_B2,0.2510843049368482,0.017856231676155937,True,600.0,B2,[1360000000.0],72,0.0003553042105512402,8.99068108526031e-05,-9.759924778174754e-06,-1.1430060303495884e-05
polarisation.py,MacBook-Pro,2020-05-01 02:24:46,exploratory,512,MID_FEKO_B2,0.2510835530499928,0.021427979123527924,True,600.0,B2,[1360000000.0],73,0.0001954717398796787,-7.864003117206233e-05,-4.200407235752501e-05,9.322416403397293e-06
polarisation.py,MacBook-Pro,2020-05-01 02:25:29,exploratory,512,MID_FEKO_B2,0.2510826642523378,0.025000000000000005,True,600.0,B2,[1360000000.0],74,6.142921005137389e-05,-8.334215435873039e-05,-8.303109675556165e-05,1.5348740037300604e-05
polarisation.py,MacBook-Pro,2020-05-01 02:26:22,exploratory,512,MID_FEKO_B2,0.25465498141098003,-0.025000000000000005,True,600.0,B2,[1360000000.0],75,0.00022679538850818706,-0.0004764352373027115,-0.00015962987499578245,4.037836552653548e-05
polarisation.py,MacBook-Pro,2020-05-01 02:27:26,exploratory,512,MID_FEKO_B2,0.25465557392384797,-0.021427979123527924,True,600.0,B2,[1360000000.0],76,0.0004320580774064661,-0.0002481851384923269,-0.00010458164737217474,2.507354487594902e-05
polarisation.py,MacBook-Pro,2020-05-01 02:28:11,exploratory,512,MID_FEKO_B2,0.25465607516576366,-0.017856231676155937,True,600.0,B2,[1360000000.0],77,0.0005621489770068954,0.00027917589930244376,3.7202320611217954e-05,-1.7665176222255505e-05
polarisation.py,MacBook-Pro,2020-05-01 02:29:05,exploratory,512,MID_FEKO_B2,0.25465648519431777,-0.014284712038408203,True,600.0,B2,[1360000000.0],78,0.0005216917907050463,0.0006970558798415559,-6.126691631299821e-05,-3.860362404706575e-05
polarisation.py,MacBook-Pro,2020-05-01 02:30:25,exploratory,512,MID_FEKO_B2,0.25465680405660507,-0.010713374616978435,True,600.0,B2,[1360000000.0],79,0.000346310686448031,0.00062870066469391,-0.0007801327543169708,-0.00014241536322961111
polarisation.py,MacBook-Pro,2020-05-01 02:31:04,exploratory,512,MID_FEKO_B2,0.2546570317892391,-0.007142173839485973,True,600.0,B2,[1360000000.0],80,0.0001605524841621419,0.00021522220514808889,-0.0022754916339842554,-0.0003512329958542796
polarisation.py,MacBook-Pro,2020-05-01 02:31:40,exploratory,512,MID_FEKO_B2,0.25465716841836417,-0.003571064149238539,True,600.0,B2,[1360000000.0],81,5.121574130944803e-05,-0.0003667388319657362,-0.003988931771106084,-0.0005895113733060559
polarisation.py,MacBook-Pro,2020-05-01 02:32:19,exploratory,512,MID_FEKO_B2,0.25465721395966345,0.0,True,600.0,B2,[1360000000.0],82,1.911674667699957e-05,-0.00030071468111965606,-0.0049979059550807866,-0.000733485636675648
polarisation.py,MacBook-Pro,2020-05-01 02:32:57,exploratory,512,MID_FEKO_B2,0.25465716841836417,0.003571064149238539,True,600.0,B2,[1360000000.0],83,4.7176177636112644e-05,0.00035371830819162645,-0.004708582570873821,-0.0007001773852481134
polarisation.py,MacBook-Pro,2020-05-01 02:33:38,exploratory,512,MID_FEKO_B2,0.2546570317892391,0.007142173839485973,True,600.0,B2,[1360000000.0],84,0.00014724301192177108,0.0009122940122620061,-0.003336138977417747,-0.000511674518382542
polarisation.py,MacBook-Pro,2020-05-01 02:34:27,exploratory,512,MID_FEKO_B2,0.25465680405660507,0.010713374616978435,True,600.0,B2,[1360000000.0],85,0.00030476251781133817,0.0011230615787298916,-0.0016921373317793638,-0.0002758591565645456
polarisation.py,MacBook-Pro,2020-05-01 02:35:35,exploratory,512,MID_FEKO_B2,0.25465648519431777,0.014284712038408203,True,600.0,B2,[1360000000.0],86,0.0004270837364895244,0.0008038488719009955,-0.0005215542974550759,-9.661052998433395e-05
polarisation.py,MacBook-Pro,2020-05-01 02:36:11,exploratory,512,MID_FEKO_B2,0.25465607516576366,0.017856231676155937,True,600.0,B2,[1360000000.0],87,0.00041336297170622895,0.00026421073112412833,-3.822181839137795e-05,-1.3843884779845766e-05
polarisation.py,MacBook-Pro,2020-05-01 02:36:48,exploratory,512,MID_FEKO_B2,0.25465557392384797,0.021427979123527924,True,600.0,B2,[1360000000.0],88,0.00026962146974158455,-0.00011251070404672576,1.3352772894554171e-05,4.99799160196821e-06
polarisation.py,MacBook-Pro,2020-05-01 02:37:25,exploratory,512,MID_FEKO_B2,0.25465498141098003,0.025000000000000005,True,600.0,B2,[1360000000.0],89,0.0001065343586349898,-0.0001808460340127191,-4.581385821482268e-05,1.0312908379196121e-05
polarisation.py,MacBook-Pro,2020-05-01 02:38:12,exploratory,512,MID_FEKO_B2,0.25822720739692917,-0.025000000000000005,True,600.0,B2,[1360000000.0],90,0.00026250900401694267,-0.0004892600094698693,-8.524133488897612e-05,3.294934856693376e-05
polarisation.py,MacBook-Pro,2020-05-01 02:38:59,exploratory,512,MID_FEKO_B2,0.2582275036476929,-0.021427979123527924,True,600.0,B2,[1360000000.0],91,0.0004662932600631489,-0.00014276208274529624,-4.010520008011537e-05,1.1202337173206668e-05
polarisation.py,MacBook-Pro,2020-05-01 02:39:41,exploratory,512,MID_FEKO_B2,0.25822775426385475,-0.017856231676155937,True,600.0,B2,[1360000000.0],92,0.0005579403491348793,0.0004866881292191266,3.220410927890964e-05,-2.5137435509440106e-05
polarisation.py,MacBook-Pro,2020-05-01 02:40:19,exploratory,512,MID_FEKO_B2,0.25822795927420905,-0.014284712038408203,True,600.0,B2,[1360000000.0],93,0.0004557414975982096,0.0008942749984267127,-0.00011043028038763649,-3.3837096753089835e-05
polarisation.py,MacBook-Pro,2020-05-01 02:41:33,exploratory,512,MID_FEKO_B2,0.25822811870230244,-0.010713374616978435,True,600.0,B2,[1360000000.0],94,0.00023887025047062907,0.0006851079014912563,-0.0006809760170253212,-0.0001171605135453864
polarisation.py,MacBook-Pro,2020-05-01 02:42:15,exploratory,512,MID_FEKO_B2,0.2582282325664411,-0.007142173839485973,True,600.0,B2,[1360000000.0],95,6.32445551128347e-05,-0.00010639664297904482,-0.0017727501068102252,-0.0002682137676700144
polarisation.py,MacBook-Pro,2020-05-01 02:42:51,exploratory,512,MID_FEKO_B2,0.2582283008796968,-0.003571064149238539,True,600.0,B2,[1360000000.0],96,-3.7562106922609047e-06,-0.00039271315278063633,-0.0030235680386650476,-0.0004397910498197948
polarisation.py,MacBook-Pro,2020-05-01 02:43:34,exploratory,512,MID_FEKO_B2,0.2582283236499109,0.0,True,600.0,B2,[1360000000.0],97,-1.2135362661214747e-05,-9.918749480120841e-05,-0.0037966055617744982,-0.000547420555265702
polarisation.py,MacBook-Pro,2020-05-01 02:44:15,exploratory,512,MID_FEKO_B2,0.2582283008796968,0.003571064149238539,True,600.0,B2,[1360000000.0],98,-5.1955730988672875e-06,0.0008058025488982306,-0.0036489048131035286,-0.0005304904432031276
polarisation.py,MacBook-Pro,2020-05-01 02:44:52,exploratory,512,MID_FEKO_B2,0.2582282325664411,0.007142173839485973,True,600.0,B2,[1360000000.0],99,6.0446999713067324e-05,0.0016709018401394177,-0.002682076685332428,-0.00039857259415982126
polarisation.py,MacBook-Pro,2020-05-01 02:45:06,exploratory,512,MID_FEKO_B2,0.25822811870230244,0.010713374616978435,True,600.0,B2,[1360000000.0],100,0.00022019927236641983,0.0018787866702403768,-0.0014482863745217684,-0.00022363299919827935
polarisation.py,MacBook-Pro,2020-05-01 02:45:19,exploratory,512,MID_FEKO_B2,0.25822795927420905,0.014284712038408203,True,600.0,B2,[1360000000.0],101,0.0003921597851046599,0.001340500342642056,-0.0005065297934613192,-9.018388403810439e-05
polarisation.py,MacBook-Pro,2020-05-01 02:45:43,exploratory,512,MID_FEKO_B2,0.25822775426385475,0.017856231676155937,True,600.0,B2,[1360000000.0],102,0.0004365270681537488,0.0004984742844830944,-7.220935107505074e-05,-1.9682609457830983e-05
polarisation.py,MacBook-Pro,2020-05-01 02:45:54,exploratory,512,MID_FEKO_B2,0.2582275036476929,0.021427979123527924,True,600.0,B2,[1360000000.0],103,0.0003171854700536028,-0.00010643277606529857,1.9286362529299306e-05,6.1707965739882e-06
polarisation.py,MacBook-Pro,2020-05-01 02:46:05,exploratory,512,MID_FEKO_B2,0.25822720739692917,0.025000000000000005,True,600.0,B2,[1360000000.0],104,0.00014139134337182838,-0.00026174972818158434,-1.9367920252587227e-05,6.222849526694863e-06
polarisation.py,MacBook-Pro,2020-05-01 02:46:15,exploratory,512,MID_FEKO_B2,0.2617993877991494,-0.025000000000000005,True,600.0,B2,[1360000000.0],105,0.00027349455222485714,-0.00048350412055080203,5.577913660441141e-05,-2.5601480779464347e-05
polarisation.py,MacBook-Pro,2020-05-01 02:46:24,exploratory,512,MID_FEKO_B2,0.2617993877991494,-0.021427979123527924,True,600.0,B2,[1360000000.0],106,0.00047414844817910014,-0.00010163048330574925,-6.8530878491008214e-06,-3.6042723120628163e-06
polarisation.py,MacBook-Pro,2020-05-01 02:46:35,exploratory,512,MID_FEKO_B2,0.2617993877991494,-0.017856231676155937,True,600.0,B2,[1360000000.0],107,0.0005495054979569657,0.00054216644330478,-4.81736378746024e-05,2.2578258682433353e-05
polarisation.py,MacBook-Pro,2020-05-01 02:46:47,exploratory,512,MID_FEKO_B2,0.2617993877991494,-0.014284712038408203,True,600.0,B2,[1360000000.0],108,0.0004253441421630483,0.000914992269499653,2.6437696773875645e-05,1.172795170441695e-05
polarisation.py,MacBook-Pro,2020-05-01 02:46:58,exploratory,512,MID_FEKO_B2,0.2617993877991494,-0.010713374616978435,True,600.0,B2,[1360000000.0],109,0.0001987972641635856,0.0006391974057497145,0.00016295255561922102,5.1728913412479344e-05
polarisation.py,MacBook-Pro,2020-05-01 02:47:09,exploratory,512,MID_FEKO_B2,0.2617993877991494,-0.007142173839485973,True,600.0,B2,[1360000000.0],110,3.652987105183814e-05,-7.821510736837258e-05,0.000283630952698188,0.00010559360032814111
polarisation.py,MacBook-Pro,2020-05-01 02:47:28,exploratory,512,MID_FEKO_B2,0.2617993877991494,-0.003571064149238539,True,600.0,B2,[1360000000.0],111,-4.852413595900699e-06,-0.0004271973488754858,0.00021258249435160368,9.443108388623215e-05
polarisation.py,MacBook-Pro,2020-05-01 02:47:37,exploratory,512,MID_FEKO_B2,0.2617993877991494,0.0,True,600.0,B2,[1360000000.0],112,-2.1314647560832747e-07,-4.5926934449075275e-05,-8.713462878299604e-05,1.2547101765939809e-05
polarisation.py,MacBook-Pro,2020-05-01 02:47:47,exploratory,512,MID_FEKO_B2,0.2617993877991494,0.003571064149238539,True,600.0,B2,[1360000000.0],113,-3.915412685634917e-06,0.0010855276163567573,-0.00035155198943832226,-0.00011263645027607428
polarisation.py,MacBook-Pro,2020-05-01 02:47:56,exploratory,512,MID_FEKO_B2,0.2617993877991494,0.007142173839485973,True,600.0,B2,[1360000000.0],114,4.026414840730315e-05,0.0020588804893364346,-0.0004711789298091222,-0.0001726619294666886
polarisation.py,MacBook-Pro,2020-05-01 02:48:06,exploratory,512,MID_FEKO_B2,0.2617993877991494,0.010713374616978435,True,600.0,B2,[1360000000.0],115,0.00019187481300106062,0.002257317233826125,-0.0003789996541996612,-0.00015139677363398994
polarisation.py,MacBook-Pro,2020-05-01 02:48:16,exploratory,512,MID_FEKO_B2,0.2617993877991494,0.014284712038408203,True,600.0,B2,[1360000000.0],116,0.00037717029119066617,0.0016067613357006565,-0.00019187529974455054,-8.520010053456041e-05
polarisation.py,MacBook-Pro,2020-05-01 02:48:26,exploratory,512,MID_FEKO_B2,0.2617993877991494,0.017856231676155937,True,600.0,B2,[1360000000.0],117,0.0004425861851771921,0.0006163707580267701,-4.724898768773465e-05,-2.6657014602784184e-05
polarisation.py,MacBook-Pro,2020-05-01 02:48:37,exploratory,512,MID_FEKO_B2,0.2617993877991494,0.021427979123527924,True,600.0,B2,[1360000000.0],118,0.00033402571424377296,-0.00010023596953545364,8.930391093667857e-06,3.8371383368149e-06
polarisation.py,MacBook-Pro,2020-05-01 02:48:48,exploratory,512,MID_FEKO_B2,0.2617993877991494,0.025000000000000005,True,600.0,B2,[1360000000.0],119,0.00015487281704883887,-0.0002990106885226527,1.008903248007757e-05,5.966466699098282e-06
polarisation.py,MacBook-Pro,2020-05-01 02:49:01,exploratory,512,MID_FEKO_B2,0.26537156820136965,-0.025000000000000005,True,600.0,B2,[1360000000.0],120,0.000262213028276641,-0.00047131379367662513,0.0001304329872494899,-3.697563398360487e-05
polarisation.py,MacBook-Pro,2020-05-01 02:49:26,exploratory,512,MID_FEKO_B2,0.2653712719506059,-0.021427979123527924,True,600.0,B2,[1360000000.0],121,0.0004658335357030733,-0.00014611933936038607,3.682604268501733e-05,-1.2283832366316246e-05
polarisation.py,MacBook-Pro,2020-05-01 02:49:36,exploratory,512,MID_FEKO_B2,0.26537102133444407,-0.017856231676155937,True,600.0,B2,[1360000000.0],122,0.0005567083903259905,0.0004305690720769276,-6.387858394958808e-05,2.341247775817765e-05
polarisation.py,MacBook-Pro,2020-05-01 02:49:47,exploratory,512,MID_FEKO_B2,0.26537081632408976,-0.014284712038408203,True,600.0,B2,[1360000000.0],123,0.00045289683585211083,0.0007715892076008001,0.00014304936576847968,3.994055161161125e-05
polarisation.py,MacBook-Pro,2020-05-01 02:49:59,exploratory,512,MID_FEKO_B2,0.26537065689599637,-0.010713374616978435,True,600.0,B2,[1360000000.0],124,0.00023438084121299888,0.000520335219809417,0.0008916986935442703,0.00015052432238413878
polarisation.py,MacBook-Pro,2020-05-01 02:50:10,exploratory,512,MID_FEKO_B2,0.2653705430318577,-0.007142173839485973,True,600.0,B2,[1360000000.0],125,5.861680509848281e-05,-0.00019339601803868668,0.0020963778547447836,0.00031601000303977593
polarisation.py,MacBook-Pro,2020-05-01 02:50:21,exploratory,512,MID_FEKO_B2,0.26537047471860203,-0.003571064149238539,True,600.0,B2,[1360000000.0],126,-6.135661158116678e-06,-0.00045889638986580525,0.003240138543619706,0.00047094413474078103
polarisation.py,MacBook-Pro,2020-05-01 02:50:32,exploratory,512,MID_FEKO_B2,0.26537045194838793,0.0,True,600.0,B2,[1360000000.0],127,-1.186274910325164e-05,-6.024945670286753e-05,0.0037106122359385606,0.0005348072126572745
polarisation.py,MacBook-Pro,2020-05-01 02:50:42,exploratory,512,MID_FEKO_B2,0.26537047471860203,0.003571064149238539,True,600.0,B2,[1360000000.0],128,-3.4339629421538137e-06,0.0009524432396110206,0.0032692642110769485,0.00047511322384616696
polarisation.py,MacBook-Pro,2020-05-01 02:50:54,exploratory,512,MID_FEKO_B2,0.2653705430318577,0.007142173839485973,True,600.0,B2,[1360000000.0],129,6.256732426533514e-05,0.00185826938195207,0.0022094777947170782,0.0003280992541739978
polarisation.py,MacBook-Pro,2020-05-01 02:51:17,exploratory,512,MID_FEKO_B2,0.26537065689599637,0.010713374616978435,True,600.0,B2,[1360000000.0],130,0.00022187786789266642,0.0020396804221902085,0.0010961502090391637,0.00018435540195424865
polarisation.py,MacBook-Pro,2020-05-01 02:51:28,exploratory,512,MID_FEKO_B2,0.26537081632408976,0.014284712038408203,True,600.0,B2,[1360000000.0],131,0.0003940710899650206,0.0014325039184236252,0.0003624322484132619,9.013781299667586e-05
polarisation.py,MacBook-Pro,2020-05-01 02:51:38,exploratory,512,MID_FEKO_B2,0.26537102133444407,0.017856231676155937,True,600.0,B2,[1360000000.0],132,0.0004390908187532687,0.0005201281526489706,5.381272483092241e-05,-2.446525690835694e-05
polarisation.py,MacBook-Pro,2020-05-01 02:51:49,exploratory,512,MID_FEKO_B2,0.2653712719506059,0.021427979123527924,True,600.0,B2,[1360000000.0],133,0.000319793991563031,-0.00012576474678088103,-8.538392528348067e-06,-6.419789924176679e-06
polarisation.py,MacBook-Pro,2020-05-01 02:51:58,exploratory,512,MID_FEKO_B2,0.26537156820136965,0.025000000000000005,True,600.0,B2,[1360000000.0],134,0.0001431593661494629,-0.0002879641584854602,2.2998516343945135e-05,-7.110294404917748e-06
polarisation.py,MacBook-Pro,2020-05-01 02:52:08,exploratory,512,MID_FEKO_B2,0.2689437941873188,-0.025000000000000005,True,600.0,B2,[1360000000.0],135,0.00022548551514744305,-0.00043822400168018553,0.00021511027923814516,-4.951129479582621e-05
polarisation.py,MacBook-Pro,2020-05-01 02:52:19,exploratory,512,MID_FEKO_B2,0.26894320167445085,-0.021427979123527924,True,600.0,B2,[1360000000.0],136,0.0004303689475575838,-0.00023571026156167066,0.00011653438280849609,-2.8291173774404447e-05
polarisation.py,MacBook-Pro,2020-05-01 02:52:29,exploratory,512,MID_FEKO_B2,0.26894270043253515,-0.017856231676155937,True,600.0,B2,[1360000000.0],137,0.000559537189429114,0.00021181392319285976,-6.492674614974959e-05,1.690616661761715e-05
polarisation.py,MacBook-Pro,2020-05-01 02:52:41,exploratory,512,MID_FEKO_B2,0.26894229040398104,-0.014284712038408203,True,600.0,B2,[1360000000.0],138,0.0005169174678916894,0.0005206932460235865,7.283514700604894e-05,3.8220823669698924e-05
polarisation.py,MacBook-Pro,2020-05-01 02:52:53,exploratory,512,MID_FEKO_B2,0.26894197154169375,-0.010713374616978435,True,600.0,B2,[1360000000.0],139,0.0003388840035719074,0.0004118875345089337,0.0009443398263175556,0.00016877753824093777
polarisation.py,MacBook-Pro,2020-05-01 02:53:16,exploratory,512,MID_FEKO_B2,0.2689417438090597,-0.007142173839485973,True,600.0,B2,[1360000000.0],140,0.0001522279574562773,-0.00023681390258033385,0.0025638800625434116,0.0003944095916270357
polarisation.py,MacBook-Pro,2020-05-01 02:53:27,exploratory,512,MID_FEKO_B2,0.26894160717993465,-0.003571064149238539,True,600.0,B2,[1360000000.0],141,4.5008145187154996e-05,-0.0004759253987839779,0.004245095328826294,0.000626901862315549
polarisation.py,MacBook-Pro,2020-05-01 02:53:36,exploratory,512,MID_FEKO_B2,0.26894156163863536,0.0,True,600.0,B2,[1360000000.0],142,1.6554712927756158e-05,-0.00022920914017649532,0.005062558975112674,0.0007423950456803761
polarisation.py,MacBook-Pro,2020-05-01 02:53:44,exploratory,512,MID_FEKO_B2,0.26894160717993465,0.003571064149238539,True,600.0,B2,[1360000000.0],143,4.702772171809547e-05,0.0005399566756842838,0.004561439889304327,0.0006772910328218555
polarisation.py,MacBook-Pro,2020-05-01 02:53:55,exploratory,512,MID_FEKO_B2,0.2689417438090597,0.007142173839485973,True,600.0,B2,[1360000000.0],144,0.0001474772010178841,0.0011980803636360694,0.003100948692036967,0.00047412408833083427
polarisation.py,MacBook-Pro,2020-05-01 02:54:04,exploratory,512,MID_FEKO_B2,0.26894197154169375,0.010713374616978435,True,600.0,B2,[1360000000.0],145,0.0003051094878204091,0.001361889575321631,0.0015111358480643946,0.00024405755760980268
polarisation.py,MacBook-Pro,2020-05-01 02:54:12,exploratory,512,MID_FEKO_B2,0.26894229040398104,0.014284712038408203,True,600.0,B2,[1360000000.0],146,0.0004288127167159948,0.0009295883973177215,0.0004456775080887586,7.981077206057226e-05
polarisation.py,MacBook-Pro,2020-05-01 02:54:22,exploratory,512,MID_FEKO_B2,0.26894270043253515,0.017856231676155937,True,600.0,B2,[1360000000.0],147,0.0004169541896574188,0.0002798754595418166,3.142745298700186e-05,1.3191836512809389e-05
polarisation.py,MacBook-Pro,2020-05-01 02:54:30,exploratory,512,MID_FEKO_B2,0.26894320167445085,0.021427979123527924,True,600.0,B2,[1360000000.0],148,0.00027371307241017435,-0.00015432625716066108,-9.783827472866478e-06,-6.894621440256935e-06
polarisation.py,MacBook-Pro,2020-05-01 02:54:39,exploratory,512,MID_FEKO_B2,0.2689437941873188,0.025000000000000005,True,600.0,B2,[1360000000.0],149,0.00010937144787475157,-0.00022665379230513974,4.219874917401598e-05,-9.346534457512555e-06
polarisation.py,MacBook-Pro,2020-05-01 02:54:59,exploratory,512,MID_FEKO_B2,0.27251611134596104,-0.025000000000000005,True,600.0,B2,[1360000000.0],150,0.00016309501506619795,-0.00036372416677726897,0.0002757524038763282,-5.410675577835002e-05
polarisation.py,MacBook-Pro,2020-05-01 02:55:08,exploratory,512,MID_FEKO_B2,0.272515222548306,-0.021427979123527924,True,600.0,B2,[1360000000.0],151,0.00035121133746207514,-0.00029926308221303816,0.00024222133583342128,-4.835808278406905e-05
polarisation.py,MacBook-Pro,2020-05-01 02:55:18,exploratory,512,MID_FEKO_B2,0.2725144706614506,-0.017856231676155937,True,600.0,B2,[1360000000.0],152,0.0005163000315910979,-1.849647918082939e-05,2.050703724310069e-05,-4.377798356112031e-06
polarisation.py,MacBook-Pro,2020-05-01 02:55:28,exploratory,512,MID_FEKO_B2,0.2725138555990041,-0.014284712038408203,True,600.0,B2,[1360000000.0],153,0.0005596281667602284,0.0002543664184260362,-9.113335920795808e-05,2.9278004691067945e-05
polarisation.py,MacBook-Pro,2020-05-01 02:55:37,exploratory,512,MID_FEKO_B2,0.27251337729032077,-0.010713374616978435,True,600.0,B2,[1360000000.0],154,0.00046913433631021255,0.0002736688198196572,0.00038017437822147497,8.245170695820549e-05
polarisation.py,MacBook-Pro,2020-05-01 02:55:47,exploratory,512,MID_FEKO_B2,0.27251303568047713,-0.007142173839485973,True,600.0,B2,[1360000000.0],155,0.000322395586672829,-0.00021942346082087595,0.0015597064445905151,0.0002535124468458171
polarisation.py,MacBook-Pro,2020-05-01 02:55:57,exploratory,512,MID_FEKO_B2,0.2725128307302549,-0.003571064149238539,True,600.0,B2,[1360000000.0],156,0.0002085425623577629,-0.0004555345660292705,0.0029403205249364465,0.0004511723156598229
polarisation.py,MacBook-Pro,2020-05-01 02:56:08,exploratory,512,MID_FEKO_B2,0.2725127624161278,0.0,True,600.0,B2,[1360000000.0],157,0.00016802936381409356,-0.0004015262077654439,0.003694280262895121,0.0005648117422909444
polarisation.py,MacBook-Pro,2020-05-01 02:56:18,exploratory,512,MID_FEKO_B2,0.2725128307302549,0.003571064149238539,True,600.0,B2,[1360000000.0],158,0.00020381553243939668,0.00019278930281948914,0.0033612157913200727,0.000526210484075928
polarisation.py,MacBook-Pro,2020-05-01 02:56:27,exploratory,512,MID_FEKO_B2,0.27251303568047713,0.007142173839485973,True,600.0,B2,[1360000000.0],159,0.0003002320480512235,0.0005226208005715781,0.0022205184307559174,0.00036753965873452256
polarisation.py,MacBook-Pro,2020-05-01 02:56:37,exploratory,512,MID_FEKO_B2,0.27251337729032077,0.010713374616978435,True,600.0,B2,[1360000000.0],160,0.0004070081975734374,0.0006155106433647547,0.0009921206054318062,0.00018269471208483826
polarisation.py,MacBook-Pro,2020-05-01 02:56:59,exploratory,512,MID_FEKO_B2,0.2725138555990041,0.014284712038408203,True,600.0,B2,[1360000000.0],161,0.0004426322660461062,0.0004042497079527944,0.00023030586849209957,5.488710391361946e-05
polarisation.py,MacBook-Pro,2020-05-01 02:57:09,exploratory,512,MID_FEKO_B2,0.2725144706614506,0.017856231676155937,True,600.0,B2,[1360000000.0],162,0.0003585915677936193,7.124267576098678e-05,-9.380633586141565e-06,8.381022310867863e-06
polarisation.py,MacBook-Pro,2020-05-01 02:57:19,exploratory,512,MID_FEKO_B2,0.272515222548306,0.021427979123527924,True,600.0,B2,[1360000000.0],163,0.00019966682678327616,-0.00013287369536452474,3.233222577128757e-05,-8.296460397364596e-06
polarisation.py,MacBook-Pro,2020-05-01 02:57:29,exploratory,512,MID_FEKO_B2,0.27251611134596104,0.025000000000000005,True,600.0,B2,[1360000000.0],164,6.428904105049586e-05,-0.00012837494760512062,7.163681082139047e-05,-1.3480894765325534e-05
polarisation.py,MacBook-Pro,2020-05-01 02:57:38,exploratory,512,MID_FEKO_B2,0.2760885652767333,-0.025000000000000005,True,600.0,B2,[1360000000.0],165,9.020702691996124e-05,-0.000249171701735521,0.00027307740350353515,-4.8088498461699106e-05
polarisation.py,MacBook-Pro,2020-05-01 02:57:47,exploratory,512,MID_FEKO_B2,0.27608738016026135,-0.021427979123527924,True,600.0,B2,[1360000000.0],166,0.00023384403255510968,-0.00028402236366484567,0.0003606076925896876,-6.403749664637588e-05
polarisation.py,MacBook-Pro,2020-05-01 02:57:56,exploratory,512,MID_FEKO_B2,0.27608637759968274,-0.017856231676155937,True,600.0,B2,[1360000000.0],167,0.00040268111082206024,-0.00015201183864090156,0.00022034312631269396,-4.113028489594253e-05
polarisation.py,MacBook-Pro,2020-05-01 02:58:05,exploratory,512,MID_FEKO_B2,0.2760855574798013,-0.014284712038408203,True,600.0,B2,[1360000000.0],168,0.000517615182651713,4.104015847035457e-05,-4.067312240617314e-05,-6.564114992585023e-06
polarisation.py,MacBook-Pro,2020-05-01 02:58:14,exploratory,512,MID_FEKO_B2,0.2760849197064156,-0.010713374616978435,True,600.0,B2,[1360000000.0],169,0.0005345846747358753,0.00011768704860405942,-8.006956731691662e-05,2.4573558225935007e-05
polarisation.py,MacBook-Pro,2020-05-01 02:58:24,exploratory,512,MID_FEKO_B2,0.27608446420628907,-0.007142173839485973,True,600.0,B2,[1360000000.0],170,0.00047865187242812065,-0.00015301295816215604,0.0003268375080375099,6.903590923415617e-05
polarisation.py,MacBook-Pro,2020-05-01 02:58:34,exploratory,512,MID_FEKO_B2,0.27608419092712655,-0.003571064149238539,True,600.0,B2,[1360000000.0],171,0.00041046335594551386,-0.00036038276959655675,0.0009910972920635043,0.00017301419462623457
polarisation.py,MacBook-Pro,2020-05-01 02:58:54,exploratory,512,MID_FEKO_B2,0.2760840998375576,0.0,True,600.0,B2,[1360000000.0],172,0.00037795449365947577,-0.000426978992732699,0.001432647656840096,0.00024936720102533376
polarisation.py,MacBook-Pro,2020-05-01 02:59:04,exploratory,512,MID_FEKO_B2,0.27608419092712655,0.003571064149238539,True,600.0,B2,[1360000000.0],173,0.0003941263290341211,-0.00027210995162376143,0.0013347236215449053,0.0002453556995235554
polarisation.py,MacBook-Pro,2020-05-01 02:59:16,exploratory,512,MID_FEKO_B2,0.27608446420628907,0.007142173839485973,True,600.0,B2,[1360000000.0],174,0.0004355167128219633,0.0001215753242022221,0.0008272377247849032,0.00017150772141445391
polarisation.py,MacBook-Pro,2020-05-01 02:59:26,exploratory,512,MID_FEKO_B2,0.2760849197064156,0.010713374616978435,True,600.0,B2,[1360000000.0],175,0.00045053358439590583,0.0001694128437395934,0.0003095304831585552,8.29542923559599e-05
polarisation.py,MacBook-Pro,2020-05-01 02:59:35,exploratory,512,MID_FEKO_B2,0.2760855574798013,0.014284712038408203,True,600.0,B2,[1360000000.0],176,0.0003907408752520571,0.00010368922744111342,5.705146650931374e-05,2.8098569350462495e-05
polarisation.py,MacBook-Pro,2020-05-01 02:59:44,exploratory,512,MID_FEKO_B2,0.27608637759968274,0.017856231676155937,True,600.0,B2,[1360000000.0],177,0.0002579403079724219,3.1090431087982635e-05,4.8875460375558614e-05,9.680616633035092e-06
polarisation.py,MacBook-Pro,2020-05-01 02:59:54,exploratory,512,MID_FEKO_B2,0.27608738016026135,0.021427979123527924,True,600.0,B2,[1360000000.0],178,0.00011352350634397986,-6.803785992398875e-05,9.50079573768305e-05,-1.6243107443348425e-05
polarisation.py,MacBook-Pro,2020-05-01 03:00:03,exploratory,512,MID_FEKO_B2,0.2760885652767333,0.025000000000000005,True,600.0,B2,[1360000000.0],179,2.4149948485808932e-05,-4.203172591961807e-05,8.868301349989263e-05,-1.4705208338220139e-05
polarisation.py,MacBook-Pro,2020-05-01 03:00:14,exploratory,512,MID_FEKO_B2,0.27966120159478525,-0.025000000000000005,True,600.0,B2,[1360000000.0],180,3.286839981580536e-05,-0.00012757051936482412,0.0001952524355619701,-3.0947163590473653e-05
polarisation.py,MacBook-Pro,2020-05-01 03:00:25,exploratory,512,MID_FEKO_B2,0.27965972011411316,-0.021427979123527924,True,600.0,B2,[1360000000.0],181,0.00011436544942366,-0.00019977954394915793,0.0003836906247295161,-6.258220063063323e-05
polarisation.py,MacBook-Pro,2020-05-01 03:00:51,exploratory,512,MID_FEKO_B2,0.27965846684142487,-0.017856231676155937,True,600.0,B2,[1360000000.0],182,0.0002439342994402497,-0.00017306204981906937,0.0004245256786512921,-7.23638935244423e-05
polarisation.py,MacBook-Pro,2020-05-01 03:01:01,exploratory,512,MID_FEKO_B2,0.2796574416327113,-0.014284712038408203,True,600.0,B2,[1360000000.0],183,0.00037661131863781335,-6.902111866968346e-05,0.00024936656853423466,-4.79491892847775e-05
polarisation.py,MacBook-Pro,2020-05-01 03:01:11,exploratory,512,MID_FEKO_B2,0.27965664437020954,-0.010713374616978435,True,600.0,B2,[1360000000.0],184,0.0004652078408969186,1.847663750813657e-05,7.201229719591368e-06,-1.1290961797111767e-05
polarisation.py,MacBook-Pro,2020-05-01 03:01:22,exploratory,512,MID_FEKO_B2,0.279656074962365,-0.007142173839485973,True,600.0,B2,[1360000000.0],185,0.0004956077505309578,-4.747173282121634e-05,-0.00010403530305495406,1.719117209638684e-05
polarisation.py,MacBook-Pro,2020-05-01 03:01:33,exploratory,512,MID_FEKO_B2,0.27965573334380256,-0.003571064149238539,True,600.0,B2,[1360000000.0],186,0.0004886637985977113,-0.00017862741726330355,-4.0904709778845534e-05,3.546956359221756e-05
polarisation.py,MacBook-Pro,2020-05-01 03:01:44,exploratory,512,MID_FEKO_B2,0.2796556194753054,0.0,True,600.0,B2,[1360000000.0],187,0.0004734184465353781,-0.0002689371813161587,0.00011971799880566366,5.684711042139641e-05
polarisation.py,MacBook-Pro,2020-05-01 03:01:54,exploratory,512,MID_FEKO_B2,0.27965573334380256,0.003571064149238539,True,600.0,B2,[1360000000.0],188,0.0004613250315216346,-0.00023709838811876197,0.0001535908438994762,6.5523328830539e-05
polarisation.py,MacBook-Pro,2020-05-01 03:02:04,exploratory,512,MID_FEKO_B2,0.279656074962365,0.007142173839485973,True,600.0,B2,[1360000000.0],189,0.00043780518862527386,-0.00011973688778397114,0.00010775592759796814,5.225949832067883e-05
polarisation.py,MacBook-Pro,2020-05-01 03:02:13,exploratory,512,MID_FEKO_B2,0.27965664437020954,0.010713374616978435,True,600.0,B2,[1360000000.0],190,0.0003760172262949395,9.756940440553516e-06,7.986133313629227e-05,3.344111053214225e-05
polarisation.py,MacBook-Pro,2020-05-01 03:02:23,exploratory,512,MID_FEKO_B2,0.2796574416327113,0.014284712038408203,True,600.0,B2,[1360000000.0],191,0.0002667042750834949,6.0751198774988665e-05,0.00011298226467515822,2.3191743885062485e-05
polarisation.py,MacBook-Pro,2020-05-01 03:02:33,exploratory,512,MID_FEKO_B2,0.27965846684142487,0.017856231676155937,True,600.0,B2,[1360000000.0],192,0.00013872995078278283,7.782885325753804e-05,0.0001511564542386125,-2.2540744457900363e-05
polarisation.py,MacBook-Pro,2020-05-01 03:03:29,exploratory,512,MID_FEKO_B2,0.27965972011411316,0.021427979123527924,True,600.0,B2,[1360000000.0],193,4.191503064744683e-05,6.285103958772166e-05,0.0001344065402825054,-2.1177442211699412e-05
polarisation.py,MacBook-Pro,2020-05-01 03:37:56,exploratory,512,MID_FEKO_B2,0.27966120159478525,0.025000000000000005,True,600.0,B2,[1360000000.0],194,2.7682335540802614e-06,3.888084215680135e-05,7.141283125867466e-05,-1.08235417655348e-05
polarisation.py,MacBook-Pro,2020-05-01 03:38:32,exploratory,512,MID_FEKO_B2,0.28323406593622497,-0.025000000000000005,True,600.0,B2,[1360000000.0],195,7.621706371120846e-06,-4.102805296974679e-05,8.103587338777509e-05,1.2071708250369036e-05
polarisation.py,MacBook-Pro,2020-05-01 04:11:56,exploratory,512,MID_FEKO_B2,0.28323228803460737,-0.021427979123527924,True,600.0,B2,[1360000000.0],196,3.4257215153981844e-05,-9.380017362296024e-05,0.000273729043451155,-4.128762873993751e-05
polarisation.py,MacBook-Pro,2020-05-01 04:12:38,exploratory,512,MID_FEKO_B2,0.28323078400181245,-0.017856231676155937,True,600.0,B2,[1360000000.0],197,0.00010157108102481576,-0.00011377490508841472,0.00045591357162688733,-7.1989583328173e-05
polarisation.py,MacBook-Pro,2020-05-01 04:13:20,exploratory,512,MID_FEKO_B2,0.2832295536650091,-0.014284712038408203,True,600.0,B2,[1360000000.0],198,0.00019702348585547098,-6.994389880091525e-05,0.0004906817470669582,-8.191572510613532e-05
polarisation.py,MacBook-Pro,2020-05-01 04:13:57,exploratory,512,MID_FEKO_B2,0.28322859688286534,-0.010713374616978435,True,600.0,B2,[1360000000.0],199,0.0002893721489401344,6.456052258652334e-05,0.0003619750228165048,-6.51492527870283e-05
polarisation.py,MacBook-Pro,2020-05-01 04:14:34,exploratory,512,MID_FEKO_B2,0.28322791354550275,-0.007142173839485973,True,600.0,B2,[1360000000.0],200,0.00035214961620191643,6.795184240746068e-05,0.00017869447414545531,-3.4885411165844125e-05
polarisation.py,MacBook-Pro,2020-05-01 04:15:10,exploratory,512,MID_FEKO_B2,0.28322750357446197,-0.003571064149238539,True,600.0,B2,[1360000000.0],201,0.00037824552468506756,2.226989432029477e-05,5.6907052075620606e-05,-9.069556784507152e-06
polarisation.py,MacBook-Pro,2020-05-01 04:15:46,exploratory,512,MID_FEKO_B2,0.28322736692267736,0.0,True,600.0,B2,[1360000000.0],202,0.00037470513962754073,-3.518753746780193e-05,3.2257072096846186e-05,1.2833183609995345e-05
polarisation.py,MacBook-Pro,2020-05-01 04:17:03,exploratory,512,MID_FEKO_B2,0.28322750357446197,0.003571064149238539,True,600.0,B2,[1360000000.0],203,0.00034781907970442966,-4.554447893399081e-05,7.429181520534702e-05,2.091569998654701e-05
polarisation.py,MacBook-Pro,2020-05-01 04:17:36,exploratory,512,MID_FEKO_B2,0.28322791354550275,0.007142173839485973,True,600.0,B2,[1360000000.0],204,0.0002957307412068879,-1.9950356389721825e-05,0.00014873418048243296,2.7773222937242526e-05
polarisation.py,MacBook-Pro,2020-05-01 04:18:16,exploratory,512,MID_FEKO_B2,0.28322859688286534,0.010713374616978435,True,600.0,B2,[1360000000.0],205,0.0002166321075623204,7.105697008366061e-05,0.00021807518835312902,-3.166525119336676e-05
polarisation.py,MacBook-Pro,2020-05-01 04:19:01,exploratory,512,MID_FEKO_B2,0.2832295536650091,0.014284712038408203,True,600.0,B2,[1360000000.0],206,0.00012348935523196107,0.00011086754493986264,0.00024020140939028523,-3.7784451160213615e-05
polarisation.py,MacBook-Pro,2020-05-01 04:19:59,exploratory,512,MID_FEKO_B2,0.28323078400181245,0.017856231676155937,True,600.0,B2,[1360000000.0],207,4.515984862620707e-05,0.00010573420014396304,0.0001933757914002858,-3.06347249411139e-05
polarisation.py,MacBook-Pro,2020-05-01 04:20:59,exploratory,512,MID_FEKO_B2,0.28323228803460737,0.021427979123527924,True,600.0,B2,[1360000000.0],208,5.4502347919896644e-06,6.820233816159666e-05,0.00010459400425162799,-1.598891269008265e-05
polarisation.py,MacBook-Pro,2020-05-01 04:21:44,exploratory,512,MID_FEKO_B2,0.28323406593622497,0.025000000000000005,True,600.0,B2,[1360000000.0],209,1.1503181979848355e-06,2.6095354708324436e-05,2.9482685569272074e-05,4.460482651783617e-06
polarisation.py,MacBook-Pro,2020-05-01 04:22:25,exploratory,512,MID_FEKO_B2,0.286807203963371,-0.025000000000000005,True,600.0,B2,[1360000000.0],210,7.871688598882983e-06,-1.0403254584592763e-05,2.0834954926948954e-06,1.3978551057210443e-06
polarisation.py,MacBook-Pro,2020-05-01 04:23:04,exploratory,512,MID_FEKO_B2,0.28680512957268955,-0.021427979123527924,True,600.0,B2,[1360000000.0],211,6.258834396219748e-06,-2.2712785247297845e-05,0.00010389494817379017,1.5954919259627566e-05
polarisation.py,MacBook-Pro,2020-05-01 04:24:58,exploratory,512,MID_FEKO_B2,0.28680337472217154,-0.017856231676155937,True,600.0,B2,[1360000000.0],212,2.3172304392264013e-05,-3.86409626549027e-05,0.00028479632316624786,-4.148491131727182e-05
polarisation.py,MacBook-Pro,2020-05-01 04:25:54,exploratory,512,MID_FEKO_B2,0.2868019392101528,-0.014284712038408203,True,600.0,B2,[1360000000.0],213,6.328304259309603e-05,4.382171582095199e-05,0.00044326301380068965,-6.749227538509066e-05
polarisation.py,MacBook-Pro,2020-05-01 04:26:34,exploratory,512,MID_FEKO_B2,0.2868008228717229,-0.010713374616978435,True,600.0,B2,[1360000000.0],214,0.00011513755588069811,8.736345106381616e-05,0.0004995513064979792,-7.870434618693843e-05
polarisation.py,MacBook-Pro,2020-05-01 04:27:15,exploratory,512,MID_FEKO_B2,0.286800025578673,-0.007142173839485973,True,600.0,B2,[1360000000.0],215,0.00015961507508938411,0.0001263715665794369,0.0004584892230686364,-7.384131092189655e-05
polarisation.py,MacBook-Pro,2020-05-01 04:27:53,exploratory,512,MID_FEKO_B2,0.28679954723945433,-0.003571064149238539,True,600.0,B2,[1360000000.0],216,0.00018299901246421324,0.00013422437342422831,0.00038428451127909126,-6.195202989308751e-05
polarisation.py,MacBook-Pro,2020-05-01 04:28:32,exploratory,512,MID_FEKO_B2,0.28679938779914943,0.0,True,600.0,B2,[1360000000.0],217,0.00018216439897390872,0.00011518882414635467,0.00033587455013891294,-5.3801327786885595e-05
polarisation.py,MacBook-Pro,2020-05-01 04:29:10,exploratory,512,MID_FEKO_B2,0.28679954723945433,0.003571064149238539,True,600.0,B2,[1360000000.0],218,0.00016005181203572542,0.00010044050241947735,0.0003274731257097365,-5.335788956012164e-05
polarisation.py,MacBook-Pro,2020-05-01 04:29:49,exploratory,512,MID_FEKO_B2,0.286800025578673,0.007142173839485973,True,600.0,B2,[1360000000.0],219,0.0001211144511018873,0.00010611874271711172,0.0003317886206466655,-5.585795834705511e-05
polarisation.py,MacBook-Pro,2020-05-01 04:30:28,exploratory,512,MID_FEKO_B2,0.2868008228717229,0.010713374616978435,True,600.0,B2,[1360000000.0],220,7.298333134158044e-05,0.00011890066981711931,0.00030620362828565783,-5.2473840082685156e-05
polarisation.py,MacBook-Pro,2020-05-01 04:31:11,exploratory,512,MID_FEKO_B2,0.2868019392101528,0.014284712038408203,True,600.0,B2,[1360000000.0],221,2.9350829383578856e-05,0.00011342775111378985,0.0002290221129691836,-3.887784533985982e-05
polarisation.py,MacBook-Pro,2020-05-01 04:32:58,exploratory,512,MID_FEKO_B2,0.28680337472217154,0.017856231676155937,True,600.0,B2,[1360000000.0],222,4.50818920191319e-06,7.985727793788234e-05,0.0001224168420060135,-1.9956311572092267e-05
polarisation.py,MacBook-Pro,2020-05-01 04:33:33,exploratory,512,MID_FEKO_B2,0.28680512957268955,0.021427979123527924,True,600.0,B2,[1360000000.0],223,1.1091548415103525e-06,3.317945808938306e-05,3.651411240366723e-05,-5.435620372348034e-06
polarisation.py,MacBook-Pro,2020-05-01 04:34:11,exploratory,512,MID_FEKO_B2,0.286807203963371,0.025000000000000005,True,600.0,B2,[1360000000.0],224,6.7650380629056085e-06,-3.4201457789470734e-06,3.518810581469922e-06,5.925751014542367e-07
