nb_name,hostname,epoch,basename,npixel,pbtype,ra,dec,use_natural,integration_time,band,frequency,iscenario,onsource_I,onsource_Q,onsource_U,onsource_V
polarisation.py,MacBook-Pro,2020-05-01 09:55:59,exploratory,512,MID_FEKO_Ku,0.25921292225180265,0.2592985510137598,True,600.0,Ku,[12179000000.0],0,-6.572044179240912e-06,-6.922907632512188e-05,-3.003990654369402e-05,8.189192060301488e-06
polarisation.py,MacBook-Pro,2020-05-01 09:56:08,exploratory,512,MID_FEKO_Ku,0.25921267702226014,0.25965569438446084,True,600.0,Ku,[12179000000.0],1,-3.595081485288463e-05,-3.588021614766333e-05,-1.0163693667135072e-05,4.1337367873331775e-06
polarisation.py,MacBook-Pro,2020-05-01 09:56:16,exploratory,512,MID_FEKO_Ku,0.2592124314163978,0.26001283748160897,True,600.0,Ku,[12179000000.0],2,-5.565181006020976e-05,-8.265397376166311e-06,4.779239815676169e-05,7.99830625089503e-06
polarisation.py,MacBook-Pro,2020-05-01 09:56:25,exploratory,512,MID_FEKO_Ku,0.2592121854340153,0.26036998035075853,True,600.0,Ku,[12179000000.0],3,-5.6960225847243776e-05,-2.0920698510923784e-05,0.00010391108436755042,1.6456426487235162e-05
polarisation.py,MacBook-Pro,2020-05-01 09:56:34,exploratory,512,MID_FEKO_Ku,0.2592119390749116,0.2607271230374638,True,600.0,Ku,[12179000000.0],4,-4.365034079883987e-05,-5.90116166287597e-05,0.00013284665424652932,2.180740467882725e-05
polarisation.py,MacBook-Pro,2020-05-01 09:56:42,exploratory,512,MID_FEKO_Ku,0.2592116923388852,0.2610842655872787,True,600.0,Ku,[12179000000.0],5,-2.689928446788643e-05,-9.836288064824286e-05,0.0001325443914285827,2.2799564540806304e-05
polarisation.py,MacBook-Pro,2020-05-01 09:56:51,exploratory,512,MID_FEKO_Ku,0.25921144522573425,0.2614414080457572,True,600.0,Ku,[12179000000.0],6,-1.5286729663146312e-05,-0.00012164005855803659,0.000117163247353208,2.097194456399197e-05
polarisation.py,MacBook-Pro,2020-05-01 09:56:58,exploratory,512,MID_FEKO_Ku,0.25921119773525636,0.2617985504584531,True,600.0,Ku,[12179000000.0],7,-1.0718615039584508e-05,-0.00013090362658017552,9.751617152589099e-05,1.797025924160411e-05
polarisation.py,MacBook-Pro,2020-05-01 09:57:07,exploratory,512,MID_FEKO_Ku,0.2592109498672485,0.26215569287092005,True,600.0,Ku,[12179000000.0],8,-1.240391034651088e-05,-0.00012827749240327862,7.569642253475666e-05,1.4320653887451147e-05
polarisation.py,MacBook-Pro,2020-05-01 09:57:15,exploratory,512,MID_FEKO_Ku,0.25921070162150744,0.2625128353287118,True,600.0,Ku,[12179000000.0],9,-2.0920122740768297e-05,-0.00010488759936128437,5.48677519085428e-05,1.0518928959834519e-05
polarisation.py,MacBook-Pro,2020-05-01 09:57:23,exploratory,512,MID_FEKO_Ku,0.2592104529978291,0.262869977877382,True,600.0,Ku,[12179000000.0],10,-3.581261789691513e-05,-5.681344103995479e-05,4.448255402281465e-05,7.994799400987524e-06
polarisation.py,MacBook-Pro,2020-05-01 09:57:32,exploratory,512,MID_FEKO_Ku,0.2592102039960092,0.26322712056248454,True,600.0,Ku,[12179000000.0],11,-5.059768448485001e-05,9.949827075160237e-06,5.042080773052459e-05,8.042708173326633e-06
polarisation.py,MacBook-Pro,2020-05-01 09:57:40,exploratory,512,MID_FEKO_Ku,0.2592099546158428,0.26358426342957364,True,600.0,Ku,[12179000000.0],12,-5.4096581004058285e-05,3.3029056866706255e-05,6.350002851161837e-05,1.0655430957491685e-05
polarisation.py,MacBook-Pro,2020-05-01 09:57:48,exploratory,512,MID_FEKO_Ku,0.2592097048571245,0.2639414065242033,True,600.0,Ku,[12179000000.0],13,-3.948981417055171e-05,2.43387092690323e-05,6.433979480261494e-05,1.23617773594983e-05
polarisation.py,MacBook-Pro,2020-05-01 09:57:56,exploratory,512,MID_FEKO_Ku,0.25920945471964857,0.2642985498919281,True,600.0,Ku,[12179000000.0],14,-1.1865898714116455e-05,-2.422618329586618e-05,4.168837850310835e-05,1.0972867846644131e-05
polarisation.py,MacBook-Pro,2020-05-01 09:58:05,exploratory,512,MID_FEKO_Ku,0.25958241785523267,0.2592987730182836,True,600.0,Ku,[12179000000.0],15,-3.964076133957075e-05,-5.3742451268060546e-05,1.4679832934377276e-05,4.81694319978029e-06
polarisation.py,MacBook-Pro,2020-05-01 09:58:14,exploratory,512,MID_FEKO_Ku,0.25958220765845563,0.2596559164098494,True,600.0,Ku,[12179000000.0],16,-6.403035425693198e-05,-1.367886771634607e-05,7.323556452045172e-05,1.1773475450593123e-05
polarisation.py,MacBook-Pro,2020-05-01 09:58:22,exploratory,512,MID_FEKO_Ku,0.259581997139119,0.2600130595279228,True,600.0,Ku,[12179000000.0],17,-5.874567239194405e-05,-1.7275341569528473e-05,0.00013526776151489596,2.1809417501446176e-05
polarisation.py,MacBook-Pro,2020-05-01 09:58:31,exploratory,512,MID_FEKO_Ku,0.2595817862970508,0.26037020241805825,True,600.0,Ku,[12179000000.0],18,-2.9827123283977635e-05,-4.200667587454765e-05,0.00015169722665350316,2.6700763924874952e-05
polarisation.py,MacBook-Pro,2020-05-01 09:58:39,exploratory,512,MID_FEKO_Ku,0.2595815751320789,0.2607273451258101,True,600.0,Ku,[12179000000.0],19,-3.688397254695258e-06,-4.952143891169316e-05,0.00012475760997338923,2.5003087094611373e-05
polarisation.py,MacBook-Pro,2020-05-01 09:58:47,exploratory,512,MID_FEKO_Ku,0.25958136364403067,0.26108448769673215,True,600.0,Ku,[12179000000.0],20,-2.810758861857466e-06,-1.4942373577600482e-05,9.570324084660982e-05,2.1625381889551954e-05
polarisation.py,MacBook-Pro,2020-05-01 09:58:55,exploratory,512,MID_FEKO_Ku,0.2595811518327329,0.2614416301763786,True,600.0,Ku,[12179000000.0],21,-1.9109798226691616e-05,4.5682113584063515e-05,9.707656504862579e-05,2.155034597180348e-05
polarisation.py,MacBook-Pro,2020-05-01 09:59:04,exploratory,512,MID_FEKO_Ku,0.2595809396980122,0.26179877261030315,True,600.0,Ku,[12179000000.0],22,-3.1723309665461e-05,7.311339479610006e-05,0.00011773414337339751,2.3435710035634738e-05
polarisation.py,MacBook-Pro,2020-05-01 09:59:13,exploratory,512,MID_FEKO_Ku,0.2595807272396946,0.26215591504405944,True,600.0,Ku,[12179000000.0],23,-2.367247390236448e-05,3.630454787473193e-05,0.00012020872910145635,2.2047452757527224e-05
polarisation.py,MacBook-Pro,2020-05-01 09:59:21,exploratory,512,MID_FEKO_Ku,0.25958051445760577,0.26251305752320125,True,600.0,Ku,[12179000000.0],24,-5.377582206924155e-06,-2.953194514360729e-05,8.790204117268166e-05,1.6562074147236262e-05
polarisation.py,MacBook-Pro,2020-05-01 09:59:29,exploratory,512,MID_FEKO_Ku,0.2595803013515709,0.2628702000932824,True,600.0,Ku,[12179000000.0],25,-1.702687411683162e-06,-6.096731618406999e-05,4.559269484271848e-05,9.47028357362501e-06
polarisation.py,MacBook-Pro,2020-05-01 09:59:37,exploratory,512,MID_FEKO_Ku,0.2595800879214148,0.2632273427998567,True,600.0,Ku,[12179000000.0],26,-2.3082337416768158e-05,-4.335725383207568e-05,3.08689988229844e-05,6.144436148055657e-06
polarisation.py,MacBook-Pro,2020-05-01 09:59:45,exploratory,512,MID_FEKO_Ku,0.25957987416696193,0.26358448568847836,True,600.0,Ku,[12179000000.0],27,-5.348707511127166e-05,2.2273782625703673e-05,5.087100025871588e-05,7.5205454514686185e-06
polarisation.py,MacBook-Pro,2020-05-01 09:59:54,exploratory,512,MID_FEKO_Ku,0.2595796600880361,0.2639416288047015,True,600.0,Ku,[12179000000.0],28,-6.524909502410071e-05,2.6736277720090637e-05,7.714765917149045e-05,1.1989021673090461e-05
polarisation.py,MacBook-Pro,2020-05-01 10:00:02,exploratory,512,MID_FEKO_Ku,0.259579445684461,0.2642987721940806,True,600.0,Ku,[12179000000.0],29,-4.6423714235255e-05,-1.4734995601769526e-05,7.586997597784798e-05,1.3469856438685071e-05
polarisation.py,MacBook-Pro,2020-05-01 10:00:11,exploratory,512,MID_FEKO_Ku,0.2599519132162448,0.2592989608681317,True,600.0,Ku,[12179000000.0],30,-6.844647655907856e-05,-1.8886925810582276e-05,7.503800635277289e-05,1.2015908386497007e-05
polarisation.py,MacBook-Pro,2020-05-01 10:00:19,exploratory,512,MID_FEKO_Ku,0.25995173805224536,0.2596561042773523,True,600.0,Ku,[12179000000.0],31,-6.704705642003128e-05,3.098029624187547e-05,0.00013960322174298175,2.2295240219840038e-05
polarisation.py,MacBook-Pro,2020-05-01 10:00:28,exploratory,512,MID_FEKO_Ku,0.2599515626194464,0.2600132474131317,True,600.0,Ku,[12179000000.0],32,-2.7087795595428964e-05,3.608018669015407e-05,0.00014345743415683732,2.6337433648805184e-05
polarisation.py,MacBook-Pro,2020-05-01 10:00:36,exploratory,512,MID_FEKO_Ku,0.2599513869177046,0.2603703903210245,True,600.0,Ku,[12179000000.0],33,3.551536908468847e-06,1.783437305379886e-05,8.097315894830958e-05,2.1644728718241347e-05
polarisation.py,MacBook-Pro,2020-05-01 10:00:44,exploratory,512,MID_FEKO_Ku,0.2599512109468765,0.2607275330465849,True,600.0,Ku,[12179000000.0],34,-3.943391948133501e-05,0.00010030456775622602,3.609167719010005e-05,1.923318642297265e-05
polarisation.py,MacBook-Pro,2020-05-01 10:00:53,exploratory,512,MID_FEKO_Ku,0.2599510347068182,0.26108467563536697,True,600.0,Ku,[12179000000.0],35,-0.00017056967522545945,0.000310137080368435,9.329429976075287e-05,2.9752044032005028e-05
polarisation.py,MacBook-Pro,2020-05-01 10:01:01,exploratory,512,MID_FEKO_Ku,0.2599508581973854,0.2614418181329247,True,600.0,Ku,[12179000000.0],36,-0.00032594492196074386,0.0005498999449705113,0.0002502940659828684,5.173317580228368e-05
polarisation.py,MacBook-Pro,2020-05-01 10:01:11,exploratory,512,MID_FEKO_Ku,0.2599506814184336,0.26179896058481195,True,600.0,Ku,[12179000000.0],37,-0.00040422193987730334,0.0006560731578829772,0.00042539170278493393,7.148166638442736e-05
polarisation.py,MacBook-Pro,2020-05-01 10:01:19,exploratory,512,MID_FEKO_Ku,0.2599505043698178,0.26215610303658227,True,600.0,Ku,[12179000000.0],38,-0.0003504400291497147,0.0005484067263561188,0.0004861891173240672,7.707001153646093e-05
polarisation.py,MacBook-Pro,2020-05-01 10:01:27,exploratory,512,MID_FEKO_Ku,0.25995032705139276,0.26251324553378963,True,600.0,Ku,[12179000000.0],39,-0.0002035225798944196,0.00030468719486136645,0.00038640267350032863,5.943904597619044e-05
polarisation.py,MacBook-Pro,2020-05-01 10:01:36,exploratory,512,MID_FEKO_Ku,0.25995014946301287,0.26287038812198765,True,600.0,Ku,[12179000000.0],40,-6.206951550917662e-05,9.228262704546265e-05,0.00020503324580860402,3.2006095176620415e-05
polarisation.py,MacBook-Pro,2020-05-01 10:01:44,exploratory,512,MID_FEKO_Ku,0.25994997160453204,0.26322753084673045,True,600.0,Ku,[12179000000.0],41,-2.641860129500432e-06,9.384199246085094e-06,6.544426689443261e-05,1.134776637180048e-05
polarisation.py,MacBook-Pro,2020-05-01 10:01:52,exploratory,512,MID_FEKO_Ku,0.25994979347580394,0.2635846737535719,True,600.0,Ku,[12179000000.0],42,-2.187293100319442e-05,3.629577840254751e-05,2.9176289778926935e-05,4.797903627226913e-06
polarisation.py,MacBook-Pro,2020-05-01 10:02:01,exploratory,512,MID_FEKO_Ku,0.25994961507668196,0.26394181688806645,True,600.0,Ku,[12179000000.0],43,-6.37753209492254e-05,4.8688845650379385e-05,6.240675577247882e-05,8.77415674161672e-06
polarisation.py,MacBook-Pro,2020-05-01 10:02:09,exploratory,512,MID_FEKO_Ku,0.2599494364070189,0.2642989602957685,True,600.0,Ku,[12179000000.0],44,-7.299902875175962e-05,2.2513088246619386e-05,9.14857479566282e-05,1.3910330088091684e-05
polarisation.py,MacBook-Pro,2020-05-01 10:02:18,exploratory,512,MID_FEKO_Ku,0.2603214083752424,0.2592991145633709,True,600.0,Ku,[12179000000.0],45,-8.060502123181408e-05,3.450781228264428e-05,0.00012783649680055898,1.967892359167944e-05
polarisation.py,MacBook-Pro,2020-05-01 10:02:26,exploratory,512,MID_FEKO_Ku,0.2603212682440308,0.2596562579870363,True,600.0,Ku,[12179000000.0],46,-4.239342724757305e-05,6.829076940255069e-05,0.00013894291499242877,2.4369524440052393e-05
polarisation.py,MacBook-Pro,2020-05-01 10:02:34,exploratory,512,MID_FEKO_Ku,0.2603211278977795,0.2600134011373025,True,600.0,Ku,[12179000000.0],47,5.953695917561198e-06,3.1580551966556126e-05,6.0037534992096855e-05,1.880853190781655e-05
polarisation.py,MacBook-Pro,2020-05-01 10:02:42,exploratory,512,MID_FEKO_Ku,0.2603209873363741,0.260370544059724,True,600.0,Ku,[12179000000.0],48,-5.8872773130090026e-05,6.368336628611229e-05,-2.0354668546662287e-05,1.886688421250065e-05
polarisation.py,MacBook-Pro,2020-05-01 10:02:50,exploratory,512,MID_FEKO_Ku,0.26032084655969967,0.26072768679985514,True,600.0,Ku,[12179000000.0],49,-0.00034515129126740785,0.0002733618817957313,8.734806139047257e-05,2.863896375155433e-05
polarisation.py,MacBook-Pro,2020-05-01 10:02:59,exploratory,512,MID_FEKO_Ku,0.26032070556764114,0.26108482940324984,True,600.0,Ku,[12179000000.0],50,-0.0008249841632158006,0.0006761416141123893,0.0004731694952074566,7.757424623326881e-05
polarisation.py,MacBook-Pro,2020-05-01 10:03:08,exploratory,512,MID_FEKO_Ku,0.26032056436008316,0.2614419719154623,True,600.0,Ku,[12179000000.0],51,-0.0013017178039045115,0.0011338064920060678,0.0010525582191125767,0.00015551461030652953
polarisation.py,MacBook-Pro,2020-05-01 10:03:16,exploratory,512,MID_FEKO_Ku,0.26032042293691005,0.2617991143820463,True,600.0,Ku,[12179000000.0],52,-0.0015230237497437689,0.001333678639814847,0.0015296434420765802,0.00021955332570710445
polarisation.py,MacBook-Pro,2020-05-01 10:03:24,exploratory,512,MID_FEKO_Ku,0.2603202812980058,0.2621562568485554,True,600.0,Ku,[12179000000.0],53,-0.001361961699080868,0.0011373734142605444,0.0016296025548345025,0.0002313685896672309
polarisation.py,MacBook-Pro,2020-05-01 10:03:32,exploratory,512,MID_FEKO_Ku,0.2603201394432542,0.26251339936054363,True,600.0,Ku,[12179000000.0],54,-0.0009132527606051288,0.0006796276560591211,0.0013042010445680453,0.00018404785922373983
polarisation.py,MacBook-Pro,2020-05-01 10:03:40,exploratory,512,MID_FEKO_Ku,0.26031999737253875,0.26287054196356463,True,600.0,Ku,[12179000000.0],55,-0.0004201208272473169,0.0002786523519909562,0.0007611362688442258,0.00010822639664198438
polarisation.py,MacBook-Pro,2020-05-01 10:03:49,exploratory,512,MID_FEKO_Ku,0.2603198550857427,0.2632276847031724,True,600.0,Ku,[12179000000.0],56,-9.71026926680311e-05,6.667081211164651e-05,0.0002921383070065727,4.319514885564549e-05
polarisation.py,MacBook-Pro,2020-05-01 10:03:57,exploratory,512,MID_FEKO_Ku,0.2603197125827489,0.2635848276249211,True,600.0,Ku,[12179000000.0],57,-1.690496656549408e-06,2.87993249058969e-05,6.270148139348075e-05,9.607844647179515e-06
polarisation.py,MacBook-Pro,2020-05-01 10:04:05,exploratory,512,MID_FEKO_Ku,0.26031956986344,0.26394197077436493,True,600.0,Ku,[12179000000.0],58,-3.642844024027083e-05,8.082965087277389e-05,4.029266277917277e-05,5.389405739297621e-06
polarisation.py,MacBook-Pro,2020-05-01 10:04:13,exploratory,512,MID_FEKO_Ku,0.2603194269276984,0.2642991141970584,True,600.0,Ku,[12179000000.0],59,-7.973028914503742e-05,6.511686234962443e-05,8.726386333028817e-05,1.2494891080701123e-05
polarisation.py,MacBook-Pro,2020-05-01 10:04:22,exploratory,512,MID_FEKO_Ku,0.2606909033726288,0.2592992341040559,True,600.0,Ku,[12179000000.0],60,-7.451509727290758e-05,8.651783277853157e-05,0.00014000449103441836,2.207345703154015e-05
polarisation.py,MacBook-Pro,2020-05-01 10:04:30,exploratory,512,MID_FEKO_Ku,0.26069079827421293,0.25965637753895615,True,600.0,Ku,[12179000000.0],61,-8.38410697754561e-06,7.094268630740635e-05,8.086173569468305e-05,1.8991813524476915e-05
polarisation.py,MacBook-Pro,2020-05-01 10:04:39,exploratory,512,MID_FEKO_Ku,0.26069069301451747,0.2600135207004898,True,600.0,Ku,[12179000000.0],62,-1.3536851378939808e-05,-5.4237036464025175e-05,-1.8459591847704784e-05,1.7111432903712307e-05
polarisation.py,MacBook-Pro,2020-05-01 10:04:48,exploratory,512,MID_FEKO_Ku,0.2606905875934564,0.2603706636342114,True,600.0,Ku,[12179000000.0],63,-0.00031504596376680276,-0.000152880124053941,7.942121563948807e-05,2.582222736565374e-05
polarisation.py,MacBook-Pro,2020-05-01 10:04:55,exploratory,512,MID_FEKO_Ku,0.26069048201094364,0.2607278063856753,True,600.0,Ku,[12179000000.0],64,-0.0010623855045867646,0.0002769733754586768,0.0006244104510490395,9.535908717150003e-05
polarisation.py,MacBook-Pro,2020-05-01 10:05:03,exploratory,512,MID_FEKO_Ku,0.26069037626689284,0.2610849490004354,True,600.0,Ku,[12179000000.0],65,-0.002138207381391399,0.0007618286875603911,0.0016860092957432047,0.00023312489708675915
polarisation.py,MacBook-Pro,2020-05-01 10:05:12,exploratory,512,MID_FEKO_Ku,0.2606902703612175,0.261442091524046,True,600.0,Ku,[12179000000.0],66,-0.0031367362566397388,0.0013602895180567082,0.002928238031745587,0.00040043376325844143
polarisation.py,MacBook-Pro,2020-05-01 10:05:20,exploratory,512,MID_FEKO_Ku,0.2606901642938308,0.26179923400206073,True,600.0,Ku,[12179000000.0],67,-0.0035823818478513164,0.0016198842199440073,0.003782165813127928,0.0005167644902374181
polarisation.py,MacBook-Pro,2020-05-01 10:05:29,exploratory,512,MID_FEKO_Ku,0.26069005806464585,0.2621563764800334,True,600.0,Ku,[12179000000.0],68,-0.0032455567939074356,0.0013351935055480619,0.003809931638874655,0.0005204823552017379
polarisation.py,MacBook-Pro,2020-05-01 10:05:38,exploratory,512,MID_FEKO_Ku,0.2606899516735754,0.2625135190035178,True,600.0,Ku,[12179000000.0],69,-0.002303956950603271,0.0007353142273263559,0.0030138517979272526,0.00041439809315433284
polarisation.py,MacBook-Pro,2020-05-01 10:05:46,exploratory,512,MID_FEKO_Ku,0.26068984512053217,0.26287066161806777,True,600.0,Ku,[12179000000.0],70,-0.0012152144668428305,0.00027604281764355713,0.0018237538155786268,0.00025459438984419194
polarisation.py,MacBook-Pro,2020-05-01 10:05:55,exploratory,512,MID_FEKO_Ku,0.2606897384054284,0.2632278043692373,True,600.0,Ku,[12179000000.0],71,-0.00040879186763142855,-0.0001956661240775513,0.0007817322497384802,0.00011160647302895241
polarisation.py,MacBook-Pro,2020-05-01 10:06:03,exploratory,512,MID_FEKO_Ku,0.2606896315281765,0.2635849473025804,True,600.0,Ku,[12179000000.0],72,-4.506205861990554e-05,-7.462729041960869e-05,0.00019742086065234384,2.90831510133363e-05
polarisation.py,MacBook-Pro,2020-05-01 10:06:12,exploratory,512,MID_FEKO_Ku,0.26068952448868826,0.2639420904636516,True,600.0,Ku,[12179000000.0],73,-5.463672649210169e-06,7.986280855126788e-05,3.712189066554655e-05,4.891254817331232e-06
polarisation.py,MacBook-Pro,2020-05-01 10:06:20,exploratory,512,MID_FEKO_Ku,0.2606894172868755,0.26429923389800514,True,600.0,Ku,[12179000000.0],74,-6.739515350073628e-05,0.00011332122465068253,7.347429993009523e-05,1.050680558040099e-05
polarisation.py,MacBook-Pro,2020-05-01 10:06:29,exploratory,512,MID_FEKO_Ku,0.26106039824880684,0.2592993194902291,True,600.0,Ku,[12179000000.0],75,-5.9281148875733685e-05,0.00012169717964853632,0.00011821704022566129,2.0491271414264836e-05
polarisation.py,MacBook-Pro,2020-05-01 10:06:37,exploratory,512,MID_FEKO_Ku,0.2610603281831929,0.25965646293315414,True,600.0,Ku,[12179000000.0],76,1.3379508230674073e-05,2.608776090554018e-05,2.2018770500347476e-05,1.2946226485372231e-05
polarisation.py,MacBook-Pro,2020-05-01 10:06:45,exploratory,512,MID_FEKO_Ku,0.2610602580100593,0.26001360610273605,True,600.0,Ku,[12179000000.0],77,-0.00010522984203344329,-0.00023181583491969375,4.625953362684641e-05,2.3116676181238426e-05
polarisation.py,MacBook-Pro,2020-05-01 10:06:53,exploratory,512,MID_FEKO_Ku,0.2610601877293485,0.26037074904452917,True,600.0,Ku,[12179000000.0],78,-0.0007493712436531305,-0.0004261168150192038,0.0005074988681853719,8.485365855947203e-05
polarisation.py,MacBook-Pro,2020-05-01 10:07:01,exploratory,512,MID_FEKO_Ku,0.2610601173410034,0.26072789180408784,True,600.0,Ku,[12179000000.0],79,-0.0020980059227481925,-0.00033837014644294246,0.001777079025163748,0.00025427814447859823
polarisation.py,MacBook-Pro,2020-05-01 10:07:10,exploratory,512,MID_FEKO_Ku,0.26106004684496625,0.26108503442696623,True,600.0,Ku,[12179000000.0],80,-0.003914102923781425,0.000459237514590678,0.003731506073136667,0.0005138340821621507
polarisation.py,MacBook-Pro,2020-05-01 10:07:18,exploratory,512,MID_FEKO_Ku,0.2610599762411794,0.2614421769587183,True,600.0,Ku,[12179000000.0],81,-0.0055434115912844145,0.0010176299828629305,0.005732480561090422,0.0007810746851305099
polarisation.py,MacBook-Pro,2020-05-01 10:07:26,exploratory,512,MID_FEKO_Ku,0.261059905529585,0.2617993194448979,True,600.0,Ku,[12179000000.0],82,-0.006254463536513241,0.0012660348212097455,0.006904097034860013,0.0009399621233308903
polarisation.py,MacBook-Pro,2020-05-01 10:07:34,exploratory,512,MID_FEKO_Ku,0.26105983471012517,0.2621564619310588,True,600.0,Ku,[12179000000.0],83,-0.005702829111612919,0.0009039280941633942,0.006682413404177267,0.00091330378925216
polarisation.py,MacBook-Pro,2020-05-01 10:07:43,exploratory,512,MID_FEKO_Ku,0.26105976378274165,0.2625136044627548,True,600.0,Ku,[12179000000.0],84,-0.004162218746507341,0.00037137368427678257,0.005194863084298933,0.0007151212568367327
polarisation.py,MacBook-Pro,2020-05-01 10:07:51,exploratory,512,MID_FEKO_Ku,0.2610596927473763,0.2628707470855397,True,600.0,Ku,[12179000000.0],85,-0.0023368212474061535,-0.0005184172822992337,0.0031619463649932905,0.0004401340610066127
polarisation.py,MacBook-Pro,2020-05-01 10:07:59,exploratory,512,MID_FEKO_Ku,0.26105962160397067,0.2632278898449676,True,600.0,Ku,[12179000000.0],86,-0.0009086849940363565,-0.0005788399455399552,0.0014100233245818218,0.00019983354872734954
polarisation.py,MacBook-Pro,2020-05-01 10:08:07,exploratory,512,MID_FEKO_Ku,0.2610595503524662,0.2635850327865925,True,600.0,Ku,[12179000000.0],87,-0.0001717007511472202,-0.00030792992048503837,0.0003916474934472979,5.737814675025345e-05
polarisation.py,MacBook-Pro,2020-05-01 10:08:15,exploratory,512,MID_FEKO_Ku,0.26105947899280424,0.26394217595596875,True,600.0,Ku,[12179000000.0],88,7.5336564010356526e-06,1.6213882338761254e-05,5.349332930243964e-05,8.001717924867675e-06
polarisation.py,MacBook-Pro,2020-05-01 10:08:23,exploratory,512,MID_FEKO_Ku,0.26105940752492596,0.2642993193986509,True,600.0,Ku,[12179000000.0],89,-4.7350012140204056e-05,0.000144097159501475,6.051991924845313e-05,9.356843100688139e-06
polarisation.py,MacBook-Pro,2020-05-01 10:08:30,exploratory,512,MID_FEKO_Ku,0.26142989304417946,0.2592993707219209,True,600.0,Ku,[12179000000.0],90,-4.680671869924257e-05,0.00013665839529752085,8.671571982523533e-05,1.6931877346664595e-05
polarisation.py,MacBook-Pro,2020-05-01 10:08:38,exploratory,512,MID_FEKO_Ku,0.26142985801137153,0.2596565141696609,True,600.0,Ku,[12179000000.0],91,1.848985873248868e-05,-3.870806635961974e-05,5.0375547655604546e-06,1.2223518852207939e-05
polarisation.py,MacBook-Pro,2020-05-01 10:08:46,exploratory,512,MID_FEKO_Ku,0.26142982292480366,0.26001365734407167,True,600.0,Ku,[12179000000.0],92,-0.00021995398322237827,-0.00043053798600196035,0.000207477663667543,4.479727608107278e-05
polarisation.py,MacBook-Pro,2020-05-01 10:08:54,exploratory,512,MID_FEKO_Ku,0.2614297877844473,0.2603708002907077,True,600.0,Ku,[12179000000.0],93,-0.001185368523823782,-0.0007622021367050092,0.0011754826303938001,0.00017877403803624547
polarisation.py,MacBook-Pro,2020-05-01 10:09:02,exploratory,512,MID_FEKO_Ku,0.26142975259027373,0.2607279430551233,True,600.0,Ku,[12179000000.0],94,-0.0030746734907448267,-0.0007049843041615126,0.0032034562650540676,0.00045323103591935274
polarisation.py,MacBook-Pro,2020-05-01 10:09:10,exploratory,512,MID_FEKO_Ku,0.2614297173422542,0.2610850856828726,True,600.0,Ku,[12179000000.0],95,-0.005542156857430971,-0.0002775039392940567,0.005984481114200097,0.000826949425067708
polarisation.py,MacBook-Pro,2020-05-01 10:09:18,exploratory,512,MID_FEKO_Ku,0.26142968204035977,0.2614422282195096,True,600.0,Ku,[12179000000.0],96,-0.0077190302752509895,0.0003758111606033101,0.008577861569650607,-0.0011757091132933576
polarisation.py,MacBook-Pro,2020-05-01 10:09:26,exploratory,512,MID_FEKO_Ku,0.2614296466845616,0.26179937071058806,True,600.0,Ku,[12179000000.0],97,-0.008656823675039092,0.0005398432328941657,0.009867131911748109,0.0013501917061052731
polarisation.py,MacBook-Pro,2020-05-01 10:09:34,exploratory,512,MID_FEKO_Ku,0.2614296112748307,0.2621565132016619,True,600.0,Ku,[12179000000.0],98,-0.00791549136730955,0.000195420973717553,0.009249931314176651,0.0012683732568668196
polarisation.py,MacBook-Pro,2020-05-01 10:09:42,exploratory,512,MID_FEKO_Ku,0.261429575811138,0.26251365573828483,True,600.0,Ku,[12179000000.0],99,-0.005851576774396682,-0.0006707674832416768,0.007033725403194035,0.000969453379621784
polarisation.py,MacBook-Pro,2020-05-01 10:09:51,exploratory,512,MID_FEKO_Ku,0.26142954029345433,0.26287079836601074,True,600.0,Ku,[12179000000.0],100,-0.0033793250040320077,-0.0011500980433619564,0.004222729565289672,0.0005874276177870333
polarisation.py,MacBook-Pro,2020-05-01 10:09:59,exploratory,512,MID_FEKO_Ku,0.2614295047217506,0.2632279411303936,True,600.0,Ku,[12179000000.0],101,-0.0013971158766289116,-0.0010977129883953675,0.0018731929906341857,0.00026520106783194645
polarisation.py,MacBook-Pro,2020-05-01 10:10:07,exploratory,512,MID_FEKO_Ku,0.2614294690959974,0.2635850840769876,True,600.0,Ku,[12179000000.0],102,-0.00031641433997178363,-0.0006056814565210759,0.0005203386361643015,7.681289947759832e-05
polarisation.py,MacBook-Pro,2020-05-01 10:10:15,exploratory,512,MID_FEKO_Ku,0.2614294334161655,0.26394222725134703,True,600.0,Ku,[12179000000.0],103,3.91128785500547e-06,-8.379723480421878e-05,6.021934476231911e-05,1.030797018823019e-05
polarisation.py,MacBook-Pro,2020-05-01 10:10:23,exploratory,512,MID_FEKO_Ku,0.26142939768222545,0.2642993706990263,True,600.0,Ku,[12179000000.0],104,-3.192385132935472e-05,0.00015131157618525015,5.201278819565544e-05,8.956566044939506e-06
polarisation.py,MacBook-Pro,2020-05-01 10:10:31,exploratory,512,MID_FEKO_Ku,0.2617993877991494,0.2592993877991494,True,600.0,Ku,[12179000000.0],105,-4.543143173468004e-05,0.0001430153783649161,6.407788501169649e-05,1.3806282370122072e-05
polarisation.py,MacBook-Pro,2020-05-01 10:10:39,exploratory,512,MID_FEKO_Ku,0.2617993877991494,0.25965653124849447,True,600.0,Ku,[12179000000.0],106,1.850654412016634e-05,-6.135121441025655e-05,1.5784475529851996e-05,1.256978671832748e-05
polarisation.py,MacBook-Pro,2020-05-01 10:10:47,exploratory,512,MID_FEKO_Ku,0.2617993877991494,0.2600136744245149,True,600.0,Ku,[12179000000.0],107,-0.0002709025291191186,-0.0005024442845058352,0.0003913828584241123,6.921861522896655e-05
polarisation.py,MacBook-Pro,2020-05-01 10:10:55,exploratory,512,MID_FEKO_Ku,0.2617993877991494,0.2603708173727652,True,600.0,Ku,[12179000000.0],108,-0.001380413078020565,-0.0008999174793662972,0.0017238828050909053,0.00025559808697411953
polarisation.py,MacBook-Pro,2020-05-01 10:11:04,exploratory,512,MID_FEKO_Ku,0.2617993877991494,0.26072796013879973,True,600.0,Ku,[12179000000.0],109,-0.003517884807364789,-0.0009227680329603828,0.004232137276166646,0.0005974849634484942
polarisation.py,MacBook-Pro,2020-05-01 10:11:12,exploratory,512,MID_FEKO_Ku,0.2617993877991494,0.26108510276817265,True,600.0,Ku,[12179000000.0],110,-0.0062876007334127775,-0.0005229501063458017,0.007441922087645324,0.0010309712911955782
polarisation.py,MacBook-Pro,2020-05-01 10:11:21,exploratory,512,MID_FEKO_Ku,0.2617993877991494,0.26144224530643795,True,600.0,Ku,[12179000000.0],111,-0.00871884020305105,-5.1225806181495935e-05,0.010224930822773058,-0.0014056289968330995
polarisation.py,MacBook-Pro,2020-05-01 10:11:29,exploratory,512,MID_FEKO_Ku,0.2617993877991494,0.2617993877991494,True,600.0,Ku,[12179000000.0],112,-0.009759651934920942,2.443441831868814e-05,0.011375350332292913,0.0015592892219185646
polarisation.py,MacBook-Pro,2020-05-01 10:11:37,exploratory,512,MID_FEKO_Ku,0.2617993877991494,0.26215653029186087,True,600.0,Ku,[12179000000.0],113,-0.008925391282405992,-0.00047252379822512,0.010356929289239881,0.0014204911442382564
polarisation.py,MacBook-Pro,2020-05-01 10:11:45,exploratory,512,MID_FEKO_Ku,0.2617993877991494,0.26251367283012617,True,600.0,Ku,[12179000000.0],114,-0.006614404772876333,-0.0012048940907349085,0.007654411398889705,0.0010536539974701131
polarisation.py,MacBook-Pro,2020-05-01 10:11:53,exploratory,512,MID_FEKO_Ku,0.2617993877991494,0.26287081545949903,True,600.0,Ku,[12179000000.0],115,-0.0038422852975112617,-0.0016235148132248366,0.004449718757471643,0.0006176917435158086
polarisation.py,MacBook-Pro,2020-05-01 10:12:01,exploratory,512,MID_FEKO_Ku,0.2617993877991494,0.26322795822553363,True,600.0,Ku,[12179000000.0],116,-0.0016088272928218475,-0.0014227191873835174,0.0018849489961096813,0.00026688971329150233
polarisation.py,MacBook-Pro,2020-05-01 10:12:09,exploratory,512,MID_FEKO_Ku,0.2617993877991494,0.263585101173784,True,600.0,Ku,[12179000000.0],117,-0.00037722949229361237,-0.0007763916172274868,0.0004729924865487164,7.129287531764064e-05
polarisation.py,MacBook-Pro,2020-05-01 10:12:18,exploratory,512,MID_FEKO_Ku,0.2617993877991494,0.2639422443498044,True,600.0,Ku,[12179000000.0],118,-1.429430905806953e-06,-0.00014056752273670128,3.783054343691135e-05,8.193077675710694e-06
polarisation.py,MacBook-Pro,2020-05-01 10:12:26,exploratory,512,MID_FEKO_Ku,0.2617993877991494,0.26429938779914935,True,600.0,Ku,[12179000000.0],119,-2.8484003819231586e-05,0.0001493346110223298,5.0265362981733315e-05,9.193776678245057e-06
polarisation.py,MacBook-Pro,2020-05-01 10:12:33,exploratory,512,MID_FEKO_Ku,0.26216888255411935,0.2592993707219209,True,600.0,Ku,[12179000000.0],120,-5.927643246369706e-05,0.00014726698384312745,5.696044027512433e-05,1.2364128798579585e-05
polarisation.py,MacBook-Pro,2020-05-01 10:12:41,exploratory,512,MID_FEKO_Ku,0.2621689175869273,0.2596565141696609,True,600.0,Ku,[12179000000.0],121,1.932897557018945e-05,-1.6151636533250945e-05,1.4853670274871207e-05,1.030333043468904e-05
polarisation.py,MacBook-Pro,2020-05-01 10:12:49,exploratory,512,MID_FEKO_Ku,0.26216895267349516,0.26001365734407167,True,600.0,Ku,[12179000000.0],122,-0.00021272476037237717,-0.00038651526186190963,0.00043380244478605115,7.322070515655097e-05
polarisation.py,MacBook-Pro,2020-05-01 10:12:57,exploratory,512,MID_FEKO_Ku,0.2621689878138515,0.2603708002907077,True,600.0,Ku,[12179000000.0],123,-0.0012062158532417724,-0.0007115450622629649,0.0018122038080193184,0.0002665576509806721
polarisation.py,MacBook-Pro,2020-05-01 10:13:04,exploratory,512,MID_FEKO_Ku,0.2621690230080251,0.2607279430551233,True,600.0,Ku,[12179000000.0],124,-0.0031751428186854733,-0.0006991255103178468,0.004301289718387881,0.0006068365082342946
polarisation.py,MacBook-Pro,2020-05-01 10:13:12,exploratory,512,MID_FEKO_Ku,0.26216905825604464,0.2610850856828726,True,600.0,Ku,[12179000000.0],125,-0.00575823963667608,-0.0003378423486609837,0.007358769305169005,0.001019874647719478
polarisation.py,MacBook-Pro,2020-05-01 10:13:20,exploratory,512,MID_FEKO_Ku,0.26216909355793905,0.2614422282195096,True,600.0,Ku,[12179000000.0],126,-0.008038329711541201,0.00012240740415648277,0.009854450599568623,0.0013540258337456522
polarisation.py,MacBook-Pro,2020-05-01 10:13:28,exploratory,512,MID_FEKO_Ku,0.2621691289137372,0.26179937071058806,True,600.0,Ku,[12179000000.0],127,-0.009013869597054103,8.443838941241004e-05,0.010674962765382497,-0.0014614874367577212
polarisation.py,MacBook-Pro,2020-05-01 10:13:36,exploratory,512,MID_FEKO_Ku,0.2621691643234681,0.2621565132016619,True,600.0,Ku,[12179000000.0],128,-0.008223819033343219,-0.0004426400558672006,0.009427871713778319,-0.0012904366382220298
polarisation.py,MacBook-Pro,2020-05-01 10:13:44,exploratory,512,MID_FEKO_Ku,0.2621691997871608,0.26251365573828483,True,600.0,Ku,[12179000000.0],129,-0.006051024947586838,-0.001160893802355623,0.006703019333248524,-0.000920936314495251
polarisation.py,MacBook-Pro,2020-05-01 10:13:51,exploratory,512,MID_FEKO_Ku,0.2621692353048445,0.26287079836601074,True,600.0,Ku,[12179000000.0],130,-0.003464155648900834,-0.0015466144282099859,0.0036816585335949356,-0.0005103726327370608
polarisation.py,MacBook-Pro,2020-05-01 10:13:59,exploratory,512,MID_FEKO_Ku,0.26216927087654823,0.2632279411303936,True,600.0,Ku,[12179000000.0],131,-0.0014070460561015328,-0.0013292719078310585,0.0014059946542555014,0.000199251205402293
polarisation.py,MacBook-Pro,2020-05-01 10:14:07,exploratory,512,MID_FEKO_Ku,0.2621693065023014,0.2635850840769876,True,600.0,Ku,[12179000000.0],132,-0.0003026861436162162,-0.000699885449985537,0.000263589811271337,4.34799990734948e-05
polarisation.py,MacBook-Pro,2020-05-01 10:14:15,exploratory,512,MID_FEKO_Ku,0.26216934218213334,0.26394222725134703,True,600.0,Ku,[12179000000.0],133,8.524840632996186e-06,-0.0001034429341644789,-2.227121351353275e-05,8.292629348344919e-06
polarisation.py,MacBook-Pro,2020-05-01 10:14:23,exploratory,512,MID_FEKO_Ku,0.26216937791607337,0.2642993706990263,True,600.0,Ku,[12179000000.0],134,-4.087353311920472e-05,0.00014966739756742164,6.318172677412854e-05,1.126261902839409e-05
polarisation.py,MacBook-Pro,2020-05-01 10:14:31,exploratory,512,MID_FEKO_Ku,0.262538377349492,0.2592993194902291,True,600.0,Ku,[12179000000.0],135,-8.811309194654414e-05,0.00014112141580383005,6.784166635359314e-05,1.1903183961415783e-05
polarisation.py,MacBook-Pro,2020-05-01 10:14:39,exploratory,512,MID_FEKO_Ku,0.2625384474151059,0.25965646293315414,True,600.0,Ku,[12179000000.0],136,7.558599260034605e-06,6.007504227135615e-05,-5.211027708898942e-06,6.922091226334169e-06
polarisation.py,MacBook-Pro,2020-05-01 10:14:47,exploratory,512,MID_FEKO_Ku,0.26253851758823954,0.26001360610273605,True,600.0,Ku,[12179000000.0],137,-9.02696831152608e-05,-0.00016698541959251509,0.00029511042760951535,5.029780595792669e-05
polarisation.py,MacBook-Pro,2020-05-01 10:14:54,exploratory,512,MID_FEKO_Ku,0.2625385878689503,0.26037074904452917,True,600.0,Ku,[12179000000.0],138,-0.0007598694486813274,-0.0003485971364770516,0.0013837572514072644,0.00020353553534649003
polarisation.py,MacBook-Pro,2020-05-01 10:15:02,exploratory,512,MID_FEKO_Ku,0.26253865825729544,0.26072789180408784,True,600.0,Ku,[12179000000.0],139,-0.002211738654342572,-0.00029926715263275857,0.0033697177788737476,0.0004751781322479092
polarisation.py,MacBook-Pro,2020-05-01 10:15:10,exploratory,512,MID_FEKO_Ku,0.26253872875333256,0.26108503442696623,True,600.0,Ku,[12179000000.0],140,-0.004190170923822638,0.0003198480700868042,0.005768215189274764,0.0007981972056260588
polarisation.py,MacBook-Pro,2020-05-01 10:15:18,exploratory,512,MID_FEKO_Ku,0.26253879935711943,0.2614421769587183,True,600.0,Ku,[12179000000.0],141,-0.005968783827439758,0.0005834215416865951,0.007628575689526164,0.0010449034578580972
polarisation.py,MacBook-Pro,2020-05-01 10:15:26,exploratory,512,MID_FEKO_Ku,0.2625388700687138,0.2617993194448979,True,600.0,Ku,[12179000000.0],142,-0.006734232883162347,0.0005680789145428337,0.008073344395547652,-0.0011010657841847714
polarisation.py,MacBook-Pro,2020-05-01 10:15:33,exploratory,512,MID_FEKO_Ku,0.26253894088817364,0.2621564619310588,True,600.0,Ku,[12179000000.0],143,-0.006109592312588383,0.00017810281412555982,0.006875455338047663,-0.0009372585066740925
polarisation.py,MacBook-Pro,2020-05-01 10:15:42,exploratory,512,MID_FEKO_Ku,0.26253901181555717,0.2625136044627548,True,600.0,Ku,[12179000000.0],144,-0.0044100506402600746,-0.0006694717689856159,0.0046160515654539575,-0.0006311522062082559
polarisation.py,MacBook-Pro,2020-05-01 10:15:50,exploratory,512,MID_FEKO_Ku,0.26253908285092253,0.2628707470855397,True,600.0,Ku,[12179000000.0],145,-0.0024239293851653727,-0.0010119848440291452,0.002292681552805958,-0.0003157065443733597
polarisation.py,MacBook-Pro,2020-05-01 10:15:58,exploratory,512,MID_FEKO_Ku,0.2625391539943282,0.2632278898449676,True,600.0,Ku,[12179000000.0],146,-0.0009004536455565796,-0.0008912789009611318,0.0006950065540110032,9.937741252037223e-05
polarisation.py,MacBook-Pro,2020-05-01 10:16:06,exploratory,512,MID_FEKO_Ku,0.2625392252458326,0.2635850327865925,True,600.0,Ku,[12179000000.0],147,-0.00014546591745654585,-0.0004282285794298311,5.2293131584154504e-05,1.435616763077878e-05
polarisation.py,MacBook-Pro,2020-05-01 10:16:14,exploratory,512,MID_FEKO_Ku,0.2625392966054946,0.26394217595596875,True,600.0,Ku,[12179000000.0],148,9.046720409664126e-06,-4.811226700724807e-06,-2.9417271147319464e-05,7.499998319941525e-06
polarisation.py,MacBook-Pro,2020-05-01 10:16:22,exploratory,512,MID_FEKO_Ku,0.26253936807337286,0.2642993193986509,True,600.0,Ku,[12179000000.0],149,-7.046504050915789e-05,0.00014225895759578162,9.765258640178618e-05,1.5759319921882903e-05
polarisation.py,MacBook-Pro,2020-05-01 10:16:30,exploratory,512,MID_FEKO_Ku,0.26290787222567,0.2592992341040559,True,600.0,Ku,[12179000000.0],150,-0.00012355068758144384,0.00011459738154814157,0.00010027092116024778,1.486984537593927e-05
polarisation.py,MacBook-Pro,2020-05-01 10:16:38,exploratory,512,MID_FEKO_Ku,0.2629079773240859,0.25965637753895615,True,600.0,Ku,[12179000000.0],151,-3.4428156780669417e-05,0.0001061735238537476,-1.1891515224420696e-05,4.955270414533757e-06
polarisation.py,MacBook-Pro,2020-05-01 10:16:46,exploratory,512,MID_FEKO_Ku,0.26290808258378134,0.2600135207004898,True,600.0,Ku,[12179000000.0],152,-3.872444179475116e-06,3.979869454520002e-05,8.847490608333646e-05,1.737583627449969e-05
polarisation.py,MacBook-Pro,2020-05-01 10:16:54,exploratory,512,MID_FEKO_Ku,0.2629081880048424,0.2603706636342114,True,600.0,Ku,[12179000000.0],153,-0.0002965936614486632,9.886444732553337e-05,0.0007081819107244454,0.00010532969184482624
polarisation.py,MacBook-Pro,2020-05-01 10:17:02,exploratory,512,MID_FEKO_Ku,0.2629082935873552,0.2607278063856753,True,600.0,Ku,[12179000000.0],154,-0.0011056413753846265,0.00029827006308111423,0.0019434028468572936,0.00027431451012076616
polarisation.py,MacBook-Pro,2020-05-01 10:17:10,exploratory,512,MID_FEKO_Ku,0.262908399331406,0.2610849490004354,True,600.0,Ku,[12179000000.0],155,-0.0023051207997805334,0.0006206225342842001,0.0034565341030777593,0.00047706239785539587
polarisation.py,MacBook-Pro,2020-05-01 10:17:18,exploratory,512,MID_FEKO_Ku,0.2629085052370813,0.261442091524046,True,600.0,Ku,[12179000000.0],156,-0.003426184984150394,0.0009637297829254241,0.004583466685174315,0.0006244227766833614
polarisation.py,MacBook-Pro,2020-05-01 10:17:26,exploratory,512,MID_FEKO_Ku,0.262908611304468,0.26179923400206073,True,600.0,Ku,[12179000000.0],157,-0.003915983501051998,0.0009676773738640573,0.004741155876786983,-0.0006403676261992855
polarisation.py,MacBook-Pro,2020-05-01 10:17:34,exploratory,512,MID_FEKO_Ku,0.26290871753365297,0.2621563764800334,True,600.0,Ku,[12179000000.0],158,-0.0035140683893174545,0.000577809964716522,0.0038362819971925056,-0.0005175383400948291
polarisation.py,MacBook-Pro,2020-05-01 10:17:42,exploratory,512,MID_FEKO_Ku,0.2629088239247234,0.2625135190035178,True,600.0,Ku,[12179000000.0],159,-0.0024391189913192135,-0.00024906824573062624,0.002335944316045652,-0.00031455204976706103
polarisation.py,MacBook-Pro,2020-05-01 10:17:50,exploratory,512,MID_FEKO_Ku,0.26290893047776664,0.26287066161806777,True,600.0,Ku,[12179000000.0],160,-0.001228511072711094,-0.0004647535089701552,0.0009387229151460779,0.00012689672740817543
polarisation.py,MacBook-Pro,2020-05-01 10:17:58,exploratory,512,MID_FEKO_Ku,0.2629090371928704,0.2632278043692373,True,600.0,Ku,[12179000000.0],161,-0.00036918366075451163,-0.00039702134891717885,0.00012187231193830024,2.1336025309031475e-05
polarisation.py,MacBook-Pro,2020-05-01 10:18:06,exploratory,512,MID_FEKO_Ku,0.26290914407012234,0.2635849473025804,True,600.0,Ku,[12179000000.0],162,-2.1300539639598533e-05,-0.00013608077230685574,-8.782953210370808e-05,1.7078324553063252e-05
polarisation.py,MacBook-Pro,2020-05-01 10:18:14,exploratory,512,MID_FEKO_Ku,0.26290925110961055,0.2639420904636516,True,600.0,Ku,[12179000000.0],163,-2.351101570059086e-05,8.378469189782226e-05,2.2970330753712567e-05,6.429756712321094e-06
polarisation.py,MacBook-Pro,2020-05-01 10:18:22,exploratory,512,MID_FEKO_Ku,0.2629093583114233,0.26429923389800514,True,600.0,Ku,[12179000000.0],164,-0.00011085458070343342,0.0001074895066429677,0.00014408222423510436,2.1251812654976133e-05
polarisation.py,MacBook-Pro,2020-05-01 10:18:31,exploratory,512,MID_FEKO_Ku,0.2632773672230564,0.2592991145633709,True,600.0,Ku,[12179000000.0],165,-0.00014737690414253838,7.362456483830043e-05,0.00014595399877382018,2.0738999612995016e-05
polarisation.py,MacBook-Pro,2020-05-01 10:18:39,exploratory,512,MID_FEKO_Ku,0.263277507354268,0.2596562579870363,True,600.0,Ku,[12179000000.0],166,-0.00010020444064617942,9.83714451872506e-05,3.386087640625756e-05,6.211065209228432e-06
polarisation.py,MacBook-Pro,2020-05-01 10:18:47,exploratory,512,MID_FEKO_Ku,0.2632776477005193,0.2600134011373025,True,600.0,Ku,[12179000000.0],167,-1.2819045236369243e-05,7.771127465056576e-05,-3.002153238385913e-05,6.3976661410459884e-06
polarisation.py,MacBook-Pro,2020-05-01 10:18:55,exploratory,512,MID_FEKO_Ku,0.2632777882619247,0.260370544059724,True,600.0,Ku,[12179000000.0],168,-3.7380264725547945e-05,0.00011787005786152755,0.0001621443913610894,2.5901568319434988e-05
polarisation.py,MacBook-Pro,2020-05-01 10:19:04,exploratory,512,MID_FEKO_Ku,0.26327792903859915,0.26072768679985514,True,600.0,Ku,[12179000000.0],169,-0.0003197765522557141,0.0003031086221505339,0.0007023385953731665,0.00010016706608292114
polarisation.py,MacBook-Pro,2020-05-01 10:19:12,exploratory,512,MID_FEKO_Ku,0.2632780700306577,0.26108482940324984,True,600.0,Ku,[12179000000.0],170,-0.0008417406978200674,0.0006142116287793173,0.0014206025212816608,0.00019738685847407877
polarisation.py,MacBook-Pro,2020-05-01 10:19:21,exploratory,512,MID_FEKO_Ku,0.26327821123821565,0.2614419719154623,True,600.0,Ku,[12179000000.0],171,-0.0013735284587185095,0.0008960173489468849,0.0019450815249784789,0.00026908289468421855
polarisation.py,MacBook-Pro,2020-05-01 10:19:29,exploratory,512,MID_FEKO_Ku,0.26327835266138877,0.2617991143820463,True,600.0,Ku,[12179000000.0],172,-0.0016137399664821845,0.0009221732742469799,0.001958545171186338,0.0002706745430534325
polarisation.py,MacBook-Pro,2020-05-01 10:19:37,exploratory,512,MID_FEKO_Ku,0.26327849430029304,0.2621562568485554,True,600.0,Ku,[12179000000.0],173,-0.001415613899719606,0.0006460072515815643,0.0014440398095250447,0.00019974815087526858
polarisation.py,MacBook-Pro,2020-05-01 10:19:45,exploratory,512,MID_FEKO_Ku,0.2632786361550446,0.26251339936054363,True,600.0,Ku,[12179000000.0],174,-0.0009026024105096099,0.0003041449554663118,0.0007013540960947896,9.788431610491237e-05
polarisation.py,MacBook-Pro,2020-05-01 10:19:54,exploratory,512,MID_FEKO_Ku,0.26327877822576007,0.26287054196356463,True,600.0,Ku,[12179000000.0],175,-0.000369085107607299,-0.00013390797815179042,0.00011942510265619748,2.010090548396089e-05
polarisation.py,MacBook-Pro,2020-05-01 10:20:02,exploratory,512,MID_FEKO_Ku,0.26327892051255614,0.2632276847031724,True,600.0,Ku,[12179000000.0],176,-5.771715205290769e-05,-9.029967284827804e-05,-0.0001022671009918957,1.8090964625933016e-05
polarisation.py,MacBook-Pro,2020-05-01 10:20:10,exploratory,512,MID_FEKO_Ku,0.26327906301554993,0.2635848276249211,True,600.0,Ku,[12179000000.0],177,-8.773105108021938e-06,3.200201098649687e-05,-3.124867910695946e-05,8.086082714597712e-06
polarisation.py,MacBook-Pro,2020-05-01 10:20:18,exploratory,512,MID_FEKO_Ku,0.2632792057348588,0.26394197077436493,True,600.0,Ku,[12179000000.0],178,-8.837598628422937e-05,9.649102176328948e-05,0.00011489128989293494,1.805022056185074e-05
polarisation.py,MacBook-Pro,2020-05-01 10:20:27,exploratory,512,MID_FEKO_Ku,0.26327934867060043,0.2642991141970584,True,600.0,Ku,[12179000000.0],179,-0.0001434045986635458,4.405391050913354e-05,0.00017415562526700224,2.4657289345563837e-05
polarisation.py,MacBook-Pro,2020-05-01 10:20:35,exploratory,512,MID_FEKO_Ku,0.26364686238205404,0.2592989608681317,True,600.0,Ku,[12179000000.0],180,-0.00014060559944375944,3.691980285169501e-05,0.000180538021251743,2.663079342599575e-05
polarisation.py,MacBook-Pro,2020-05-01 10:20:44,exploratory,512,MID_FEKO_Ku,0.26364703754605345,0.2596561042773523,True,600.0,Ku,[12179000000.0],181,-0.00015351871499254212,6.509567748985543e-05,0.00011591480208012907,1.618545394214771e-05
polarisation.py,MacBook-Pro,2020-05-01 10:20:53,exploratory,512,MID_FEKO_Ku,0.2636472129788524,0.2600132474131317,True,600.0,Ku,[12179000000.0],182,-9.476566003786408e-05,6.0240790968321316e-05,4.922115915613334e-06,2.1305057108025577e-06
polarisation.py,MacBook-Pro,2020-05-01 10:21:01,exploratory,512,MID_FEKO_Ku,0.26364738868059423,0.2603703903210245,True,600.0,Ku,[12179000000.0],183,-2.0777834592745992e-05,5.7824693807822765e-05,-4.690416630100911e-05,7.948175107244665e-06
polarisation.py,MacBook-Pro,2020-05-01 10:21:10,exploratory,512,MID_FEKO_Ku,0.2636475646514223,0.2607275330465849,True,600.0,Ku,[12179000000.0],184,-2.1138317410137683e-05,0.00014268798867094658,5.2967172516421785e-05,1.118628815898427e-05
polarisation.py,MacBook-Pro,2020-05-01 10:21:18,exploratory,512,MID_FEKO_Ku,0.26364774089148063,0.26108467563536697,True,600.0,Ku,[12179000000.0],185,-0.00013070421608615883,0.00031539124944653606,0.0002577680653749831,4.1199711445606844e-05
polarisation.py,MacBook-Pro,2020-05-01 10:21:27,exploratory,512,MID_FEKO_Ku,0.2636479174009134,0.2614418181329247,True,600.0,Ku,[12179000000.0],186,-0.00028220536262571103,0.0004781195071980701,0.00041699507785409516,6.475247723414944e-05
polarisation.py,MacBook-Pro,2020-05-01 10:21:36,exploratory,512,MID_FEKO_Ku,0.26364809417986523,0.26179896058481195,True,600.0,Ku,[12179000000.0],187,-0.0003573816990256294,0.0005072162441032336,0.00039825816270702154,6.281299511077013e-05
polarisation.py,MacBook-Pro,2020-05-01 10:21:44,exploratory,512,MID_FEKO_Ku,0.263648271228481,0.26215610303658227,True,600.0,Ku,[12179000000.0],188,-0.0002942686388310079,0.0003727691011226031,0.0002115318843632607,4.05980706119456e-05
polarisation.py,MacBook-Pro,2020-05-01 10:21:52,exploratory,512,MID_FEKO_Ku,0.26364844854690606,0.26251324553378963,True,600.0,Ku,[12179000000.0],189,-0.00014514034169283896,0.00018454004151481474,2.6255420930437907e-05,1.4447671201092752e-05
polarisation.py,MacBook-Pro,2020-05-01 10:22:01,exploratory,512,MID_FEKO_Ku,0.26364862613528595,0.26287038812198765,True,600.0,Ku,[12179000000.0],190,-2.6875953879961153e-05,5.903963768077036e-05,-9.600422613386955e-05,1.7897831176570497e-05
polarisation.py,MacBook-Pro,2020-05-01 10:22:09,exploratory,512,MID_FEKO_Ku,0.2636488039937668,0.26322753084673045,True,600.0,Ku,[12179000000.0],191,-1.4679874015604343e-05,2.7584597280409954e-05,-2.9687748911544225e-05,7.79400653227637e-06
polarisation.py,MacBook-Pro,2020-05-01 10:22:17,exploratory,512,MID_FEKO_Ku,0.2636489821224949,0.2635846737535719,True,600.0,Ku,[12179000000.0],192,-8.37991781285919e-05,6.591874757486146e-05,0.00010160111363877406,1.696258763172048e-05
polarisation.py,MacBook-Pro,2020-05-01 10:22:25,exploratory,512,MID_FEKO_Ku,0.26364916052161685,0.26394181688806645,True,600.0,Ku,[12179000000.0],193,-0.0001481014280432343,4.968137788509596e-05,0.0001799558870976053,2.6081441720679107e-05
polarisation.py,MacBook-Pro,2020-05-01 10:22:34,exploratory,512,MID_FEKO_Ku,0.2636493391912799,0.2642989602957685,True,600.0,Ku,[12179000000.0],194,-0.0001454409192459228,-2.330436530061744e-05,0.00016248175884744386,2.317293837329206e-05
polarisation.py,MacBook-Pro,2020-05-01 10:22:43,exploratory,512,MID_FEKO_Ku,0.26401635774306614,0.2592987730182836,True,600.0,Ku,[12179000000.0],195,-9.956419688379922e-05,2.269650622699049e-05,0.00017631196603508617,2.7639409646621658e-05
polarisation.py,MacBook-Pro,2020-05-01 10:22:52,exploratory,512,MID_FEKO_Ku,0.2640165679398432,0.2596559164098494,True,600.0,Ku,[12179000000.0],196,-0.00015721342871946793,4.382768828216058e-05,0.000182922184067343,2.662691997286429e-05
polarisation.py,MacBook-Pro,2020-05-01 10:23:01,exploratory,512,MID_FEKO_Ku,0.2640167784591798,0.2600130595279228,True,600.0,Ku,[12179000000.0],197,-0.00016426935501080272,3.904314017950206e-05,0.00011541199184232048,1.631122921459046e-05
polarisation.py,MacBook-Pro,2020-05-01 10:23:11,exploratory,512,MID_FEKO_Ku,0.264016989301248,0.26037020241805825,True,600.0,Ku,[12179000000.0],198,-0.00011895858195319666,1.9815973729694528e-05,1.9653713893421086e-05,3.4553166729195073e-06
polarisation.py,MacBook-Pro,2020-05-01 10:23:20,exploratory,512,MID_FEKO_Ku,0.2640172004662199,0.2607273451258101,True,600.0,Ku,[12179000000.0],199,-5.756498586531555e-05,-1.7898698428741183e-05,-4.571396330260757e-05,7.425440008739286e-06
polarisation.py,MacBook-Pro,2020-05-01 10:23:28,exploratory,512,MID_FEKO_Ku,0.26401741195426814,0.26108448769673215,True,600.0,Ku,[12179000000.0],200,-1.906327454366518e-05,2.0756967407472237e-05,-6.009174391184364e-05,1.0482160494426694e-05
polarisation.py,MacBook-Pro,2020-05-01 10:23:36,exploratory,512,MID_FEKO_Ku,0.2640176237655659,0.2614416301763786,True,600.0,Ku,[12179000000.0],201,-1.0777976898310062e-05,6.815772661686946e-05,-5.309274591030747e-05,1.1044614635210701e-05
polarisation.py,MacBook-Pro,2020-05-01 10:23:44,exploratory,512,MID_FEKO_Ku,0.2640178359002866,0.26179877261030315,True,600.0,Ku,[12179000000.0],202,-1.2153470040865802e-05,8.246654627680136e-05,-5.8654048098999756e-05,1.2609206332927717e-05
polarisation.py,MacBook-Pro,2020-05-01 10:23:53,exploratory,512,MID_FEKO_Ku,0.2640180483586042,0.26215591504405944,True,600.0,Ku,[12179000000.0],203,-8.736476603722485e-06,4.8736517540537047e-05,-7.033450137707833e-05,1.3941248572560597e-05
polarisation.py,MacBook-Pro,2020-05-01 10:24:01,exploratory,512,MID_FEKO_Ku,0.26401826114069304,0.26251305752320125,True,600.0,Ku,[12179000000.0],204,-1.3177378688259993e-05,6.415130980015976e-06,-4.899404994442305e-05,1.0209545643437444e-05
polarisation.py,MacBook-Pro,2020-05-01 10:24:09,exploratory,512,MID_FEKO_Ku,0.2640184742467279,0.2628702000932824,True,600.0,Ku,[12179000000.0],205,-4.7253586630221576e-05,-1.2446447700257288e-05,2.6849833568143106e-05,7.202119008158062e-06
polarisation.py,MacBook-Pro,2020-05-01 10:24:18,exploratory,512,MID_FEKO_Ku,0.264018687676884,0.2632273427998567,True,600.0,Ku,[12179000000.0],206,-0.00010747842928124944,3.341684142237431e-05,0.00012434402896407002,1.9893739954952337e-05
polarisation.py,MacBook-Pro,2020-05-01 10:24:26,exploratory,512,MID_FEKO_Ku,0.2640189014313369,0.26358448568847836,True,600.0,Ku,[12179000000.0],207,-0.00015755687857936895,3.283787984043849e-05,0.00018453055427140018,2.6905417745339847e-05
polarisation.py,MacBook-Pro,2020-05-01 10:24:33,exploratory,512,MID_FEKO_Ku,0.2640191155102627,0.2639416288047015,True,600.0,Ku,[12179000000.0],208,-0.0001593195478944743,-8.640901235681576e-06,0.00017331600113553152,2.462222554473669e-05
polarisation.py,MacBook-Pro,2020-05-01 10:24:42,exploratory,512,MID_FEKO_Ku,0.2640193299138378,0.2642987721940806,True,600.0,Ku,[12179000000.0],209,-0.00010884446396232185,-6.691169439574836e-05,0.00011273085663335415,1.7108223065508443e-05
polarisation.py,MacBook-Pro,2020-05-01 10:24:50,exploratory,512,MID_FEKO_Ku,0.26438585334649617,0.2592985510137598,True,600.0,Ku,[12179000000.0],210,-4.280151170137813e-05,-1.412485287501017e-05,0.0001257882525731945,2.214362259416406e-05
polarisation.py,MacBook-Pro,2020-05-01 10:24:58,exploratory,512,MID_FEKO_Ku,0.2643860985760387,0.25965569438446084,True,600.0,Ku,[12179000000.0],211,-0.00010814439404833372,3.821272428161249e-05,0.00018502698028497922,2.867317866619206e-05
polarisation.py,MacBook-Pro,2020-05-01 10:25:06,exploratory,512,MID_FEKO_Ku,0.264386344181901,0.26001283748160897,True,600.0,Ku,[12179000000.0],212,-0.0001609266719304824,4.865749291918636e-05,0.0001928019373823723,2.8303088701800957e-05
polarisation.py,MacBook-Pro,2020-05-01 10:25:15,exploratory,512,MID_FEKO_Ku,0.2643865901642835,0.26036998035075853,True,600.0,Ku,[12179000000.0],213,-0.00017864862153933161,2.4807787708129486e-05,0.00015300108971526882,2.2087560720443794e-05
polarisation.py,MacBook-Pro,2020-05-01 10:25:23,exploratory,512,MID_FEKO_Ku,0.26438683652338724,0.2607271230374638,True,600.0,Ku,[12179000000.0],214,-0.0001619834432531787,-3.042045728588124e-05,9.500496398852267e-05,1.4131104002862653e-05
polarisation.py,MacBook-Pro,2020-05-01 10:25:32,exploratory,512,MID_FEKO_Ku,0.2643870832594136,0.2610842655872787,True,600.0,Ku,[12179000000.0],215,-0.00012982704718472228,-6.375580934295949e-05,4.8321925845594825e-05,8.3146000948777e-06
polarisation.py,MacBook-Pro,2020-05-01 10:25:40,exploratory,512,MID_FEKO_Ku,0.26438733037256457,0.2614414080457572,True,600.0,Ku,[12179000000.0],216,-0.00010231552907093897,-8.2134689607715e-05,2.833718311667506e-05,6.227340136290513e-06
polarisation.py,MacBook-Pro,2020-05-01 10:25:49,exploratory,512,MID_FEKO_Ku,0.26438757786304246,0.2617985504584531,True,600.0,Ku,[12179000000.0],217,-9.029460530860021e-05,-8.484239679170286e-05,3.239823932663147e-05,7.1453675521510694e-06
polarisation.py,MacBook-Pro,2020-05-01 10:25:57,exploratory,512,MID_FEKO_Ku,0.2643878257310503,0.26215569287092005,True,600.0,Ku,[12179000000.0],218,-9.678490614129455e-05,-7.570884024600015e-05,6.184766844721942e-05,1.1119255594982651e-05
polarisation.py,MacBook-Pro,2020-05-01 10:26:05,exploratory,512,MID_FEKO_Ku,0.26438807397679137,0.2625128353287118,True,600.0,Ku,[12179000000.0],219,-0.00012018532161453011,-5.16263052415271e-05,0.00011303478957718687,1.7981339766974734e-05
polarisation.py,MacBook-Pro,2020-05-01 10:26:13,exploratory,512,MID_FEKO_Ku,0.26438832260046974,0.262869977877382,True,600.0,Ku,[12179000000.0],220,-0.0001513149488541937,-2.118619105357646e-05,0.0001651473223223515,2.4592165200070218e-05
polarisation.py,MacBook-Pro,2020-05-01 10:26:21,exploratory,512,MID_FEKO_Ku,0.2643885716022896,0.26322712056248454,True,600.0,Ku,[12179000000.0],221,-0.0001711291596955813,1.4744268106458306e-05,0.00018880258993199118,2.7088012535034102e-05
polarisation.py,MacBook-Pro,2020-05-01 10:26:29,exploratory,512,MID_FEKO_Ku,0.26438882098245603,0.26358426342957364,True,600.0,Ku,[12179000000.0],222,-0.00015980166090131956,4.799684280379237e-06,0.00016663060145512517,2.3632266804412717e-05
polarisation.py,MacBook-Pro,2020-05-01 10:26:38,exploratory,512,MID_FEKO_Ku,0.2643890707411743,0.2639414065242033,True,600.0,Ku,[12179000000.0],223,-0.00011336651815164706,-4.4289308870195177e-05,0.00011142940501721797,1.68433658353964e-05
polarisation.py,MacBook-Pro,2020-05-01 10:26:48,exploratory,512,MID_FEKO_Ku,0.26438932087865025,0.2642985498919281,True,600.0,Ku,[12179000000.0],224,-5.056384548696086e-05,-7.85901795419148e-05,5.836271729226453e-05,1.1450836778130907e-05
