{
    "patches": [],
    "sources": [
        {
            "Name": "source_0000",
            "Type": "POINT",
            "Patch": null,
            "Ra": 0.023312,
            "Dec": -44.841098,
            "I": 0.506776805416,
            "MajorAxis": 0.0,
            "MinorAxis": 0.0,
            "Orientation": 0.0,
            "ReferenceFrequency": 950000000.0,
            "SpectralIndex": [
                0.0
            ],
            "LogarithmicSI": true
        },
        {
            "Name": "source_0001",
            "Type": "POINT",
            "Patch": null,
            "Ra": 0.573209,
            "Dec": -44.909074,
            "I": 0.038009454021,
            "MajorAxis": 0.0,
            "MinorAxis": 0.0,
            "Orientation": 0.0,
            "ReferenceFrequency": 950000000.0,
            "SpectralIndex": [
                0.0
            ],
            "LogarithmicSI": true
        },
        {
            "Name": "source_0002",
            "Type": "POINT",
            "Patch": null,
            "Ra": 0.300164,
            "Dec": -44.553844,
            "I": 0.037074684779,
            "MajorAxis": 0.0,
            "MinorAxis": 0.0,
            "Orientation": 0.0,
            "ReferenceFrequency": 950000000.0,
            "SpectralIndex": [
                0.0
            ],
            "LogarithmicSI": true
        }
    ]
}