{
"type": "FeatureCollection",
"name": "station_export_w2",
"crs": { "type": "name", "properties": { "name": "urn:ogc:def:crs:OGC:1.3:CRS84" } },
"features": [
{ "type": "Feature", "properties": { "name": "EDA2", "nof_antennas": 256, "antenna_type": "EDA2", "tpms": [ 1, 2, 3, 4, 5, 6, 7, 8, 9, 10, 11, 12, 13, 14, 15, 16 ], "station_num": 1 }, "geometry": { "type": "Point", "coordinates": [ 116.672437792380549, -26.704756537044446 ] } },
{ "type": "Feature", "properties": { "name": "AAVS2", "nof_antennas": 256, "antenna_type": "SKALA4", "tpms": [ 17, 18, 19, 20, 21, 22, 23, 24, 25, 26, 27, 28, 29, 30, 31, 32 ], "station_num": 2 }, "geometry": { "type": "Point", "coordinates": [ 116.670769021133339, -26.704796006119444 ] } }
]
}
