{
"model":
  {
    "instrument":
    {
      "ska1_low":
      {
        "layout":
        {
          "description":"Telescope State Information (TSI) - SKA1-low telescope configuration",
          "reference":"WGS843 referenced set of locations for the SKA1-low stations.SKA-TEL-SKO-0000422. 2017-11-12",
          "comment":"This configuration file is an example only. Not to be treated as the ground thruth.",
          "revision": "3",
          "telescope":"SKA1_Low",
          "coordinates":"ITRF",
          "units": "meters",
          "antennas":[
        {"name":"C1","dish_diameter":"38.0","long":"116.7656958","lat":"-26.82616213"},
        {"name":"C2","dish_diameter":"38.0","long":"116.7636211","lat":"-26.82364606"},
        {"name":"C3","dish_diameter":"38.0","long":"116.7651556","lat":"-26.82515162"},
        {"name":"C4","dish_diameter":"38.0","long":"116.7631025","lat":"-26.82522621"},
        {"name":"C5","dish_diameter":"38.0","long":"116.7646226","lat":"-26.8245112"},
        {"name":"C6","dish_diameter":"38.0","long":"116.7641297","lat":"-26.82292318"},
        {"name":"C7","dish_diameter":"38.0","long":"116.7647692","lat":"-26.82354416"},
        {"name":"C8","dish_diameter":"38.0","long":"116.7645394","lat":"-26.82518455"},
        {"name":"C9","dish_diameter":"38.0","long":"116.7655743","lat":"-26.82412009"},
        {"name":"C10","dish_diameter":"38.0","long":"116.7626027","lat":"-26.82421605"},
        {"name":"C11","dish_diameter":"38.0","long":"116.7630732","lat":"-26.82427838"},
        {"name":"C12","dish_diameter":"38.0","long":"116.7660714","lat":"-26.8234492"},
        {"name":"C13","dish_diameter":"38.0","long":"116.764434","lat":"-26.82567181"},
        {"name":"C14","dish_diameter":"38.0","long":"116.7649041","lat":"-26.82546429"},
        {"name":"C15","dish_diameter":"38.0","long":"116.7639962","lat":"-26.82462186"},
        {"name":"C16","dish_diameter":"38.0","long":"116.762306","lat":"-26.82467697"},
        {"name":"C17","dish_diameter":"38.0","long":"116.7652628","lat":"-26.82380948"},
        {"name":"C18","dish_diameter":"38.0","long":"116.7660333","lat":"-26.82406202"},
        {"name":"C19","dish_diameter":"38.0","long":"116.7640195","lat":"-26.82534865"},
        {"name":"C20","dish_diameter":"38.0","long":"116.7648058","lat":"-26.82488493"},
        {"name":"C21","dish_diameter":"38.0","long":"116.7661302","lat":"-26.82456892"},
        {"name":"C22","dish_diameter":"38.0","long":"116.7664076","lat":"-26.82523076"},
        {"name":"C23","dish_diameter":"38.0","long":"116.7653638","lat":"-26.82581516"},
        {"name":"C24","dish_diameter":"38.0","long":"116.7638488","lat":"-26.82329629"},
        {"name":"C25","dish_diameter":"38.0","long":"116.7657094","lat":"-26.82325158"},
        {"name":"C26","dish_diameter":"38.0","long":"116.7634986","lat":"-26.82306086"},
        {"name":"C27","dish_diameter":"38.0","long":"116.7644799","lat":"-26.82315562"},
        {"name":"C28","dish_diameter":"38.0","long":"116.7647429","lat":"-26.82638203"},
        {"name":"C29","dish_diameter":"38.0","long":"116.7639194","lat":"-26.8258175"},
        {"name":"C30","dish_diameter":"38.0","long":"116.7652056","lat":"-26.82338066"},
        {"name":"C31","dish_diameter":"38.0","long":"116.7655796","lat":"-26.82548882"},
        {"name":"C32","dish_diameter":"38.0","long":"116.7651409","lat":"-26.82266685"},
        {"name":"C33","dish_diameter":"38.0","long":"116.7637741","lat":"-26.82626327"},
        {"name":"C34","dish_diameter":"38.0","long":"116.7664875","lat":"-26.82408735"},
        {"name":"C35","dish_diameter":"38.0","long":"116.7635733","lat":"-26.82539741"},
        {"name":"C36","dish_diameter":"38.0","long":"116.7630041","lat":"-26.82580168"},
        {"name":"C37","dish_diameter":"38.0","long":"116.7651879","lat":"-26.82462593"},
        {"name":"C38","dish_diameter":"38.0","long":"116.763076","lat":"-26.82482821"},
        {"name":"C39","dish_diameter":"38.0","long":"116.7651991","lat":"-26.82641603"},
        {"name":"C40","dish_diameter":"38.0","long":"116.7622327","lat":"-26.82402938"},
        {"name":"C41","dish_diameter":"38.0","long":"116.7634184","lat":"-26.82458689"},
        {"name":"C42","dish_diameter":"38.0","long":"116.7665961","lat":"-26.82445806"},
        {"name":"C43","dish_diameter":"38.0","long":"116.7623278","lat":"-26.82532"},
        {"name":"C44","dish_diameter":"38.0","long":"116.7651675","lat":"-26.8242431"},
        {"name":"C45","dish_diameter":"38.0","long":"116.7637493","lat":"-26.82664258"},
        {"name":"C46","dish_diameter":"38.0","long":"116.7626395","lat":"-26.82374404"},
        {"name":"C47","dish_diameter":"38.0","long":"116.7661077","lat":"-26.8259025"},
        {"name":"C48","dish_diameter":"38.0","long":"116.7626086","lat":"-26.82497718"},
        {"name":"C49","dish_diameter":"38.0","long":"116.7645825","lat":"-26.82273373"},
        {"name":"C50","dish_diameter":"38.0","long":"116.7664695","lat":"-26.82569579"},
        {"name":"C51","dish_diameter":"38.0","long":"116.7649649","lat":"-26.82301951"},
        {"name":"C52","dish_diameter":"38.0","long":"116.7642184","lat":"-26.82614823"},
        {"name":"C53","dish_diameter":"38.0","long":"116.763241","lat":"-26.82387674"},
        {"name":"C54","dish_diameter":"38.0","long":"116.7657191","lat":"-26.82447705"},
        {"name":"C55","dish_diameter":"38.0","long":"116.7667313","lat":"-26.82487753"},
        {"name":"C56","dish_diameter":"38.0","long":"116.762731","lat":"-26.82551227"},
        {"name":"C57","dish_diameter":"38.0","long":"116.7648979","lat":"-26.82592941"},
        {"name":"C58","dish_diameter":"38.0","long":"116.7634101","lat":"-26.82598422"},
        {"name":"C59","dish_diameter":"38.0","long":"116.7641982","lat":"-26.82495577"},
        {"name":"C60","dish_diameter":"38.0","long":"116.765966","lat":"-26.82510295"},
        {"name":"C61","dish_diameter":"38.0","long":"116.7629843","lat":"-26.82625009"},
        {"name":"C62","dish_diameter":"38.0","long":"116.7633453","lat":"-26.8264584"},
        {"name":"C63","dish_diameter":"38.0","long":"116.7635748","lat":"-26.8249937"},
        {"name":"C64","dish_diameter":"38.0","long":"116.7630735","lat":"-26.82321344"},
        {"name":"C65","dish_diameter":"38.0","long":"116.7637491","lat":"-26.82270185"},
        {"name":"C66","dish_diameter":"38.0","long":"116.7643541","lat":"-26.82669943"},
        {"name":"C67","dish_diameter":"38.0","long":"116.7627386","lat":"-26.82457846"},
        {"name":"C68","dish_diameter":"38.0","long":"116.7656383","lat":"-26.82284386"},
        {"name":"C69","dish_diameter":"38.0","long":"116.76573","lat":"-26.82369721"},
        {"name":"C70","dish_diameter":"38.0","long":"116.7641838","lat":"-26.82352853"},
        {"name":"C71","dish_diameter":"38.0","long":"116.7660719","lat":"-26.82551408"},
        {"name":"C72","dish_diameter":"38.0","long":"116.7664021","lat":"-26.8236942"},
        {"name":"C73","dish_diameter":"38.0","long":"116.7648915","lat":"-26.82674108"},
        {"name":"C74","dish_diameter":"38.0","long":"116.7624474","lat":"-26.82579705"},
        {"name":"C75","dish_diameter":"38.0","long":"116.7655827","lat":"-26.82493426"},
        {"name":"C76","dish_diameter":"38.0","long":"116.7666724","lat":"-26.8263833"},
        {"name":"C77","dish_diameter":"38.0","long":"116.7667323","lat":"-26.82676355"},
        {"name":"C78","dish_diameter":"38.0","long":"116.7622903","lat":"-26.82229899"},
        {"name":"C79","dish_diameter":"38.0","long":"116.7659338","lat":"-26.82689213"},
        {"name":"C80","dish_diameter":"38.0","long":"116.7612261","lat":"-26.82372357"},
        {"name":"C81","dish_diameter":"38.0","long":"116.7653602","lat":"-26.82771787"},
        {"name":"C82","dish_diameter":"38.0","long":"116.7629318","lat":"-26.82694292"},
        {"name":"C83","dish_diameter":"38.0","long":"116.7676874","lat":"-26.8232883"},
        {"name":"C84","dish_diameter":"38.0","long":"116.7625644","lat":"-26.8266925"},
        {"name":"C85","dish_diameter":"38.0","long":"116.7667464","lat":"-26.82291965"},
        {"name":"C86","dish_diameter":"38.0","long":"116.7634749","lat":"-26.82719424"},
        {"name":"C87","dish_diameter":"38.0","long":"116.7618119","lat":"-26.82557159"},
        {"name":"C88","dish_diameter":"38.0","long":"116.7650766","lat":"-26.82726871"},
        {"name":"C89","dish_diameter":"38.0","long":"116.7627641","lat":"-26.82259065"},
        {"name":"C90","dish_diameter":"38.0","long":"116.7611171","lat":"-26.82415185"},
        {"name":"C91","dish_diameter":"38.0","long":"116.7625561","lat":"-26.82717254"},
        {"name":"C92","dish_diameter":"38.0","long":"116.7613688","lat":"-26.82453504"},
        {"name":"C93","dish_diameter":"38.0","long":"116.7630782","lat":"-26.82180883"},
        {"name":"C94","dish_diameter":"38.0","long":"116.7676562","lat":"-26.82601497"},
        {"name":"C95","dish_diameter":"38.0","long":"116.7617673","lat":"-26.82415583"},
        {"name":"C96","dish_diameter":"38.0","long":"116.7615063","lat":"-26.8230708"},
        {"name":"C97","dish_diameter":"38.0","long":"116.7655318","lat":"-26.82243768"},
        {"name":"C98","dish_diameter":"38.0","long":"116.7674856","lat":"-26.82419697"},
        {"name":"C99","dish_diameter":"38.0","long":"116.7658067","lat":"-26.82737004"},
        {"name":"C100","dish_diameter":"38.0","long":"116.7657169","lat":"-26.82654484"},
        {"name":"C101","dish_diameter":"38.0","long":"116.7637154","lat":"-26.82186055"},
        {"name":"C102","dish_diameter":"38.0","long":"116.7632722","lat":"-26.82248305"},
        {"name":"C103","dish_diameter":"38.0","long":"116.7672443","lat":"-26.82577806"},
        {"name":"C104","dish_diameter":"38.0","long":"116.7663785","lat":"-26.8222438"},
        {"name":"C105","dish_diameter":"38.0","long":"116.7639572","lat":"-26.82233732"},
        {"name":"C106","dish_diameter":"38.0","long":"116.7617887","lat":"-26.82271557"},
        {"name":"C107","dish_diameter":"38.0","long":"116.7672322","lat":"-26.82373648"},
        {"name":"C108","dish_diameter":"38.0","long":"116.7619552","lat":"-26.82510197"},
        {"name":"C109","dish_diameter":"38.0","long":"116.7659834","lat":"-26.82207239"},
        {"name":"C110","dish_diameter":"38.0","long":"116.7650688","lat":"-26.8220239"},
        {"name":"C111","dish_diameter":"38.0","long":"116.7623751","lat":"-26.82618748"},
        {"name":"C112","dish_diameter":"38.0","long":"116.7645691","lat":"-26.82726582"},
        {"name":"C113","dish_diameter":"38.0","long":"116.7632117","lat":"-26.82754169"},
        {"name":"C114","dish_diameter":"38.0","long":"116.7619306","lat":"-26.82322368"},
        {"name":"C115","dish_diameter":"38.0","long":"116.7612722","lat":"-26.82592916"},
        {"name":"C116","dish_diameter":"38.0","long":"116.7625814","lat":"-26.82335072"},
        {"name":"C117","dish_diameter":"38.0","long":"116.766244","lat":"-26.82641395"},
        {"name":"C118","dish_diameter":"38.0","long":"116.7642128","lat":"-26.82162727"},
        {"name":"C119","dish_diameter":"38.0","long":"116.7670238","lat":"-26.82321699"},
        {"name":"C120","dish_diameter":"38.0","long":"116.7668953","lat":"-26.82544013"},
        {"name":"C121","dish_diameter":"38.0","long":"116.7617877","lat":"-26.82359654"},
        {"name":"C122","dish_diameter":"38.0","long":"116.7645958","lat":"-26.82200787"},
        {"name":"C123","dish_diameter":"38.0","long":"116.7664847","lat":"-26.82324162"},
        {"name":"C124","dish_diameter":"38.0","long":"116.7676787","lat":"-26.82483275"},
        {"name":"C125","dish_diameter":"38.0","long":"116.7621427","lat":"-26.82680932"},
        {"name":"C126","dish_diameter":"38.0","long":"116.7672799","lat":"-26.82637699"},
        {"name":"C127","dish_diameter":"38.0","long":"116.7616701","lat":"-26.82676572"},
        {"name":"C128","dish_diameter":"38.0","long":"116.7619853","lat":"-26.82645224"},
        {"name":"C129","dish_diameter":"38.0","long":"116.7613318","lat":"-26.82551082"},
        {"name":"C130","dish_diameter":"38.0","long":"116.7639869","lat":"-26.82754237"},
        {"name":"C131","dish_diameter":"38.0","long":"116.7670149","lat":"-26.82409705"},
        {"name":"C132","dish_diameter":"38.0","long":"116.7663923","lat":"-26.8270072"},
        {"name":"C133","dish_diameter":"38.0","long":"116.7671616","lat":"-26.82270324"},
        {"name":"C134","dish_diameter":"38.0","long":"116.765508","lat":"-26.82189009"},
        {"name":"C135","dish_diameter":"38.0","long":"116.7612425","lat":"-26.82512591"},
        {"name":"C136","dish_diameter":"38.0","long":"116.7679584","lat":"-26.82542389"},
        {"name":"C137","dish_diameter":"38.0","long":"116.7623744","lat":"-26.82276627"},
        {"name":"C138","dish_diameter":"38.0","long":"116.7647477","lat":"-26.82150613"},
        {"name":"C139","dish_diameter":"38.0","long":"116.7629329","lat":"-26.82224217"},
        {"name":"C140","dish_diameter":"38.0","long":"116.7619678","lat":"-26.82606404"},
        {"name":"C141","dish_diameter":"38.0","long":"116.7671585","lat":"-26.82679451"},
        {"name":"C142","dish_diameter":"38.0","long":"116.7641917","lat":"-26.8270878"},
        {"name":"C143","dish_diameter":"38.0","long":"116.7664594","lat":"-26.82740272"},
        {"name":"C144","dish_diameter":"38.0","long":"116.7678476","lat":"-26.8243953"},
        {"name":"C145","dish_diameter":"38.0","long":"116.7669699","lat":"-26.82607547"},
        {"name":"C146","dish_diameter":"38.0","long":"116.766436","lat":"-26.82262021"},
        {"name":"C147","dish_diameter":"38.0","long":"116.7673229","lat":"-26.82462112"},
        {"name":"C148","dish_diameter":"38.0","long":"116.7644016","lat":"-26.82236807"},
        {"name":"C149","dish_diameter":"38.0","long":"116.7667954","lat":"-26.82239417"},
        {"name":"C150","dish_diameter":"38.0","long":"116.7668133","lat":"-26.82360229"},
        {"name":"C151","dish_diameter":"38.0","long":"116.7608894","lat":"-26.82448039"},
        {"name":"C152","dish_diameter":"38.0","long":"116.7607716","lat":"-26.82561331"},
        {"name":"C153","dish_diameter":"38.0","long":"116.7692364","lat":"-26.82537137"},
        {"name":"C154","dish_diameter":"38.0","long":"116.7600421","lat":"-26.82595094"},
        {"name":"C155","dish_diameter":"38.0","long":"116.7651479","lat":"-26.82064086"},
        {"name":"C156","dish_diameter":"38.0","long":"116.7654471","lat":"-26.82851033"},
        {"name":"C157","dish_diameter":"38.0","long":"116.7625149","lat":"-26.82829217"},
        {"name":"C158","dish_diameter":"38.0","long":"116.7639783","lat":"-26.82837847"},
        {"name":"C159","dish_diameter":"38.0","long":"116.7689187","lat":"-26.82619805"},
        {"name":"C160","dish_diameter":"38.0","long":"116.7605068","lat":"-26.82665012"},
        {"name":"C161","dish_diameter":"38.0","long":"116.7639655","lat":"-26.82042956"},
        {"name":"C162","dish_diameter":"38.0","long":"116.761501","lat":"-26.82242644"},
        {"name":"C163","dish_diameter":"38.0","long":"116.7681193","lat":"-26.8270427"},
        {"name":"C164","dish_diameter":"38.0","long":"116.7668498","lat":"-26.82813455"},
        {"name":"C165","dish_diameter":"38.0","long":"116.7692076","lat":"-26.82456854"},
        {"name":"C166","dish_diameter":"38.0","long":"116.7654685","lat":"-26.82093801"},
        {"name":"C167","dish_diameter":"38.0","long":"116.7661431","lat":"-26.82772179"},
        {"name":"C168","dish_diameter":"38.0","long":"116.7606019","lat":"-26.82358528"},
        {"name":"C169","dish_diameter":"38.0","long":"116.7682525","lat":"-26.8260924"},
        {"name":"C170","dish_diameter":"38.0","long":"116.7604633","lat":"-26.82318797"},
        {"name":"C171","dish_diameter":"38.0","long":"116.7664471","lat":"-26.82799092"},
        {"name":"C172","dish_diameter":"38.0","long":"116.7660165","lat":"-26.82819704"},
        {"name":"C173","dish_diameter":"38.0","long":"116.7645728","lat":"-26.82905447"},
        {"name":"C174","dish_diameter":"38.0","long":"116.7675314","lat":"-26.8272293"},
        {"name":"C175","dish_diameter":"38.0","long":"116.7624586","lat":"-26.82102651"},
        {"name":"C176","dish_diameter":"38.0","long":"116.7608847","lat":"-26.82265242"},
        {"name":"C177","dish_diameter":"38.0","long":"116.7632865","lat":"-26.82846085"},
        {"name":"C178","dish_diameter":"38.0","long":"116.7607345","lat":"-26.8248991"},
        {"name":"C179","dish_diameter":"38.0","long":"116.7644769","lat":"-26.82087515"},
        {"name":"C180","dish_diameter":"38.0","long":"116.7681685","lat":"-26.82336898"},
        {"name":"C181","dish_diameter":"38.0","long":"116.7682301","lat":"-26.82405862"},
        {"name":"C182","dish_diameter":"38.0","long":"116.7609424","lat":"-26.82325877"},
        {"name":"C183","dish_diameter":"38.0","long":"116.7671094","lat":"-26.82110426"},
        {"name":"C184","dish_diameter":"38.0","long":"116.7620155","lat":"-26.82838396"},
        {"name":"C185","dish_diameter":"38.0","long":"116.7615141","lat":"-26.82714452"},
        {"name":"C186","dish_diameter":"38.0","long":"116.7606783","lat":"-26.8240858"},
        {"name":"C187","dish_diameter":"38.0","long":"116.7683888","lat":"-26.82562745"},
        {"name":"C188","dish_diameter":"38.0","long":"116.7687784","lat":"-26.82469982"},
        {"name":"C189","dish_diameter":"38.0","long":"116.7685574","lat":"-26.82320781"},
        {"name":"C190","dish_diameter":"38.0","long":"116.7690802","lat":"-26.82405775"},
        {"name":"C191","dish_diameter":"38.0","long":"116.7649354","lat":"-26.82816363"},
        {"name":"C192","dish_diameter":"38.0","long":"116.7610519","lat":"-26.82753365"},
        {"name":"C193","dish_diameter":"38.0","long":"116.7636056","lat":"-26.82064889"},
        {"name":"C194","dish_diameter":"38.0","long":"116.7619803","lat":"-26.82774132"},
        {"name":"C195","dish_diameter":"38.0","long":"116.766841","lat":"-26.82140473"},
        {"name":"C196","dish_diameter":"38.0","long":"116.7674363","lat":"-26.82199447"},
        {"name":"C197","dish_diameter":"38.0","long":"116.764553","lat":"-26.82798426"},
        {"name":"C198","dish_diameter":"38.0","long":"116.7687968","lat":"-26.82531354"},
        {"name":"C199","dish_diameter":"38.0","long":"116.7605767","lat":"-26.8222711"},
        {"name":"C200","dish_diameter":"38.0","long":"116.7673223","lat":"-26.82536054"},
        {"name":"C201","dish_diameter":"38.0","long":"116.7632579","lat":"-26.82895034"},
        {"name":"C202","dish_diameter":"38.0","long":"116.7636043","lat":"-26.82802598"},
        {"name":"C203","dish_diameter":"38.0","long":"116.7597497","lat":"-26.82468815"},
        {"name":"C204","dish_diameter":"38.0","long":"116.7654134","lat":"-26.82890858"},
        {"name":"C205","dish_diameter":"38.0","long":"116.7603687","lat":"-26.82456628"},
        {"name":"C206","dish_diameter":"38.0","long":"116.7655075","lat":"-26.82811287"},
        {"name":"C207","dish_diameter":"38.0","long":"116.7661761","lat":"-26.82039503"},
        {"name":"C208","dish_diameter":"38.0","long":"116.7657018","lat":"-26.82024789"},
        {"name":"C209","dish_diameter":"38.0","long":"116.766237","lat":"-26.82094143"},
        {"name":"C210","dish_diameter":"38.0","long":"116.7658355","lat":"-26.82114907"},
        {"name":"C211","dish_diameter":"38.0","long":"116.7658448","lat":"-26.82066269"},
        {"name":"C212","dish_diameter":"38.0","long":"116.7665811","lat":"-26.82070712"},
        {"name":"C213","dish_diameter":"38.0","long":"116.7594637","lat":"-26.82551953"},
        {"name":"C214","dish_diameter":"38.0","long":"116.760274","lat":"-26.82553978"},
        {"name":"C215","dish_diameter":"38.0","long":"116.7595995","lat":"-26.82505079"},
        {"name":"C216","dish_diameter":"38.0","long":"116.7594015","lat":"-26.82601535"},
        {"name":"C217","dish_diameter":"38.0","long":"116.7590858","lat":"-26.82572952"},
        {"name":"C218","dish_diameter":"38.0","long":"116.7599512","lat":"-26.82528522"},
        {"name":"C219","dish_diameter":"38.0","long":"116.7681085","lat":"-26.82825993"},
        {"name":"C220","dish_diameter":"38.0","long":"116.7676835","lat":"-26.82804688"},
        {"name":"C221","dish_diameter":"38.0","long":"116.7677415","lat":"-26.82757413"},
        {"name":"C222","dish_diameter":"38.0","long":"116.7673268","lat":"-26.82826665"},
        {"name":"C223","dish_diameter":"38.0","long":"116.7680546","lat":"-26.82782895"},
        {"name":"C224","dish_diameter":"38.0","long":"116.7672243","lat":"-26.82788292"},
        {"name":"E1-1","dish_diameter":"38.0","long":"116.7625261","lat":"-26.81952776"},
        {"name":"E1-2","dish_diameter":"38.0","long":"116.7620794","lat":"-26.81930029"},
        {"name":"E1-3","dish_diameter":"38.0","long":"116.7624951","lat":"-26.81905514"},
        {"name":"E1-4","dish_diameter":"38.0","long":"116.7618026","lat":"-26.81901179"},
        {"name":"E1-5","dish_diameter":"38.0","long":"116.7627876","lat":"-26.81875596"},
        {"name":"E1-6","dish_diameter":"38.0","long":"116.7621226","lat":"-26.81844456"},
        {"name":"E2-1","dish_diameter":"38.0","long":"116.7566003","lat":"-26.82053684"},
        {"name":"E2-2","dish_diameter":"38.0","long":"116.7560973","lat":"-26.82018844"},
        {"name":"E2-3","dish_diameter":"38.0","long":"116.7573922","lat":"-26.82004696"},
        {"name":"E2-4","dish_diameter":"38.0","long":"116.7567192","lat":"-26.82003458"},
        {"name":"E2-5","dish_diameter":"38.0","long":"116.756218","lat":"-26.81971943"},
        {"name":"E2-6","dish_diameter":"38.0","long":"116.7570381","lat":"-26.8196713"},
        {"name":"E3-1","dish_diameter":"38.0","long":"116.7513873","lat":"-26.82591579"},
        {"name":"E3-2","dish_diameter":"38.0","long":"116.7518352","lat":"-26.82586032"},
        {"name":"E3-3","dish_diameter":"38.0","long":"116.7508947","lat":"-26.82556447"},
        {"name":"E3-4","dish_diameter":"38.0","long":"116.7517473","lat":"-26.82542676"},
        {"name":"E3-5","dish_diameter":"38.0","long":"116.7513125","lat":"-26.82537768"},
        {"name":"E3-6","dish_diameter":"38.0","long":"116.7514347","lat":"-26.82501364"},
        {"name":"E4-1","dish_diameter":"38.0","long":"116.7502748","lat":"-26.83568632"},
        {"name":"E4-2","dish_diameter":"38.0","long":"116.7507354","lat":"-26.83559327"},
        {"name":"E4-3","dish_diameter":"38.0","long":"116.7507847","lat":"-26.83516747"},
        {"name":"E4-4","dish_diameter":"38.0","long":"116.7512427","lat":"-26.83508705"},
        {"name":"E4-5","dish_diameter":"38.0","long":"116.7501241","lat":"-26.83498443"},
        {"name":"E4-6","dish_diameter":"38.0","long":"116.7504918","lat":"-26.83456517"},
        {"name":"N1-1","dish_diameter":"38.0","long":"116.7595356","lat":"-26.82962242"},
        {"name":"N1-2","dish_diameter":"38.0","long":"116.7601502","lat":"-26.82962948"},
        {"name":"N1-3","dish_diameter":"38.0","long":"116.7605723","lat":"-26.82951217"},
        {"name":"N1-4","dish_diameter":"38.0","long":"116.7599187","lat":"-26.82929855"},
        {"name":"N1-5","dish_diameter":"38.0","long":"116.7603288","lat":"-26.82919347"},
        {"name":"N1-6","dish_diameter":"38.0","long":"116.7596437","lat":"-26.82883354"},
        {"name":"N2-1","dish_diameter":"38.0","long":"116.7641701","lat":"-26.83344736"},
        {"name":"N2-2","dish_diameter":"38.0","long":"116.7632695","lat":"-26.83347343"},
        {"name":"N2-3","dish_diameter":"38.0","long":"116.7636782","lat":"-26.83328188"},
        {"name":"N2-4","dish_diameter":"38.0","long":"116.7632762","lat":"-26.83307677"},
        {"name":"N2-5","dish_diameter":"38.0","long":"116.7641625","lat":"-26.83292457"},
        {"name":"N2-6","dish_diameter":"38.0","long":"116.7636377","lat":"-26.83279788"},
        {"name":"N3-1","dish_diameter":"38.0","long":"116.7720754","lat":"-26.83480946"},
        {"name":"N3-2","dish_diameter":"38.0","long":"116.7715931","lat":"-26.83483985"},
        {"name":"N3-3","dish_diameter":"38.0","long":"116.7711255","lat":"-26.83460356"},
        {"name":"N3-4","dish_diameter":"38.0","long":"116.7718038","lat":"-26.83447496"},
        {"name":"N3-5","dish_diameter":"38.0","long":"116.7712286","lat":"-26.83416072"},
        {"name":"N3-6","dish_diameter":"38.0","long":"116.771844","lat":"-26.83395206"},
        {"name":"N4-1","dish_diameter":"38.0","long":"116.781446","lat":"-26.83086504"},
        {"name":"N4-2","dish_diameter":"38.0","long":"116.7811156","lat":"-26.83053929"},
        {"name":"N4-3","dish_diameter":"38.0","long":"116.7816837","lat":"-26.83043171"},
        {"name":"N4-4","dish_diameter":"38.0","long":"116.7809077","lat":"-26.83014305"},
        {"name":"N4-5","dish_diameter":"38.0","long":"116.781665","lat":"-26.83002671"},
        {"name":"N4-6","dish_diameter":"38.0","long":"116.7812162","lat":"-26.82970967"},
        {"name":"S1-1","dish_diameter":"38.0","long":"116.7711639","lat":"-26.82639231"},
        {"name":"S1-2","dish_diameter":"38.0","long":"116.7707807","lat":"-26.82608862"},
        {"name":"S1-3","dish_diameter":"38.0","long":"116.7703495","lat":"-26.82601759"},
        {"name":"S1-4","dish_diameter":"38.0","long":"116.7711987","lat":"-26.82599425"},
        {"name":"S1-5","dish_diameter":"38.0","long":"116.7709057","lat":"-26.82555559"},
        {"name":"S1-6","dish_diameter":"38.0","long":"116.771346","lat":"-26.82547128"},
        {"name":"S2-1","dish_diameter":"38.0","long":"116.7731736","lat":"-26.82149082"},
        {"name":"S2-2","dish_diameter":"38.0","long":"116.7724311","lat":"-26.82139639"},
        {"name":"S2-3","dish_diameter":"38.0","long":"116.7728668","lat":"-26.82119927"},
        {"name":"S2-4","dish_diameter":"38.0","long":"116.7722088","lat":"-26.82092698"},
        {"name":"S2-5","dish_diameter":"38.0","long":"116.7732602","lat":"-26.82083391"},
        {"name":"S2-6","dish_diameter":"38.0","long":"116.7729181","lat":"-26.82051935"},
        {"name":"S3-1","dish_diameter":"38.0","long":"116.77076","lat":"-26.81477548"},
        {"name":"S3-2","dish_diameter":"38.0","long":"116.7703685","lat":"-26.81432947"},
        {"name":"S3-3","dish_diameter":"38.0","long":"116.7697476","lat":"-26.81424456"},
        {"name":"S3-4","dish_diameter":"38.0","long":"116.7709254","lat":"-26.814188"},
        {"name":"S3-5","dish_diameter":"38.0","long":"116.7699664","lat":"-26.81388139"},
        {"name":"S3-6","dish_diameter":"38.0","long":"116.7704816","lat":"-26.81377524"},
        {"name":"S4-1","dish_diameter":"38.0","long":"116.7614959","lat":"-26.80923605"},
        {"name":"S4-2","dish_diameter":"38.0","long":"116.7608951","lat":"-26.80915608"},
        {"name":"S4-3","dish_diameter":"38.0","long":"116.7618391","lat":"-26.8089547"},
        {"name":"S4-4","dish_diameter":"38.0","long":"116.7612917","lat":"-26.80875042"},
        {"name":"S4-5","dish_diameter":"38.0","long":"116.7615203","lat":"-26.80841398"},
        {"name":"S4-6","dish_diameter":"38.0","long":"116.7608759","lat":"-26.8083982"},
        {"name":"E5-1","dish_diameter":"38.0","long":"116.7587332","lat":"-26.84401939"},
        {"name":"E5-2","dish_diameter":"38.0","long":"116.759376","lat":"-26.8436945"},
        {"name":"E5-3","dish_diameter":"38.0","long":"116.7586957","lat":"-26.84362852"},
        {"name":"E5-4","dish_diameter":"38.0","long":"116.7582087","lat":"-26.84349207"},
        {"name":"E5-5","dish_diameter":"38.0","long":"116.7590992","lat":"-26.8432515"},
        {"name":"E5-6","dish_diameter":"38.0","long":"116.7587641","lat":"-26.84290085"},
        {"name":"E6-1","dish_diameter":"38.0","long":"116.7717757","lat":"-26.84982055"},
        {"name":"E6-2","dish_diameter":"38.0","long":"116.7722389","lat":"-26.8496678"},
        {"name":"E6-3","dish_diameter":"38.0","long":"116.7716965","lat":"-26.8492485"},
        {"name":"E6-4","dish_diameter":"38.0","long":"116.7723869","lat":"-26.84913478"},
        {"name":"E6-5","dish_diameter":"38.0","long":"116.7712392","lat":"-26.84905221"},
        {"name":"E6-6","dish_diameter":"38.0","long":"116.7721156","lat":"-26.84880062"},
        {"name":"E7-1","dish_diameter":"38.0","long":"116.7906546","lat":"-26.84871873"},
        {"name":"E7-2","dish_diameter":"38.0","long":"116.790986","lat":"-26.84845273"},
        {"name":"E7-3","dish_diameter":"38.0","long":"116.7902597","lat":"-26.84850524"},
        {"name":"E7-4","dish_diameter":"38.0","long":"116.7914326","lat":"-26.84840339"},
        {"name":"E7-5","dish_diameter":"38.0","long":"116.7906374","lat":"-26.84802562"},
        {"name":"E7-6","dish_diameter":"38.0","long":"116.7910356","lat":"-26.84784293"},
        {"name":"E8-1","dish_diameter":"38.0","long":"116.8116834","lat":"-26.8363875"},
        {"name":"E8-2","dish_diameter":"38.0","long":"116.8122839","lat":"-26.83617762"},
        {"name":"E8-3","dish_diameter":"38.0","long":"116.8111791","lat":"-26.83610053"},
        {"name":"E8-4","dish_diameter":"38.0","long":"116.8121435","lat":"-26.83575102"},
        {"name":"E8-5","dish_diameter":"38.0","long":"116.8116868","lat":"-26.8357064"},
        {"name":"E8-6","dish_diameter":"38.0","long":"116.8111292","lat":"-26.83563369"},
        {"name":"E9-1","dish_diameter":"38.0","long":"116.8260794","lat":"-26.81029044"},
        {"name":"E9-2","dish_diameter":"38.0","long":"116.8265037","lat":"-26.80997174"},
        {"name":"E9-3","dish_diameter":"38.0","long":"116.8260445","lat":"-26.80978806"},
        {"name":"E9-4","dish_diameter":"38.0","long":"116.8268785","lat":"-26.80962354"},
        {"name":"E9-5","dish_diameter":"38.0","long":"116.8264983","lat":"-26.80940216"},
        {"name":"E9-6","dish_diameter":"38.0","long":"116.8259655","lat":"-26.80940069"},
        {"name":"S5-1","dish_diameter":"38.0","long":"116.7491197","lat":"-26.81159811"},
        {"name":"S5-2","dish_diameter":"38.0","long":"116.7490368","lat":"-26.81110948"},
        {"name":"S5-3","dish_diameter":"38.0","long":"116.7497598","lat":"-26.81089879"},
        {"name":"S5-4","dish_diameter":"38.0","long":"116.7485873","lat":"-26.81085966"},
        {"name":"S5-5","dish_diameter":"38.0","long":"116.7493085","lat":"-26.81079441"},
        {"name":"S5-6","dish_diameter":"38.0","long":"116.7488285","lat":"-26.81053563"},
        {"name":"S6-1","dish_diameter":"38.0","long":"116.73692","lat":"-26.81854892"},
        {"name":"S6-2","dish_diameter":"38.0","long":"116.7375215","lat":"-26.81855792"},
        {"name":"S6-3","dish_diameter":"38.0","long":"116.7372221","lat":"-26.81827563"},
        {"name":"S6-4","dish_diameter":"38.0","long":"116.7377136","lat":"-26.81797591"},
        {"name":"S6-5","dish_diameter":"38.0","long":"116.7367364","lat":"-26.81794295"},
        {"name":"S6-6","dish_diameter":"38.0","long":"116.7372712","lat":"-26.81776037"},
        {"name":"S7-1","dish_diameter":"38.0","long":"116.7286679","lat":"-26.83380303"},
        {"name":"S7-2","dish_diameter":"38.0","long":"116.7281283","lat":"-26.83349757"},
        {"name":"S7-3","dish_diameter":"38.0","long":"116.729078","lat":"-26.83343106"},
        {"name":"S7-4","dish_diameter":"38.0","long":"116.7286717","lat":"-26.83319401"},
        {"name":"S7-5","dish_diameter":"38.0","long":"116.7289506","lat":"-26.83288224"},
        {"name":"S7-6","dish_diameter":"38.0","long":"116.7281976","lat":"-26.83282001"},
        {"name":"S8-1","dish_diameter":"38.0","long":"116.7296391","lat":"-26.85615287"},
        {"name":"S8-2","dish_diameter":"38.0","long":"116.730078","lat":"-26.85612864"},
        {"name":"S8-3","dish_diameter":"38.0","long":"116.7305024","lat":"-26.85578957"},
        {"name":"S8-4","dish_diameter":"38.0","long":"116.7301177","lat":"-26.85558085"},
        {"name":"S8-5","dish_diameter":"38.0","long":"116.7296813","lat":"-26.8554553"},
        {"name":"S8-6","dish_diameter":"38.0","long":"116.7300235","lat":"-26.85510865"},
        {"name":"S9-1","dish_diameter":"38.0","long":"116.7478854","lat":"-26.8808053"},
        {"name":"S9-2","dish_diameter":"38.0","long":"116.7473328","lat":"-26.88062234"},
        {"name":"S9-3","dish_diameter":"38.0","long":"116.7478724","lat":"-26.88035103"},
        {"name":"S9-4","dish_diameter":"38.0","long":"116.7472298","lat":"-26.88021481"},
        {"name":"S9-5","dish_diameter":"38.0","long":"116.748383","lat":"-26.87997965"},
        {"name":"S9-6","dish_diameter":"38.0","long":"116.7474901","lat":"-26.87988287"},
        {"name":"N5-1","dish_diameter":"38.0","long":"116.7850701","lat":"-26.82021175"},
        {"name":"N5-2","dish_diameter":"38.0","long":"116.7855589","lat":"-26.82011614"},
        {"name":"N5-3","dish_diameter":"38.0","long":"116.7848147","lat":"-26.81985677"},
        {"name":"N5-4","dish_diameter":"38.0","long":"116.7852764","lat":"-26.81971222"},
        {"name":"N5-5","dish_diameter":"38.0","long":"116.7858608","lat":"-26.81948934"},
        {"name":"N5-6","dish_diameter":"38.0","long":"116.7852128","lat":"-26.81933239"},
        {"name":"N6-1","dish_diameter":"38.0","long":"116.7842792","lat":"-26.80715788"},
        {"name":"N6-2","dish_diameter":"38.0","long":"116.7849519","lat":"-26.80713499"},
        {"name":"N6-3","dish_diameter":"38.0","long":"116.7845245","lat":"-26.80678071"},
        {"name":"N6-4","dish_diameter":"38.0","long":"116.7840824","lat":"-26.80675186"},
        {"name":"N6-5","dish_diameter":"38.0","long":"116.7849826","lat":"-26.8067082"},
        {"name":"N6-6","dish_diameter":"38.0","long":"116.7846095","lat":"-26.80630588"},
        {"name":"N7-1","dish_diameter":"38.0","long":"116.7739387","lat":"-26.79290899"},
        {"name":"N7-2","dish_diameter":"38.0","long":"116.7735055","lat":"-26.79272863"},
        {"name":"N7-3","dish_diameter":"38.0","long":"116.7744173","lat":"-26.792805"},
        {"name":"N7-4","dish_diameter":"38.0","long":"116.7746589","lat":"-26.79247024"},
        {"name":"N7-5","dish_diameter":"38.0","long":"116.7742302","lat":"-26.7923251"},
        {"name":"N7-6","dish_diameter":"38.0","long":"116.7738206","lat":"-26.79219491"},
        {"name":"N8-1","dish_diameter":"38.0","long":"116.7515125","lat":"-26.78297562"},
        {"name":"N8-2","dish_diameter":"38.0","long":"116.7523517","lat":"-26.78266863"},
        {"name":"N8-3","dish_diameter":"38.0","long":"116.7512876","lat":"-26.7826094"},
        {"name":"N8-4","dish_diameter":"38.0","long":"116.7517838","lat":"-26.78244879"},
        {"name":"N8-5","dish_diameter":"38.0","long":"116.7513973","lat":"-26.78223124"},
        {"name":"N8-6","dish_diameter":"38.0","long":"116.7521219","lat":"-26.78209762"},
        {"name":"N9-1","dish_diameter":"38.0","long":"116.7193762","lat":"-26.78456979"},
        {"name":"N9-2","dish_diameter":"38.0","long":"116.7196822","lat":"-26.7842639"},
        {"name":"N9-3","dish_diameter":"38.0","long":"116.7187744","lat":"-26.78420328"},
        {"name":"N9-4","dish_diameter":"38.0","long":"116.719252","lat":"-26.78408796"},
        {"name":"N9-5","dish_diameter":"38.0","long":"116.7195239","lat":"-26.78371643"},
        {"name":"N9-6","dish_diameter":"38.0","long":"116.7188988","lat":"-26.78368162"},
        {"name":"E10-1","dish_diameter":"38.0","long":"116.8347251","lat":"-26.86183361"},
        {"name":"E10-2","dish_diameter":"38.0","long":"116.8342804","lat":"-26.86164365"},
        {"name":"E10-3","dish_diameter":"38.0","long":"116.8353822","lat":"-26.86159443"},
        {"name":"E10-4","dish_diameter":"38.0","long":"116.8347547","lat":"-26.86125446"},
        {"name":"E10-5","dish_diameter":"38.0","long":"116.8344166","lat":"-26.86090372"},
        {"name":"E10-6","dish_diameter":"38.0","long":"116.8352498","lat":"-26.86085453"},
        {"name":"E11-1","dish_diameter":"38.0","long":"116.8641741","lat":"-26.85884989"},
        {"name":"E11-2","dish_diameter":"38.0","long":"116.8635502","lat":"-26.85875772"},
        {"name":"E11-3","dish_diameter":"38.0","long":"116.8638135","lat":"-26.85834267"},
        {"name":"E11-4","dish_diameter":"38.0","long":"116.8646915","lat":"-26.85828286"},
        {"name":"E11-5","dish_diameter":"38.0","long":"116.8635763","lat":"-26.85801337"},
        {"name":"E11-6","dish_diameter":"38.0","long":"116.8643413","lat":"-26.85791961"},
        {"name":"E12-1","dish_diameter":"38.0","long":"116.859808","lat":"-26.912269"},
        {"name":"E12-2","dish_diameter":"38.0","long":"116.859315","lat":"-26.911944"},
        {"name":"E12-3","dish_diameter":"38.0","long":"116.85867","lat":"-26.91188"},
        {"name":"E12-4","dish_diameter":"38.0","long":"116.859718","lat":"-26.911682"},
        {"name":"E12-5","dish_diameter":"38.0","long":"116.859275","lat":"-26.911501"},
        {"name":"E12-6","dish_diameter":"38.0","long":"116.858812","lat":"-26.911492"},
        {"name":"E13-1","dish_diameter":"38.0","long":"116.938951","lat":"-26.812287"},
        {"name":"E13-2","dish_diameter":"38.0","long":"116.938015","lat":"-26.812259"},
        {"name":"E13-3","dish_diameter":"38.0","long":"116.938519","lat":"-26.812151"},
        {"name":"E13-4","dish_diameter":"38.0","long":"116.938036","lat":"-26.811853"},
        {"name":"E13-5","dish_diameter":"38.0","long":"116.93879","lat":"-26.811808"},
        {"name":"E13-6","dish_diameter":"38.0","long":"116.938448","lat":"-26.811582"},
        {"name":"E14-1","dish_diameter":"38.0","long":"116.99324","lat":"-26.786008"},
        {"name":"E14-2","dish_diameter":"38.0","long":"116.992616","lat":"-26.785601"},
        {"name":"E14-3","dish_diameter":"38.0","long":"116.9931387","lat":"-26.78554465"},
        {"name":"E14-4","dish_diameter":"38.0","long":"116.9937595","lat":"-26.7854562"},
        {"name":"E14-5","dish_diameter":"38.0","long":"116.992888","lat":"-26.785042"},
        {"name":"E14-6","dish_diameter":"38.0","long":"116.993572","lat":"-26.785069"},
        {"name":"E15-1","dish_diameter":"38.0","long":"117.048006","lat":"-26.892787"},
        {"name":"E15-2","dish_diameter":"38.0","long":"117.047198","lat":"-26.89252"},
        {"name":"E15-3","dish_diameter":"38.0","long":"117.0484499","lat":"-26.8923462"},
        {"name":"E15-4","dish_diameter":"38.0","long":"117.047718","lat":"-26.892112"},
        {"name":"E15-5","dish_diameter":"38.0","long":"117.04816","lat":"-26.892051"},
        {"name":"E15-6","dish_diameter":"38.0","long":"117.04722","lat":"-26.892046"},
        {"name":"E16-1","dish_diameter":"38.0","long":"117.195237","lat":"-26.952418"},
        {"name":"E16-2","dish_diameter":"38.0","long":"117.194734","lat":"-26.952237"},
        {"name":"E16-3","dish_diameter":"38.0","long":"117.195934","lat":"-26.952145"},
        {"name":"E16-4","dish_diameter":"38.0","long":"117.19497","lat":"-26.951879"},
        {"name":"E16-5","dish_diameter":"38.0","long":"117.195414","lat":"-26.951769"},
        {"name":"E16-6","dish_diameter":"38.0","long":"117.194981","lat":"-26.9515"},
        {"name":"S10-1","dish_diameter":"38.0","long":"116.6934539","lat":"-26.86371635"},
        {"name":"S10-2","dish_diameter":"38.0","long":"116.6936577","lat":"-26.86334071"},
        {"name":"S10-3","dish_diameter":"38.0","long":"116.6941076","lat":"-26.86330526"},
        {"name":"S10-4","dish_diameter":"38.0","long":"116.6932834","lat":"-26.86313582"},
        {"name":"S10-5","dish_diameter":"38.0","long":"116.6937212","lat":"-26.86282395"},
        {"name":"S10-6","dish_diameter":"38.0","long":"116.6931586","lat":"-26.8627504"},
        {"name":"S11-1","dish_diameter":"38.0","long":"116.6668417","lat":"-26.89938694"},
        {"name":"S11-2","dish_diameter":"38.0","long":"116.6672736","lat":"-26.89936111"},
        {"name":"S11-3","dish_diameter":"38.0","long":"116.6674997","lat":"-26.89901461"},
        {"name":"S11-4","dish_diameter":"38.0","long":"116.6661623","lat":"-26.89899702"},
        {"name":"S11-5","dish_diameter":"38.0","long":"116.6667498","lat":"-26.89886359"},
        {"name":"S11-6","dish_diameter":"38.0","long":"116.6667135","lat":"-26.89847171"},
        {"name":"S12-1","dish_diameter":"38.0","long":"116.6218641","lat":"-26.86556325"},
        {"name":"S12-2","dish_diameter":"38.0","long":"116.6212672","lat":"-26.86540474"},
        {"name":"S12-3","dish_diameter":"38.0","long":"116.6208315","lat":"-26.86525589"},
        {"name":"S12-4","dish_diameter":"38.0","long":"116.621577","lat":"-26.86514205"},
        {"name":"S12-5","dish_diameter":"38.0","long":"116.6213033","lat":"-26.86477991"},
        {"name":"S12-6","dish_diameter":"38.0","long":"116.6217451","lat":"-26.86464267"},
        {"name":"S13-1","dish_diameter":"38.0","long":"116.6546716","lat":"-26.94988049"},
        {"name":"S13-2","dish_diameter":"38.0","long":"116.6542507","lat":"-26.94979962"},
        {"name":"S13-3","dish_diameter":"38.0","long":"116.6546675","lat":"-26.94946601"},
        {"name":"S13-4","dish_diameter":"38.0","long":"116.6540217","lat":"-26.94930676"},
        {"name":"S13-5","dish_diameter":"38.0","long":"116.6550571","lat":"-26.94915419"},
        {"name":"S13-6","dish_diameter":"38.0","long":"116.6543997","lat":"-26.94911832"},
        {"name":"S14-1","dish_diameter":"38.0","long":"116.697431","lat":"-27.012275"},
        {"name":"S14-2","dish_diameter":"38.0","long":"116.697121","lat":"-27.01197"},
        {"name":"S14-3","dish_diameter":"38.0","long":"116.697649","lat":"-27.011833"},
        {"name":"S14-4","dish_diameter":"38.0","long":"116.698069","lat":"-27.011711"},
        {"name":"S14-5","dish_diameter":"38.0","long":"116.697052","lat":"-27.011566"},
        {"name":"S14-6","dish_diameter":"38.0","long":"116.697623","lat":"-27.011219"},
        {"name":"S15-1","dish_diameter":"38.0","long":"116.506632","lat":"-26.94411666"},
        {"name":"S15-2","dish_diameter":"38.0","long":"116.5060747","lat":"-26.94380645"},
        {"name":"S15-3","dish_diameter":"38.0","long":"116.506623","lat":"-26.943714"},
        {"name":"S15-4","dish_diameter":"38.0","long":"116.507104","lat":"-26.943552"},
        {"name":"S15-5","dish_diameter":"38.0","long":"116.505984","lat":"-26.943421"},
        {"name":"S15-6","dish_diameter":"38.0","long":"116.506611","lat":"-26.943084"},
        {"name":"S16-1","dish_diameter":"38.0","long":"116.479592","lat":"-27.059862"},
        {"name":"S16-2","dish_diameter":"38.0","long":"116.479038","lat":"-27.059709"},
        {"name":"S16-3","dish_diameter":"38.0","long":"116.480041","lat":"-27.059609"},
        {"name":"S16-4","dish_diameter":"38.0","long":"116.4795606","lat":"-27.05934014"},
        {"name":"S16-5","dish_diameter":"38.0","long":"116.478883","lat":"-27.059346"},
        {"name":"S16-6","dish_diameter":"38.0","long":"116.4793215","lat":"-27.05902505"},
        {"name":"N10-1","dish_diameter":"38.0","long":"116.7629487","lat":"-26.75112622"},
        {"name":"N10-2","dish_diameter":"38.0","long":"116.7625229","lat":"-26.75106893"},
        {"name":"N10-3","dish_diameter":"38.0","long":"116.7621358","lat":"-26.75090194"},
        {"name":"N10-4","dish_diameter":"38.0","long":"116.7630151","lat":"-26.7506993"},
        {"name":"N10-5","dish_diameter":"38.0","long":"116.7626054","lat":"-26.75056332"},
        {"name":"N10-6","dish_diameter":"38.0","long":"116.7622832","lat":"-26.75027502"},
        {"name":"N11-1","dish_diameter":"38.0","long":"116.8051967","lat":"-26.72201945"},
        {"name":"N11-2","dish_diameter":"38.0","long":"116.8047651","lat":"-26.72187007"},
        {"name":"N11-3","dish_diameter":"38.0","long":"116.8052628","lat":"-26.72161184"},
        {"name":"N11-4","dish_diameter":"38.0","long":"116.8048594","lat":"-26.72148053"},
        {"name":"N11-5","dish_diameter":"38.0","long":"116.8056815","lat":"-26.72142646"},
        {"name":"N11-6","dish_diameter":"38.0","long":"116.8051466","lat":"-26.72100477"},
        {"name":"N12-1","dish_diameter":"38.0","long":"116.724607","lat":"-26.71304878"},
        {"name":"N12-2","dish_diameter":"38.0","long":"116.7255168","lat":"-26.71297531"},
        {"name":"N12-3","dish_diameter":"38.0","long":"116.7249974","lat":"-26.71277411"},
        {"name":"N12-4","dish_diameter":"38.0","long":"116.7254502","lat":"-26.71243527"},
        {"name":"N12-5","dish_diameter":"38.0","long":"116.724409","lat":"-26.7123979"},
        {"name":"N12-6","dish_diameter":"38.0","long":"116.7250247","lat":"-26.71235314"},
        {"name":"N13-1","dish_diameter":"38.0","long":"116.67295","lat":"-26.693202"},
        {"name":"N13-2","dish_diameter":"38.0","long":"116.673413","lat":"-26.693095"},
        {"name":"N13-3","dish_diameter":"38.0","long":"116.6727","lat":"-26.692894"},
        {"name":"N13-4","dish_diameter":"38.0","long":"116.6731813","lat":"-26.6926894"},
        {"name":"N13-5","dish_diameter":"38.0","long":"116.672731","lat":"-26.692434"},
        {"name":"N13-6","dish_diameter":"38.0","long":"116.673204","lat":"-26.692293"},
        {"name":"N14-1","dish_diameter":"38.0","long":"116.6257528","lat":"-26.66190169"},
        {"name":"N14-2","dish_diameter":"38.0","long":"116.626141","lat":"-26.66172"},
        {"name":"N14-3","dish_diameter":"38.0","long":"116.62581","lat":"-26.661394"},
        {"name":"N14-4","dish_diameter":"38.0","long":"116.625368","lat":"-26.661366"},
        {"name":"N14-5","dish_diameter":"38.0","long":"116.626083","lat":"-26.661034"},
        {"name":"N14-6","dish_diameter":"38.0","long":"116.62544","lat":"-26.660924"},
        {"name":"N15-1","dish_diameter":"38.0","long":"116.686259","lat":"-26.585334"},
        {"name":"N15-2","dish_diameter":"38.0","long":"116.686857","lat":"-26.58517"},
        {"name":"N15-3","dish_diameter":"38.0","long":"116.685887","lat":"-26.584934"},
        {"name":"N15-4","dish_diameter":"38.0","long":"116.6864223","lat":"-26.58497125"},
        {"name":"N15-5","dish_diameter":"38.0","long":"116.686721","lat":"-26.584688"},
        {"name":"N15-6","dish_diameter":"38.0","long":"116.685917","lat":"-26.584465"},
        {"name":"N16-1","dish_diameter":"38.0","long":"116.658422","lat":"-26.497939"},
        {"name":"N16-2","dish_diameter":"38.0","long":"116.659193","lat":"-26.497687"},
        {"name":"N16-3","dish_diameter":"38.0","long":"116.658546","lat":"-26.497486"},
        {"name":"N16-4","dish_diameter":"38.0","long":"116.659081","lat":"-26.497299"},
        {"name":"N16-5","dish_diameter":"38.0","long":"116.658137","lat":"-26.497241"},
        {"name":"N16-6","dish_diameter":"38.0","long":"116.658579","lat":"-26.497073"}
    ]
        },
        "static_rfi_mask":[
        {"description":"What is this?","freq_start":"0.0","freq_stop":"0.0"}
        ]
      },
      "ska1_mid":
      {
        "layout":
        {
          "description":"Telescope State Information (TSI) - SKA1-mid telescope configuration",
          "reference":"",
          "comment":"This configuration file is an example only. Not to be treated as the ground thruth.",
          "revision": "0",
          "telescope":"SKA1_Mid",
          "coordinates":"ITRF",
          "units": "meters",
          "antennas":[
          {"name":"xxx","dish_diameter":"0.0","long":"0.0","lat":"0.0"}
          ]
        }
      }
    }
  }
}
