{
  "interface": "https://schema.skao.int/ska-sdp-assignres/0.4",
  "resources": {
    "receptors": ["SKA001", "SKA036", "SKA063", "SKA100"],
    "receive_nodes": 1
  },

  "execution_block": {
    "eb_id": "eb-test-20210630-00000",
    "context": {},
    "max_length": 21600.0,

    "channels": [
      {
        "channels_id": "vis_channels",
        "spectral_windows": [
          {
            "spectral_window_id": "fsp_1_channels",
            "count": 8,
            "start": 0,
            "stride": 1,
            "freq_min": 1.2925e9,
            "freq_max": 1.4125e9,
            "link_map": [
              [0, 0],
              [200, 1],
              [744, 2],
              [944, 3]
            ]
          }
        ]
      }
    ],

    "polarisations": [
      {
        "polarisations_id": "all",
        "corr_type": ["XX", "XY", "YX", "YY"]
      }
    ],

    "fields": [
      {
        "field_id": "field_a",
        "phase_dir": {
          "ra": [2.711325],
          "dec": [-0.01328889],
          "reference_time": "...",
          "reference_frame": "ICRF3"
        },
        "pointing_fqdn": "low-tmc/telstate/0/pointing"
      },
      {
        "field_id": "field_b",
        "phase_dir": {
          "ra": [294.8629],
          "dec": [-63.44029],
          "reference_time": "...",
          "reference_frame": "ICRF3"
        },
        "pointing_fqdn": "low-tmc/telstate/0/pointing"
      }
    ],

    "beams": [
      {
        "beam_id": "vis0",
        "function": "visibilities"
      }
    ],

    "scan_types": [
      {
        "scan_type_id": ".default",
        "beams": {
          "vis0": {
            "polarisations_id": "all",
            "channels_id": "vis_channels"
          }
        }
      },
      {
        "scan_type_id": "science",
        "derive_from": ".default",
        "beams": {
          "vis0": { "field_id": "field_a" }
        }
      }
    ]
  },

  "processing_blocks": [
    {
      "pb_id": "pb-test-20211111-00000",
      "script": {
        "kind": "batch",
        "name": "spectral-line-imaging",
        "version": "0.2.0"
      },
      "parameters": {
        "msname": "MWA.ps",
        "skymodel_image": "test-model-%s-image.fits"
      },
      "dependencies": []
    }
  ]
}
