{
  "$defs": {
    "DaskParams": {
      "additionalProperties": false,
      "description": "Parameters to be passed to the dask helm chart",
      "properties": {
        "worker": {
          "$ref": "#/$defs/DaskWorkerParams",
          "description": "Dask worker parameters",
          "title": "worker"
        }
      },
      "title": "DaskParams",
      "type": "object"
    },
    "DaskWorkerParams": {
      "additionalProperties": false,
      "description": "Parameters for the dask worker",
      "properties": {
        "replicas": {
          "default": 2,
          "description": "Number of replicas of dask worker",
          "title": "Replicas",
          "type": "integer"
        },
        "resources": {
          "default": {},
          "description": "Resources available to dask worker",
          "title": "Resources",
          "type": "object"
        }
      },
      "title": "DaskWorkerParams",
      "type": "object"
    }
  },
  "additionalProperties": false,
  "description": "spectral line imaging pipeline script parameters",
  "properties": {
    "version": {
      "default": "0.6.1",
      "description": "Version of the spectral line imaging pipeline used by the helm chart for deployment",
      "pattern": "^[a-zA-Z0-9_\\.-]+$",
      "title": "Spectral line imaging pipeline Version",
      "type": "string"
    },
    "msname": {
      "description": "Name of the measurement set to be processed",
      "pattern": "^[a-zA-Z0-9_\\.-]+$",
      "title": "Measurement set name",
      "type": "string"
    },
    "image": {
      "default": "artefact.skao.int/ska-sdp-spectral-line-imaging",
      "description": "The OCI image used by the helm chart to launch the spectral line imaging pipeline",
      "pattern": "^[a-zA-Z0-9_:\\./-]+$",
      "title": "OCI image",
      "type": "string"
    },
    "imagePullPolicy": {
      "default": "IfNotPresent",
      "description": "Kubernetes image pull policy used by the helm chart (Always, IfNotPresent, Never)",
      "pattern": "^(Always|IfNotPresent|Never)$",
      "title": "Pull policy of the image",
      "type": "string"
    },
    "dask": {
      "$ref": "#/$defs/DaskParams",
      "description": "Arguments to the dask helm chart",
      "title": "Dask Helm chart arguments"
    },
    "skymodel_image": {
      "description": "Name of the continuum model image/cube (FITS)",
      "title": "Continuum model image",
      "type": "string"
    },
    "additional_args": {
      "default": [],
      "description": "Additional arguments to be passed to the spectral line imaging pipeline",
      "items": {
        "type": "string"
      },
      "title": "Additional arguments",
      "type": "array"
    }
  },
  "required": [
    "msname",
    "skymodel_image"
  ],
  "title": "spectral-line-imaging",
  "type": "object"
}