{
  "ANTENNA": [
    {
      "field": "name",
      "type": "string"
    },
    {
      "field": "mount",
      "type": "string"
    },
    {
      "field": "position",
      "type": "struct",
      "subfields": [
        {
          "field": "x",
          "type": "float64"
        },
        {
          "field": "y",
          "type": "float64"
        },
        {
          "field": "z",
          "type": "float64"
        }
      ]
    },
    {
      "field": "dish_diameter",
      "type": "float64"
    }
  ],
  "ANTENNA2": [
    {
      "field": "name",
      "type": "string"
    },
    {
      "field": "mount",
      "type": "string"
    },
    {
      "field": "xyz",
      "type": "list",
      "item": "float64",
      "size": 3
    },
    {
      "field": "dish_diameter",
      "type": "float64"
    }
  ],
  "BASELINE": [
    {
      "field": "antenna1",
      "type": "int32"
    },
    {
      "field": "antenna2",
      "type": "int32"
    }
  ],
  "CHANNELS": [
    {
      "field": "channels_id",
      "type": "string"
    }
  ],
  "FIELD": [
    {
      "field": "field_id",
      "type": "string"
    },
    {
      "field": "phase_dir",
      "type": "struct",
      "subfields": [
        {
          "field": "ra",
          "type": "list",
          "item": "float64"
        },
        {
          "field": "dec",
          "type": "list",
          "item": "float64"
        },
        {
          "field": "reference_time",
          "type": "string"
        },
        {
          "field": "reference_frame",
          "type": "string"
        }
      ]
    }
  ],
  "POLARIZATION": [
    {
      "field": "polarizations_id",
      "type": "string"
    },
    {
      "field": "corr_type",
      "type": "list",
      "item": "string"
    }
  ],
  "SPECTRAL_WINDOW": [
    {
      "field": "channels_id",
      "type": "string"
    },
    {
      "field": "spectral_window_id",
      "type": "string"
    },
    {
      "field": "count",
      "type": "int32"
    },
    {
      "field": "start",
      "type": "int32"
    },
    {
      "field": "stride",
      "type": "int32"
    },
    {
      "field": "freq_min",
      "type": "float64"
    },
    {
      "field": "freq_max",
      "type": "float64"
    }
  ],
  "BEAM": [
    {
      "field": "beam_id",
      "type": "string"
    },
    {
      "field": "field_id",
      "type": "string"
    },
    {
      "field": "channels_id",
      "type": "string"
    },
    {
      "field": "polarizations_id",
      "type": "string"
    },
    {
      "field": "function",
      "type": "string"
    }
  ]
}
