2022-05-11T08:28:41+02:00|reframe 3.10.0-dev.3|GpuDirectRdmaTest_latency_H_D on cscs-daint:daint-icc21-impi21-ib-umod-gpu using gpu-direct-rdma|jobid=38343046|1_RDMA_GDR_Copy_Enabled=0|us|ref=0 (l=null, u=null)|git=None,network_adapter=mlx5_0:1,H_D,num_nodes=2,ucx_tls=['rc', 'cuda_copy'],benchmark=latency,communication_type=H_D,latency
2022-05-11T08:28:41+02:00|reframe 3.10.0-dev.3|GpuDirectRdmaTest_latency_H_D on cscs-daint:daint-icc21-impi21-ib-umod-gpu using gpu-direct-rdma|jobid=38343046|1_RDMA_Enabled_GDR_Copy_Disabled=0|us|ref=0 (l=null, u=null)|git=None,network_adapter=mlx5_0:1,H_D,num_nodes=2,ucx_tls=['rc', 'cuda_copy'],benchmark=latency,communication_type=H_D,latency
2022-05-11T08:28:41+02:00|reframe 3.10.0-dev.3|GpuDirectRdmaTest_latency_H_D on cscs-daint:daint-icc21-impi21-ib-umod-gpu using gpu-direct-rdma|jobid=38343046|1_RDMA_Disabled_GDR_Copy_Enabled=0|us|ref=0 (l=null, u=null)|git=None,network_adapter=mlx5_0:1,H_D,num_nodes=2,ucx_tls=['rc', 'cuda_copy'],benchmark=latency,communication_type=H_D,latency
2022-05-11T08:28:41+02:00|reframe 3.10.0-dev.3|GpuDirectRdmaTest_latency_H_D on cscs-daint:daint-icc21-impi21-ib-umod-gpu using gpu-direct-rdma|jobid=38343046|1_RDMA_GDR_Copy_Disabled=0|us|ref=0 (l=null, u=null)|git=None,network_adapter=mlx5_0:1,H_D,num_nodes=2,ucx_tls=['rc', 'cuda_copy'],benchmark=latency,communication_type=H_D,latency
2022-05-11T08:28:41+02:00|reframe 3.10.0-dev.3|GpuDirectRdmaTest_latency_H_D on cscs-daint:daint-icc21-impi21-ib-umod-gpu using gpu-direct-rdma|jobid=38343046|2_RDMA_GDR_Copy_Enabled=0|us|ref=0 (l=null, u=null)|git=None,network_adapter=mlx5_0:1,H_D,num_nodes=2,ucx_tls=['rc', 'cuda_copy'],benchmark=latency,communication_type=H_D,latency
2022-05-11T08:28:41+02:00|reframe 3.10.0-dev.3|GpuDirectRdmaTest_latency_H_D on cscs-daint:daint-icc21-impi21-ib-umod-gpu using gpu-direct-rdma|jobid=38343046|4_RDMA_GDR_Copy_Enabled=0|us|ref=0 (l=null, u=null)|git=None,network_adapter=mlx5_0:1,H_D,num_nodes=2,ucx_tls=['rc', 'cuda_copy'],benchmark=latency,communication_type=H_D,latency
2022-05-11T08:28:41+02:00|reframe 3.10.0-dev.3|GpuDirectRdmaTest_latency_H_D on cscs-daint:daint-icc21-impi21-ib-umod-gpu using gpu-direct-rdma|jobid=38343046|8_RDMA_GDR_Copy_Enabled=0|us|ref=0 (l=null, u=null)|git=None,network_adapter=mlx5_0:1,H_D,num_nodes=2,ucx_tls=['rc', 'cuda_copy'],benchmark=latency,communication_type=H_D,latency
2022-05-11T08:28:41+02:00|reframe 3.10.0-dev.3|GpuDirectRdmaTest_latency_H_D on cscs-daint:daint-icc21-impi21-ib-umod-gpu using gpu-direct-rdma|jobid=38343046|16_RDMA_GDR_Copy_Enabled=0|us|ref=0 (l=null, u=null)|git=None,network_adapter=mlx5_0:1,H_D,num_nodes=2,ucx_tls=['rc', 'cuda_copy'],benchmark=latency,communication_type=H_D,latency
2022-05-11T08:28:41+02:00|reframe 3.10.0-dev.3|GpuDirectRdmaTest_latency_H_D on cscs-daint:daint-icc21-impi21-ib-umod-gpu using gpu-direct-rdma|jobid=38343046|32_RDMA_GDR_Copy_Enabled=0|us|ref=0 (l=null, u=null)|git=None,network_adapter=mlx5_0:1,H_D,num_nodes=2,ucx_tls=['rc', 'cuda_copy'],benchmark=latency,communication_type=H_D,latency
2022-05-11T08:28:41+02:00|reframe 3.10.0-dev.3|GpuDirectRdmaTest_latency_H_D on cscs-daint:daint-icc21-impi21-ib-umod-gpu using gpu-direct-rdma|jobid=38343046|64_RDMA_GDR_Copy_Enabled=0|us|ref=0 (l=null, u=null)|git=None,network_adapter=mlx5_0:1,H_D,num_nodes=2,ucx_tls=['rc', 'cuda_copy'],benchmark=latency,communication_type=H_D,latency
2022-05-11T08:28:41+02:00|reframe 3.10.0-dev.3|GpuDirectRdmaTest_latency_H_D on cscs-daint:daint-icc21-impi21-ib-umod-gpu using gpu-direct-rdma|jobid=38343046|128_RDMA_GDR_Copy_Enabled=0|us|ref=0 (l=null, u=null)|git=None,network_adapter=mlx5_0:1,H_D,num_nodes=2,ucx_tls=['rc', 'cuda_copy'],benchmark=latency,communication_type=H_D,latency
2022-05-11T08:28:41+02:00|reframe 3.10.0-dev.3|GpuDirectRdmaTest_latency_H_D on cscs-daint:daint-icc21-impi21-ib-umod-gpu using gpu-direct-rdma|jobid=38343046|256_RDMA_GDR_Copy_Enabled=0|us|ref=0 (l=null, u=null)|git=None,network_adapter=mlx5_0:1,H_D,num_nodes=2,ucx_tls=['rc', 'cuda_copy'],benchmark=latency,communication_type=H_D,latency
2022-05-11T08:28:41+02:00|reframe 3.10.0-dev.3|GpuDirectRdmaTest_latency_H_D on cscs-daint:daint-icc21-impi21-ib-umod-gpu using gpu-direct-rdma|jobid=38343046|512_RDMA_GDR_Copy_Enabled=0|us|ref=0 (l=null, u=null)|git=None,network_adapter=mlx5_0:1,H_D,num_nodes=2,ucx_tls=['rc', 'cuda_copy'],benchmark=latency,communication_type=H_D,latency
2022-05-11T08:28:41+02:00|reframe 3.10.0-dev.3|GpuDirectRdmaTest_latency_H_D on cscs-daint:daint-icc21-impi21-ib-umod-gpu using gpu-direct-rdma|jobid=38343046|1024_RDMA_GDR_Copy_Enabled=0|us|ref=0 (l=null, u=null)|git=None,network_adapter=mlx5_0:1,H_D,num_nodes=2,ucx_tls=['rc', 'cuda_copy'],benchmark=latency,communication_type=H_D,latency
2022-05-11T08:28:41+02:00|reframe 3.10.0-dev.3|GpuDirectRdmaTest_latency_H_D on cscs-daint:daint-icc21-impi21-ib-umod-gpu using gpu-direct-rdma|jobid=38343046|2048_RDMA_GDR_Copy_Enabled=0|us|ref=0 (l=null, u=null)|git=None,network_adapter=mlx5_0:1,H_D,num_nodes=2,ucx_tls=['rc', 'cuda_copy'],benchmark=latency,communication_type=H_D,latency
2022-05-11T08:28:41+02:00|reframe 3.10.0-dev.3|GpuDirectRdmaTest_latency_H_D on cscs-daint:daint-icc21-impi21-ib-umod-gpu using gpu-direct-rdma|jobid=38343046|4096_RDMA_GDR_Copy_Enabled=0|us|ref=0 (l=null, u=null)|git=None,network_adapter=mlx5_0:1,H_D,num_nodes=2,ucx_tls=['rc', 'cuda_copy'],benchmark=latency,communication_type=H_D,latency
2022-05-11T08:28:41+02:00|reframe 3.10.0-dev.3|GpuDirectRdmaTest_latency_H_D on cscs-daint:daint-icc21-impi21-ib-umod-gpu using gpu-direct-rdma|jobid=38343046|8192_RDMA_GDR_Copy_Enabled=0|us|ref=0 (l=null, u=null)|git=None,network_adapter=mlx5_0:1,H_D,num_nodes=2,ucx_tls=['rc', 'cuda_copy'],benchmark=latency,communication_type=H_D,latency
2022-05-11T08:28:41+02:00|reframe 3.10.0-dev.3|GpuDirectRdmaTest_latency_H_D on cscs-daint:daint-icc21-impi21-ib-umod-gpu using gpu-direct-rdma|jobid=38343046|16384_RDMA_GDR_Copy_Enabled=0|us|ref=0 (l=null, u=null)|git=None,network_adapter=mlx5_0:1,H_D,num_nodes=2,ucx_tls=['rc', 'cuda_copy'],benchmark=latency,communication_type=H_D,latency
2022-05-11T08:28:41+02:00|reframe 3.10.0-dev.3|GpuDirectRdmaTest_latency_H_D on cscs-daint:daint-icc21-impi21-ib-umod-gpu using gpu-direct-rdma|jobid=38343046|32768_RDMA_GDR_Copy_Enabled=0|us|ref=0 (l=null, u=null)|git=None,network_adapter=mlx5_0:1,H_D,num_nodes=2,ucx_tls=['rc', 'cuda_copy'],benchmark=latency,communication_type=H_D,latency
2022-05-11T08:28:41+02:00|reframe 3.10.0-dev.3|GpuDirectRdmaTest_latency_H_D on cscs-daint:daint-icc21-impi21-ib-umod-gpu using gpu-direct-rdma|jobid=38343046|65536_RDMA_GDR_Copy_Enabled=0|us|ref=0 (l=null, u=null)|git=None,network_adapter=mlx5_0:1,H_D,num_nodes=2,ucx_tls=['rc', 'cuda_copy'],benchmark=latency,communication_type=H_D,latency
2022-05-11T08:28:41+02:00|reframe 3.10.0-dev.3|GpuDirectRdmaTest_latency_H_D on cscs-daint:daint-icc21-impi21-ib-umod-gpu using gpu-direct-rdma|jobid=38343046|131072_RDMA_GDR_Copy_Enabled=0|us|ref=0 (l=null, u=null)|git=None,network_adapter=mlx5_0:1,H_D,num_nodes=2,ucx_tls=['rc', 'cuda_copy'],benchmark=latency,communication_type=H_D,latency
2022-05-11T08:28:41+02:00|reframe 3.10.0-dev.3|GpuDirectRdmaTest_latency_H_D on cscs-daint:daint-icc21-impi21-ib-umod-gpu using gpu-direct-rdma|jobid=38343046|262144_RDMA_GDR_Copy_Enabled=0|us|ref=0 (l=null, u=null)|git=None,network_adapter=mlx5_0:1,H_D,num_nodes=2,ucx_tls=['rc', 'cuda_copy'],benchmark=latency,communication_type=H_D,latency
2022-05-11T08:28:41+02:00|reframe 3.10.0-dev.3|GpuDirectRdmaTest_latency_H_D on cscs-daint:daint-icc21-impi21-ib-umod-gpu using gpu-direct-rdma|jobid=38343046|524288_RDMA_GDR_Copy_Enabled=0|us|ref=0 (l=null, u=null)|git=None,network_adapter=mlx5_0:1,H_D,num_nodes=2,ucx_tls=['rc', 'cuda_copy'],benchmark=latency,communication_type=H_D,latency
2022-05-11T08:28:41+02:00|reframe 3.10.0-dev.3|GpuDirectRdmaTest_latency_H_D on cscs-daint:daint-icc21-impi21-ib-umod-gpu using gpu-direct-rdma|jobid=38343046|1048576_RDMA_GDR_Copy_Enabled=0|us|ref=0 (l=null, u=null)|git=None,network_adapter=mlx5_0:1,H_D,num_nodes=2,ucx_tls=['rc', 'cuda_copy'],benchmark=latency,communication_type=H_D,latency
2022-05-11T08:28:41+02:00|reframe 3.10.0-dev.3|GpuDirectRdmaTest_latency_H_D on cscs-daint:daint-icc21-impi21-ib-umod-gpu using gpu-direct-rdma|jobid=38343046|2097152_RDMA_GDR_Copy_Enabled=0|us|ref=0 (l=null, u=null)|git=None,network_adapter=mlx5_0:1,H_D,num_nodes=2,ucx_tls=['rc', 'cuda_copy'],benchmark=latency,communication_type=H_D,latency
2022-05-11T08:28:41+02:00|reframe 3.10.0-dev.3|GpuDirectRdmaTest_latency_H_D on cscs-daint:daint-icc21-impi21-ib-umod-gpu using gpu-direct-rdma|jobid=38343046|4194304_RDMA_GDR_Copy_Enabled=0|us|ref=0 (l=null, u=null)|git=None,network_adapter=mlx5_0:1,H_D,num_nodes=2,ucx_tls=['rc', 'cuda_copy'],benchmark=latency,communication_type=H_D,latency
2022-05-11T08:28:41+02:00|reframe 3.10.0-dev.3|GpuDirectRdmaTest_latency_H_D on cscs-daint:daint-icc21-impi21-ib-umod-gpu using gpu-direct-rdma|jobid=38343046|2_RDMA_Enabled_GDR_Copy_Disabled=0|us|ref=0 (l=null, u=null)|git=None,network_adapter=mlx5_0:1,H_D,num_nodes=2,ucx_tls=['rc', 'cuda_copy'],benchmark=latency,communication_type=H_D,latency
2022-05-11T08:28:41+02:00|reframe 3.10.0-dev.3|GpuDirectRdmaTest_latency_H_D on cscs-daint:daint-icc21-impi21-ib-umod-gpu using gpu-direct-rdma|jobid=38343046|4_RDMA_Enabled_GDR_Copy_Disabled=0|us|ref=0 (l=null, u=null)|git=None,network_adapter=mlx5_0:1,H_D,num_nodes=2,ucx_tls=['rc', 'cuda_copy'],benchmark=latency,communication_type=H_D,latency
2022-05-11T08:28:41+02:00|reframe 3.10.0-dev.3|GpuDirectRdmaTest_latency_H_D on cscs-daint:daint-icc21-impi21-ib-umod-gpu using gpu-direct-rdma|jobid=38343046|8_RDMA_Enabled_GDR_Copy_Disabled=0|us|ref=0 (l=null, u=null)|git=None,network_adapter=mlx5_0:1,H_D,num_nodes=2,ucx_tls=['rc', 'cuda_copy'],benchmark=latency,communication_type=H_D,latency
2022-05-11T08:28:41+02:00|reframe 3.10.0-dev.3|GpuDirectRdmaTest_latency_H_D on cscs-daint:daint-icc21-impi21-ib-umod-gpu using gpu-direct-rdma|jobid=38343046|16_RDMA_Enabled_GDR_Copy_Disabled=0|us|ref=0 (l=null, u=null)|git=None,network_adapter=mlx5_0:1,H_D,num_nodes=2,ucx_tls=['rc', 'cuda_copy'],benchmark=latency,communication_type=H_D,latency
2022-05-11T08:28:41+02:00|reframe 3.10.0-dev.3|GpuDirectRdmaTest_latency_H_D on cscs-daint:daint-icc21-impi21-ib-umod-gpu using gpu-direct-rdma|jobid=38343046|32_RDMA_Enabled_GDR_Copy_Disabled=0|us|ref=0 (l=null, u=null)|git=None,network_adapter=mlx5_0:1,H_D,num_nodes=2,ucx_tls=['rc', 'cuda_copy'],benchmark=latency,communication_type=H_D,latency
2022-05-11T08:28:41+02:00|reframe 3.10.0-dev.3|GpuDirectRdmaTest_latency_H_D on cscs-daint:daint-icc21-impi21-ib-umod-gpu using gpu-direct-rdma|jobid=38343046|64_RDMA_Enabled_GDR_Copy_Disabled=0|us|ref=0 (l=null, u=null)|git=None,network_adapter=mlx5_0:1,H_D,num_nodes=2,ucx_tls=['rc', 'cuda_copy'],benchmark=latency,communication_type=H_D,latency
2022-05-11T08:28:41+02:00|reframe 3.10.0-dev.3|GpuDirectRdmaTest_latency_H_D on cscs-daint:daint-icc21-impi21-ib-umod-gpu using gpu-direct-rdma|jobid=38343046|128_RDMA_Enabled_GDR_Copy_Disabled=0|us|ref=0 (l=null, u=null)|git=None,network_adapter=mlx5_0:1,H_D,num_nodes=2,ucx_tls=['rc', 'cuda_copy'],benchmark=latency,communication_type=H_D,latency
2022-05-11T08:28:41+02:00|reframe 3.10.0-dev.3|GpuDirectRdmaTest_latency_H_D on cscs-daint:daint-icc21-impi21-ib-umod-gpu using gpu-direct-rdma|jobid=38343046|256_RDMA_Enabled_GDR_Copy_Disabled=0|us|ref=0 (l=null, u=null)|git=None,network_adapter=mlx5_0:1,H_D,num_nodes=2,ucx_tls=['rc', 'cuda_copy'],benchmark=latency,communication_type=H_D,latency
2022-05-11T08:28:41+02:00|reframe 3.10.0-dev.3|GpuDirectRdmaTest_latency_H_D on cscs-daint:daint-icc21-impi21-ib-umod-gpu using gpu-direct-rdma|jobid=38343046|512_RDMA_Enabled_GDR_Copy_Disabled=0|us|ref=0 (l=null, u=null)|git=None,network_adapter=mlx5_0:1,H_D,num_nodes=2,ucx_tls=['rc', 'cuda_copy'],benchmark=latency,communication_type=H_D,latency
2022-05-11T08:28:41+02:00|reframe 3.10.0-dev.3|GpuDirectRdmaTest_latency_H_D on cscs-daint:daint-icc21-impi21-ib-umod-gpu using gpu-direct-rdma|jobid=38343046|1024_RDMA_Enabled_GDR_Copy_Disabled=0|us|ref=0 (l=null, u=null)|git=None,network_adapter=mlx5_0:1,H_D,num_nodes=2,ucx_tls=['rc', 'cuda_copy'],benchmark=latency,communication_type=H_D,latency
2022-05-11T08:28:41+02:00|reframe 3.10.0-dev.3|GpuDirectRdmaTest_latency_H_D on cscs-daint:daint-icc21-impi21-ib-umod-gpu using gpu-direct-rdma|jobid=38343046|2048_RDMA_Enabled_GDR_Copy_Disabled=0|us|ref=0 (l=null, u=null)|git=None,network_adapter=mlx5_0:1,H_D,num_nodes=2,ucx_tls=['rc', 'cuda_copy'],benchmark=latency,communication_type=H_D,latency
2022-05-11T08:28:41+02:00|reframe 3.10.0-dev.3|GpuDirectRdmaTest_latency_H_D on cscs-daint:daint-icc21-impi21-ib-umod-gpu using gpu-direct-rdma|jobid=38343046|4096_RDMA_Enabled_GDR_Copy_Disabled=0|us|ref=0 (l=null, u=null)|git=None,network_adapter=mlx5_0:1,H_D,num_nodes=2,ucx_tls=['rc', 'cuda_copy'],benchmark=latency,communication_type=H_D,latency
2022-05-11T08:28:41+02:00|reframe 3.10.0-dev.3|GpuDirectRdmaTest_latency_H_D on cscs-daint:daint-icc21-impi21-ib-umod-gpu using gpu-direct-rdma|jobid=38343046|8192_RDMA_Enabled_GDR_Copy_Disabled=0|us|ref=0 (l=null, u=null)|git=None,network_adapter=mlx5_0:1,H_D,num_nodes=2,ucx_tls=['rc', 'cuda_copy'],benchmark=latency,communication_type=H_D,latency
2022-05-11T08:28:41+02:00|reframe 3.10.0-dev.3|GpuDirectRdmaTest_latency_H_D on cscs-daint:daint-icc21-impi21-ib-umod-gpu using gpu-direct-rdma|jobid=38343046|16384_RDMA_Enabled_GDR_Copy_Disabled=0|us|ref=0 (l=null, u=null)|git=None,network_adapter=mlx5_0:1,H_D,num_nodes=2,ucx_tls=['rc', 'cuda_copy'],benchmark=latency,communication_type=H_D,latency
2022-05-11T08:28:41+02:00|reframe 3.10.0-dev.3|GpuDirectRdmaTest_latency_H_D on cscs-daint:daint-icc21-impi21-ib-umod-gpu using gpu-direct-rdma|jobid=38343046|32768_RDMA_Enabled_GDR_Copy_Disabled=0|us|ref=0 (l=null, u=null)|git=None,network_adapter=mlx5_0:1,H_D,num_nodes=2,ucx_tls=['rc', 'cuda_copy'],benchmark=latency,communication_type=H_D,latency
2022-05-11T08:28:41+02:00|reframe 3.10.0-dev.3|GpuDirectRdmaTest_latency_H_D on cscs-daint:daint-icc21-impi21-ib-umod-gpu using gpu-direct-rdma|jobid=38343046|65536_RDMA_Enabled_GDR_Copy_Disabled=0|us|ref=0 (l=null, u=null)|git=None,network_adapter=mlx5_0:1,H_D,num_nodes=2,ucx_tls=['rc', 'cuda_copy'],benchmark=latency,communication_type=H_D,latency
2022-05-11T08:28:41+02:00|reframe 3.10.0-dev.3|GpuDirectRdmaTest_latency_H_D on cscs-daint:daint-icc21-impi21-ib-umod-gpu using gpu-direct-rdma|jobid=38343046|131072_RDMA_Enabled_GDR_Copy_Disabled=0|us|ref=0 (l=null, u=null)|git=None,network_adapter=mlx5_0:1,H_D,num_nodes=2,ucx_tls=['rc', 'cuda_copy'],benchmark=latency,communication_type=H_D,latency
2022-05-11T08:28:41+02:00|reframe 3.10.0-dev.3|GpuDirectRdmaTest_latency_H_D on cscs-daint:daint-icc21-impi21-ib-umod-gpu using gpu-direct-rdma|jobid=38343046|262144_RDMA_Enabled_GDR_Copy_Disabled=0|us|ref=0 (l=null, u=null)|git=None,network_adapter=mlx5_0:1,H_D,num_nodes=2,ucx_tls=['rc', 'cuda_copy'],benchmark=latency,communication_type=H_D,latency
2022-05-11T08:28:41+02:00|reframe 3.10.0-dev.3|GpuDirectRdmaTest_latency_H_D on cscs-daint:daint-icc21-impi21-ib-umod-gpu using gpu-direct-rdma|jobid=38343046|524288_RDMA_Enabled_GDR_Copy_Disabled=0|us|ref=0 (l=null, u=null)|git=None,network_adapter=mlx5_0:1,H_D,num_nodes=2,ucx_tls=['rc', 'cuda_copy'],benchmark=latency,communication_type=H_D,latency
2022-05-11T08:28:41+02:00|reframe 3.10.0-dev.3|GpuDirectRdmaTest_latency_H_D on cscs-daint:daint-icc21-impi21-ib-umod-gpu using gpu-direct-rdma|jobid=38343046|1048576_RDMA_Enabled_GDR_Copy_Disabled=0|us|ref=0 (l=null, u=null)|git=None,network_adapter=mlx5_0:1,H_D,num_nodes=2,ucx_tls=['rc', 'cuda_copy'],benchmark=latency,communication_type=H_D,latency
2022-05-11T08:28:41+02:00|reframe 3.10.0-dev.3|GpuDirectRdmaTest_latency_H_D on cscs-daint:daint-icc21-impi21-ib-umod-gpu using gpu-direct-rdma|jobid=38343046|2097152_RDMA_Enabled_GDR_Copy_Disabled=0|us|ref=0 (l=null, u=null)|git=None,network_adapter=mlx5_0:1,H_D,num_nodes=2,ucx_tls=['rc', 'cuda_copy'],benchmark=latency,communication_type=H_D,latency
2022-05-11T08:28:41+02:00|reframe 3.10.0-dev.3|GpuDirectRdmaTest_latency_H_D on cscs-daint:daint-icc21-impi21-ib-umod-gpu using gpu-direct-rdma|jobid=38343046|4194304_RDMA_Enabled_GDR_Copy_Disabled=0|us|ref=0 (l=null, u=null)|git=None,network_adapter=mlx5_0:1,H_D,num_nodes=2,ucx_tls=['rc', 'cuda_copy'],benchmark=latency,communication_type=H_D,latency
2022-05-11T08:28:41+02:00|reframe 3.10.0-dev.3|GpuDirectRdmaTest_latency_H_D on cscs-daint:daint-icc21-impi21-ib-umod-gpu using gpu-direct-rdma|jobid=38343046|2_RDMA_Disabled_GDR_Copy_Enabled=0|us|ref=0 (l=null, u=null)|git=None,network_adapter=mlx5_0:1,H_D,num_nodes=2,ucx_tls=['rc', 'cuda_copy'],benchmark=latency,communication_type=H_D,latency
2022-05-11T08:28:41+02:00|reframe 3.10.0-dev.3|GpuDirectRdmaTest_latency_H_D on cscs-daint:daint-icc21-impi21-ib-umod-gpu using gpu-direct-rdma|jobid=38343046|4_RDMA_Disabled_GDR_Copy_Enabled=0|us|ref=0 (l=null, u=null)|git=None,network_adapter=mlx5_0:1,H_D,num_nodes=2,ucx_tls=['rc', 'cuda_copy'],benchmark=latency,communication_type=H_D,latency
2022-05-11T08:28:41+02:00|reframe 3.10.0-dev.3|GpuDirectRdmaTest_latency_H_D on cscs-daint:daint-icc21-impi21-ib-umod-gpu using gpu-direct-rdma|jobid=38343046|8_RDMA_Disabled_GDR_Copy_Enabled=0|us|ref=0 (l=null, u=null)|git=None,network_adapter=mlx5_0:1,H_D,num_nodes=2,ucx_tls=['rc', 'cuda_copy'],benchmark=latency,communication_type=H_D,latency
2022-05-11T08:28:41+02:00|reframe 3.10.0-dev.3|GpuDirectRdmaTest_latency_H_D on cscs-daint:daint-icc21-impi21-ib-umod-gpu using gpu-direct-rdma|jobid=38343046|16_RDMA_Disabled_GDR_Copy_Enabled=0|us|ref=0 (l=null, u=null)|git=None,network_adapter=mlx5_0:1,H_D,num_nodes=2,ucx_tls=['rc', 'cuda_copy'],benchmark=latency,communication_type=H_D,latency
2022-05-11T08:28:41+02:00|reframe 3.10.0-dev.3|GpuDirectRdmaTest_latency_H_D on cscs-daint:daint-icc21-impi21-ib-umod-gpu using gpu-direct-rdma|jobid=38343046|32_RDMA_Disabled_GDR_Copy_Enabled=0|us|ref=0 (l=null, u=null)|git=None,network_adapter=mlx5_0:1,H_D,num_nodes=2,ucx_tls=['rc', 'cuda_copy'],benchmark=latency,communication_type=H_D,latency
2022-05-11T08:28:41+02:00|reframe 3.10.0-dev.3|GpuDirectRdmaTest_latency_H_D on cscs-daint:daint-icc21-impi21-ib-umod-gpu using gpu-direct-rdma|jobid=38343046|64_RDMA_Disabled_GDR_Copy_Enabled=0|us|ref=0 (l=null, u=null)|git=None,network_adapter=mlx5_0:1,H_D,num_nodes=2,ucx_tls=['rc', 'cuda_copy'],benchmark=latency,communication_type=H_D,latency
2022-05-11T08:28:41+02:00|reframe 3.10.0-dev.3|GpuDirectRdmaTest_latency_H_D on cscs-daint:daint-icc21-impi21-ib-umod-gpu using gpu-direct-rdma|jobid=38343046|128_RDMA_Disabled_GDR_Copy_Enabled=0|us|ref=0 (l=null, u=null)|git=None,network_adapter=mlx5_0:1,H_D,num_nodes=2,ucx_tls=['rc', 'cuda_copy'],benchmark=latency,communication_type=H_D,latency
2022-05-11T08:28:41+02:00|reframe 3.10.0-dev.3|GpuDirectRdmaTest_latency_H_D on cscs-daint:daint-icc21-impi21-ib-umod-gpu using gpu-direct-rdma|jobid=38343046|256_RDMA_Disabled_GDR_Copy_Enabled=0|us|ref=0 (l=null, u=null)|git=None,network_adapter=mlx5_0:1,H_D,num_nodes=2,ucx_tls=['rc', 'cuda_copy'],benchmark=latency,communication_type=H_D,latency
2022-05-11T08:28:41+02:00|reframe 3.10.0-dev.3|GpuDirectRdmaTest_latency_H_D on cscs-daint:daint-icc21-impi21-ib-umod-gpu using gpu-direct-rdma|jobid=38343046|512_RDMA_Disabled_GDR_Copy_Enabled=0|us|ref=0 (l=null, u=null)|git=None,network_adapter=mlx5_0:1,H_D,num_nodes=2,ucx_tls=['rc', 'cuda_copy'],benchmark=latency,communication_type=H_D,latency
2022-05-11T08:28:41+02:00|reframe 3.10.0-dev.3|GpuDirectRdmaTest_latency_H_D on cscs-daint:daint-icc21-impi21-ib-umod-gpu using gpu-direct-rdma|jobid=38343046|1024_RDMA_Disabled_GDR_Copy_Enabled=0|us|ref=0 (l=null, u=null)|git=None,network_adapter=mlx5_0:1,H_D,num_nodes=2,ucx_tls=['rc', 'cuda_copy'],benchmark=latency,communication_type=H_D,latency
2022-05-11T08:28:41+02:00|reframe 3.10.0-dev.3|GpuDirectRdmaTest_latency_H_D on cscs-daint:daint-icc21-impi21-ib-umod-gpu using gpu-direct-rdma|jobid=38343046|2048_RDMA_Disabled_GDR_Copy_Enabled=0|us|ref=0 (l=null, u=null)|git=None,network_adapter=mlx5_0:1,H_D,num_nodes=2,ucx_tls=['rc', 'cuda_copy'],benchmark=latency,communication_type=H_D,latency
2022-05-11T08:28:41+02:00|reframe 3.10.0-dev.3|GpuDirectRdmaTest_latency_H_D on cscs-daint:daint-icc21-impi21-ib-umod-gpu using gpu-direct-rdma|jobid=38343046|4096_RDMA_Disabled_GDR_Copy_Enabled=0|us|ref=0 (l=null, u=null)|git=None,network_adapter=mlx5_0:1,H_D,num_nodes=2,ucx_tls=['rc', 'cuda_copy'],benchmark=latency,communication_type=H_D,latency
2022-05-11T08:28:41+02:00|reframe 3.10.0-dev.3|GpuDirectRdmaTest_latency_H_D on cscs-daint:daint-icc21-impi21-ib-umod-gpu using gpu-direct-rdma|jobid=38343046|8192_RDMA_Disabled_GDR_Copy_Enabled=0|us|ref=0 (l=null, u=null)|git=None,network_adapter=mlx5_0:1,H_D,num_nodes=2,ucx_tls=['rc', 'cuda_copy'],benchmark=latency,communication_type=H_D,latency
2022-05-11T08:28:41+02:00|reframe 3.10.0-dev.3|GpuDirectRdmaTest_latency_H_D on cscs-daint:daint-icc21-impi21-ib-umod-gpu using gpu-direct-rdma|jobid=38343046|16384_RDMA_Disabled_GDR_Copy_Enabled=0|us|ref=0 (l=null, u=null)|git=None,network_adapter=mlx5_0:1,H_D,num_nodes=2,ucx_tls=['rc', 'cuda_copy'],benchmark=latency,communication_type=H_D,latency
2022-05-11T08:28:41+02:00|reframe 3.10.0-dev.3|GpuDirectRdmaTest_latency_H_D on cscs-daint:daint-icc21-impi21-ib-umod-gpu using gpu-direct-rdma|jobid=38343046|32768_RDMA_Disabled_GDR_Copy_Enabled=0|us|ref=0 (l=null, u=null)|git=None,network_adapter=mlx5_0:1,H_D,num_nodes=2,ucx_tls=['rc', 'cuda_copy'],benchmark=latency,communication_type=H_D,latency
2022-05-11T08:28:41+02:00|reframe 3.10.0-dev.3|GpuDirectRdmaTest_latency_H_D on cscs-daint:daint-icc21-impi21-ib-umod-gpu using gpu-direct-rdma|jobid=38343046|65536_RDMA_Disabled_GDR_Copy_Enabled=0|us|ref=0 (l=null, u=null)|git=None,network_adapter=mlx5_0:1,H_D,num_nodes=2,ucx_tls=['rc', 'cuda_copy'],benchmark=latency,communication_type=H_D,latency
2022-05-11T08:28:41+02:00|reframe 3.10.0-dev.3|GpuDirectRdmaTest_latency_H_D on cscs-daint:daint-icc21-impi21-ib-umod-gpu using gpu-direct-rdma|jobid=38343046|131072_RDMA_Disabled_GDR_Copy_Enabled=0|us|ref=0 (l=null, u=null)|git=None,network_adapter=mlx5_0:1,H_D,num_nodes=2,ucx_tls=['rc', 'cuda_copy'],benchmark=latency,communication_type=H_D,latency
2022-05-11T08:28:41+02:00|reframe 3.10.0-dev.3|GpuDirectRdmaTest_latency_H_D on cscs-daint:daint-icc21-impi21-ib-umod-gpu using gpu-direct-rdma|jobid=38343046|262144_RDMA_Disabled_GDR_Copy_Enabled=0|us|ref=0 (l=null, u=null)|git=None,network_adapter=mlx5_0:1,H_D,num_nodes=2,ucx_tls=['rc', 'cuda_copy'],benchmark=latency,communication_type=H_D,latency
2022-05-11T08:28:41+02:00|reframe 3.10.0-dev.3|GpuDirectRdmaTest_latency_H_D on cscs-daint:daint-icc21-impi21-ib-umod-gpu using gpu-direct-rdma|jobid=38343046|524288_RDMA_Disabled_GDR_Copy_Enabled=0|us|ref=0 (l=null, u=null)|git=None,network_adapter=mlx5_0:1,H_D,num_nodes=2,ucx_tls=['rc', 'cuda_copy'],benchmark=latency,communication_type=H_D,latency
2022-05-11T08:28:41+02:00|reframe 3.10.0-dev.3|GpuDirectRdmaTest_latency_H_D on cscs-daint:daint-icc21-impi21-ib-umod-gpu using gpu-direct-rdma|jobid=38343046|1048576_RDMA_Disabled_GDR_Copy_Enabled=0|us|ref=0 (l=null, u=null)|git=None,network_adapter=mlx5_0:1,H_D,num_nodes=2,ucx_tls=['rc', 'cuda_copy'],benchmark=latency,communication_type=H_D,latency
2022-05-11T08:28:41+02:00|reframe 3.10.0-dev.3|GpuDirectRdmaTest_latency_H_D on cscs-daint:daint-icc21-impi21-ib-umod-gpu using gpu-direct-rdma|jobid=38343046|2097152_RDMA_Disabled_GDR_Copy_Enabled=0|us|ref=0 (l=null, u=null)|git=None,network_adapter=mlx5_0:1,H_D,num_nodes=2,ucx_tls=['rc', 'cuda_copy'],benchmark=latency,communication_type=H_D,latency
2022-05-11T08:28:41+02:00|reframe 3.10.0-dev.3|GpuDirectRdmaTest_latency_H_D on cscs-daint:daint-icc21-impi21-ib-umod-gpu using gpu-direct-rdma|jobid=38343046|4194304_RDMA_Disabled_GDR_Copy_Enabled=0|us|ref=0 (l=null, u=null)|git=None,network_adapter=mlx5_0:1,H_D,num_nodes=2,ucx_tls=['rc', 'cuda_copy'],benchmark=latency,communication_type=H_D,latency
2022-05-11T08:28:41+02:00|reframe 3.10.0-dev.3|GpuDirectRdmaTest_latency_H_D on cscs-daint:daint-icc21-impi21-ib-umod-gpu using gpu-direct-rdma|jobid=38343046|2_RDMA_GDR_Copy_Disabled=0|us|ref=0 (l=null, u=null)|git=None,network_adapter=mlx5_0:1,H_D,num_nodes=2,ucx_tls=['rc', 'cuda_copy'],benchmark=latency,communication_type=H_D,latency
2022-05-11T08:28:41+02:00|reframe 3.10.0-dev.3|GpuDirectRdmaTest_latency_H_D on cscs-daint:daint-icc21-impi21-ib-umod-gpu using gpu-direct-rdma|jobid=38343046|4_RDMA_GDR_Copy_Disabled=0|us|ref=0 (l=null, u=null)|git=None,network_adapter=mlx5_0:1,H_D,num_nodes=2,ucx_tls=['rc', 'cuda_copy'],benchmark=latency,communication_type=H_D,latency
2022-05-11T08:28:41+02:00|reframe 3.10.0-dev.3|GpuDirectRdmaTest_latency_H_D on cscs-daint:daint-icc21-impi21-ib-umod-gpu using gpu-direct-rdma|jobid=38343046|8_RDMA_GDR_Copy_Disabled=0|us|ref=0 (l=null, u=null)|git=None,network_adapter=mlx5_0:1,H_D,num_nodes=2,ucx_tls=['rc', 'cuda_copy'],benchmark=latency,communication_type=H_D,latency
2022-05-11T08:28:41+02:00|reframe 3.10.0-dev.3|GpuDirectRdmaTest_latency_H_D on cscs-daint:daint-icc21-impi21-ib-umod-gpu using gpu-direct-rdma|jobid=38343046|16_RDMA_GDR_Copy_Disabled=0|us|ref=0 (l=null, u=null)|git=None,network_adapter=mlx5_0:1,H_D,num_nodes=2,ucx_tls=['rc', 'cuda_copy'],benchmark=latency,communication_type=H_D,latency
2022-05-11T08:28:41+02:00|reframe 3.10.0-dev.3|GpuDirectRdmaTest_latency_H_D on cscs-daint:daint-icc21-impi21-ib-umod-gpu using gpu-direct-rdma|jobid=38343046|32_RDMA_GDR_Copy_Disabled=0|us|ref=0 (l=null, u=null)|git=None,network_adapter=mlx5_0:1,H_D,num_nodes=2,ucx_tls=['rc', 'cuda_copy'],benchmark=latency,communication_type=H_D,latency
2022-05-11T08:28:41+02:00|reframe 3.10.0-dev.3|GpuDirectRdmaTest_latency_H_D on cscs-daint:daint-icc21-impi21-ib-umod-gpu using gpu-direct-rdma|jobid=38343046|64_RDMA_GDR_Copy_Disabled=0|us|ref=0 (l=null, u=null)|git=None,network_adapter=mlx5_0:1,H_D,num_nodes=2,ucx_tls=['rc', 'cuda_copy'],benchmark=latency,communication_type=H_D,latency
2022-05-11T08:28:41+02:00|reframe 3.10.0-dev.3|GpuDirectRdmaTest_latency_H_D on cscs-daint:daint-icc21-impi21-ib-umod-gpu using gpu-direct-rdma|jobid=38343046|128_RDMA_GDR_Copy_Disabled=0|us|ref=0 (l=null, u=null)|git=None,network_adapter=mlx5_0:1,H_D,num_nodes=2,ucx_tls=['rc', 'cuda_copy'],benchmark=latency,communication_type=H_D,latency
2022-05-11T08:28:41+02:00|reframe 3.10.0-dev.3|GpuDirectRdmaTest_latency_H_D on cscs-daint:daint-icc21-impi21-ib-umod-gpu using gpu-direct-rdma|jobid=38343046|256_RDMA_GDR_Copy_Disabled=0|us|ref=0 (l=null, u=null)|git=None,network_adapter=mlx5_0:1,H_D,num_nodes=2,ucx_tls=['rc', 'cuda_copy'],benchmark=latency,communication_type=H_D,latency
2022-05-11T08:28:41+02:00|reframe 3.10.0-dev.3|GpuDirectRdmaTest_latency_H_D on cscs-daint:daint-icc21-impi21-ib-umod-gpu using gpu-direct-rdma|jobid=38343046|512_RDMA_GDR_Copy_Disabled=0|us|ref=0 (l=null, u=null)|git=None,network_adapter=mlx5_0:1,H_D,num_nodes=2,ucx_tls=['rc', 'cuda_copy'],benchmark=latency,communication_type=H_D,latency
2022-05-11T08:28:41+02:00|reframe 3.10.0-dev.3|GpuDirectRdmaTest_latency_H_D on cscs-daint:daint-icc21-impi21-ib-umod-gpu using gpu-direct-rdma|jobid=38343046|1024_RDMA_GDR_Copy_Disabled=0|us|ref=0 (l=null, u=null)|git=None,network_adapter=mlx5_0:1,H_D,num_nodes=2,ucx_tls=['rc', 'cuda_copy'],benchmark=latency,communication_type=H_D,latency
2022-05-11T08:28:41+02:00|reframe 3.10.0-dev.3|GpuDirectRdmaTest_latency_H_D on cscs-daint:daint-icc21-impi21-ib-umod-gpu using gpu-direct-rdma|jobid=38343046|2048_RDMA_GDR_Copy_Disabled=0|us|ref=0 (l=null, u=null)|git=None,network_adapter=mlx5_0:1,H_D,num_nodes=2,ucx_tls=['rc', 'cuda_copy'],benchmark=latency,communication_type=H_D,latency
2022-05-11T08:28:41+02:00|reframe 3.10.0-dev.3|GpuDirectRdmaTest_latency_H_D on cscs-daint:daint-icc21-impi21-ib-umod-gpu using gpu-direct-rdma|jobid=38343046|4096_RDMA_GDR_Copy_Disabled=0|us|ref=0 (l=null, u=null)|git=None,network_adapter=mlx5_0:1,H_D,num_nodes=2,ucx_tls=['rc', 'cuda_copy'],benchmark=latency,communication_type=H_D,latency
2022-05-11T08:28:41+02:00|reframe 3.10.0-dev.3|GpuDirectRdmaTest_latency_H_D on cscs-daint:daint-icc21-impi21-ib-umod-gpu using gpu-direct-rdma|jobid=38343046|8192_RDMA_GDR_Copy_Disabled=0|us|ref=0 (l=null, u=null)|git=None,network_adapter=mlx5_0:1,H_D,num_nodes=2,ucx_tls=['rc', 'cuda_copy'],benchmark=latency,communication_type=H_D,latency
2022-05-11T08:28:41+02:00|reframe 3.10.0-dev.3|GpuDirectRdmaTest_latency_H_D on cscs-daint:daint-icc21-impi21-ib-umod-gpu using gpu-direct-rdma|jobid=38343046|16384_RDMA_GDR_Copy_Disabled=0|us|ref=0 (l=null, u=null)|git=None,network_adapter=mlx5_0:1,H_D,num_nodes=2,ucx_tls=['rc', 'cuda_copy'],benchmark=latency,communication_type=H_D,latency
2022-05-11T08:28:41+02:00|reframe 3.10.0-dev.3|GpuDirectRdmaTest_latency_H_D on cscs-daint:daint-icc21-impi21-ib-umod-gpu using gpu-direct-rdma|jobid=38343046|32768_RDMA_GDR_Copy_Disabled=0|us|ref=0 (l=null, u=null)|git=None,network_adapter=mlx5_0:1,H_D,num_nodes=2,ucx_tls=['rc', 'cuda_copy'],benchmark=latency,communication_type=H_D,latency
2022-05-11T08:28:41+02:00|reframe 3.10.0-dev.3|GpuDirectRdmaTest_latency_H_D on cscs-daint:daint-icc21-impi21-ib-umod-gpu using gpu-direct-rdma|jobid=38343046|65536_RDMA_GDR_Copy_Disabled=0|us|ref=0 (l=null, u=null)|git=None,network_adapter=mlx5_0:1,H_D,num_nodes=2,ucx_tls=['rc', 'cuda_copy'],benchmark=latency,communication_type=H_D,latency
2022-05-11T08:28:41+02:00|reframe 3.10.0-dev.3|GpuDirectRdmaTest_latency_H_D on cscs-daint:daint-icc21-impi21-ib-umod-gpu using gpu-direct-rdma|jobid=38343046|131072_RDMA_GDR_Copy_Disabled=0|us|ref=0 (l=null, u=null)|git=None,network_adapter=mlx5_0:1,H_D,num_nodes=2,ucx_tls=['rc', 'cuda_copy'],benchmark=latency,communication_type=H_D,latency
2022-05-11T08:28:41+02:00|reframe 3.10.0-dev.3|GpuDirectRdmaTest_latency_H_D on cscs-daint:daint-icc21-impi21-ib-umod-gpu using gpu-direct-rdma|jobid=38343046|262144_RDMA_GDR_Copy_Disabled=0|us|ref=0 (l=null, u=null)|git=None,network_adapter=mlx5_0:1,H_D,num_nodes=2,ucx_tls=['rc', 'cuda_copy'],benchmark=latency,communication_type=H_D,latency
2022-05-11T08:28:41+02:00|reframe 3.10.0-dev.3|GpuDirectRdmaTest_latency_H_D on cscs-daint:daint-icc21-impi21-ib-umod-gpu using gpu-direct-rdma|jobid=38343046|524288_RDMA_GDR_Copy_Disabled=0|us|ref=0 (l=null, u=null)|git=None,network_adapter=mlx5_0:1,H_D,num_nodes=2,ucx_tls=['rc', 'cuda_copy'],benchmark=latency,communication_type=H_D,latency
2022-05-11T08:28:41+02:00|reframe 3.10.0-dev.3|GpuDirectRdmaTest_latency_H_D on cscs-daint:daint-icc21-impi21-ib-umod-gpu using gpu-direct-rdma|jobid=38343046|1048576_RDMA_GDR_Copy_Disabled=0|us|ref=0 (l=null, u=null)|git=None,network_adapter=mlx5_0:1,H_D,num_nodes=2,ucx_tls=['rc', 'cuda_copy'],benchmark=latency,communication_type=H_D,latency
2022-05-11T08:28:41+02:00|reframe 3.10.0-dev.3|GpuDirectRdmaTest_latency_H_D on cscs-daint:daint-icc21-impi21-ib-umod-gpu using gpu-direct-rdma|jobid=38343046|2097152_RDMA_GDR_Copy_Disabled=0|us|ref=0 (l=null, u=null)|git=None,network_adapter=mlx5_0:1,H_D,num_nodes=2,ucx_tls=['rc', 'cuda_copy'],benchmark=latency,communication_type=H_D,latency
2022-05-11T08:28:41+02:00|reframe 3.10.0-dev.3|GpuDirectRdmaTest_latency_H_D on cscs-daint:daint-icc21-impi21-ib-umod-gpu using gpu-direct-rdma|jobid=38343046|4194304_RDMA_GDR_Copy_Disabled=0|us|ref=0 (l=null, u=null)|git=None,network_adapter=mlx5_0:1,H_D,num_nodes=2,ucx_tls=['rc', 'cuda_copy'],benchmark=latency,communication_type=H_D,latency
