2022-11-03T09:01:15+01:00|reframe 3.12.0|FunclibDftTest %conf=baselines=256,channels=64 @generic:default+gnu|jobid=78966|elapsed_time_v00_cpu=0.01778|s|ref=0 (l=null, u=null)|num_components=20,pols=1,version=2,unique_key=73bd6b78-7af6-4622-b95d-f8e9bf69a309,channels=64,device=2,git_src=None,start=100000000,baselines=256,times=10,num_cores=12,step=100000,git=97a9c1d3004e9dbebc45a20b47eb36fbf30a1098
2022-11-03T09:01:15+01:00|reframe 3.12.0|FunclibDftTest %conf=baselines=256,channels=64 @generic:default+gnu|jobid=78966|elapsed_time_v00_gpu=0.00097|s|ref=0 (l=null, u=null)|num_components=20,pols=1,version=2,unique_key=73bd6b78-7af6-4622-b95d-f8e9bf69a309,channels=64,device=2,git_src=None,start=100000000,baselines=256,times=10,num_cores=12,step=100000,git=97a9c1d3004e9dbebc45a20b47eb36fbf30a1098
2022-11-03T09:01:15+01:00|reframe 3.12.0|FunclibDftTest %conf=baselines=256,channels=64 @generic:default+gnu|jobid=78966|elapsed_time_v01_cpu=0.02238|s|ref=0 (l=null, u=null)|num_components=20,pols=1,version=2,unique_key=73bd6b78-7af6-4622-b95d-f8e9bf69a309,channels=64,device=2,git_src=None,start=100000000,baselines=256,times=10,num_cores=12,step=100000,git=97a9c1d3004e9dbebc45a20b47eb36fbf30a1098
2022-11-03T09:01:15+01:00|reframe 3.12.0|FunclibDftTest %conf=baselines=256,channels=64 @generic:default+gnu|jobid=78966|elapsed_time_v01_gpu=0.00046|s|ref=0 (l=null, u=null)|num_components=20,pols=1,version=2,unique_key=73bd6b78-7af6-4622-b95d-f8e9bf69a309,channels=64,device=2,git_src=None,start=100000000,baselines=256,times=10,num_cores=12,step=100000,git=97a9c1d3004e9dbebc45a20b47eb36fbf30a1098
2022-11-03T09:14:43+01:00|reframe 3.12.0|FunclibDftTest %conf=baselines=256,channels=64 @generic:default+gnu|jobid=86421|elapsed_time_v00_cpu=0.01873|s|ref=0 (l=null, u=null)|start=100000000,unique_key=3ca5bd9c-8782-4a2e-80e7-63cad14424cd,version=2,step=100000,baselines=256,git_src=None,channels=64,num_cores=12,times=10,git=97a9c1d3004e9dbebc45a20b47eb36fbf30a1098,device=2,num_components=20,pols=1
2022-11-03T09:14:43+01:00|reframe 3.12.0|FunclibDftTest %conf=baselines=256,channels=64 @generic:default+gnu|jobid=86421|elapsed_time_v00_gpu=0.00118|s|ref=0 (l=null, u=null)|start=100000000,unique_key=3ca5bd9c-8782-4a2e-80e7-63cad14424cd,version=2,step=100000,baselines=256,git_src=None,channels=64,num_cores=12,times=10,git=97a9c1d3004e9dbebc45a20b47eb36fbf30a1098,device=2,num_components=20,pols=1
2022-11-03T09:14:43+01:00|reframe 3.12.0|FunclibDftTest %conf=baselines=256,channels=64 @generic:default+gnu|jobid=86421|elapsed_time_v01_cpu=0.02505|s|ref=0 (l=null, u=null)|start=100000000,unique_key=3ca5bd9c-8782-4a2e-80e7-63cad14424cd,version=2,step=100000,baselines=256,git_src=None,channels=64,num_cores=12,times=10,git=97a9c1d3004e9dbebc45a20b47eb36fbf30a1098,device=2,num_components=20,pols=1
2022-11-03T09:14:43+01:00|reframe 3.12.0|FunclibDftTest %conf=baselines=256,channels=64 @generic:default+gnu|jobid=86421|elapsed_time_v01_gpu=0.0001|s|ref=0 (l=null, u=null)|start=100000000,unique_key=3ca5bd9c-8782-4a2e-80e7-63cad14424cd,version=2,step=100000,baselines=256,git_src=None,channels=64,num_cores=12,times=10,git=97a9c1d3004e9dbebc45a20b47eb36fbf30a1098,device=2,num_components=20,pols=1
