{
  "arch": "skylake_avx512",
  "topology": {
    "numa_nodes": [
      "0x000000ffffff000000ffffff",
      "0xffffff000000ffffff000000"
    ],
    "sockets": [
      "0x000000ffffff000000ffffff",
      "0xffffff000000ffffff000000"
    ],
    "cores": [
      "0x000000000001000000000001",
      "0x000000000002000000000002",
      "0x000000000004000000000004",
      "0x000000000008000000000008",
      "0x000000000010000000000010",
      "0x000000000020000000000020",
      "0x000000000040000000000040",
      "0x000000000080000000000080",
      "0x000000000100000000000100",
      "0x000000000200000000000200",
      "0x000000000400000000000400",
      "0x000000000800000000000800",
      "0x000000001000000000001000",
      "0x000000002000000000002000",
      "0x000000004000000000004000",
      "0x000000008000000000008000",
      "0x000000010000000000010000",
      "0x000000020000000000020000",
      "0x000000040000000000040000",
      "0x000000080000000000080000",
      "0x000000100000000000100000",
      "0x000000200000000000200000",
      "0x000000400000000000400000",
      "0x000000800000000000800000",
      "0x000001000000000001000000",
      "0x000002000000000002000000",
      "0x000004000000000004000000",
      "0x000008000000000008000000",
      "0x000010000000000010000000",
      "0x000020000000000020000000",
      "0x000040000000000040000000",
      "0x000080000000000080000000",
      "0x000100000000000100000000",
      "0x000200000000000200000000",
      "0x000400000000000400000000",
      "0x000800000000000800000000",
      "0x001000000000001000000000",
      "0x002000000000002000000000",
      "0x004000000000004000000000",
      "0x008000000000008000000000",
      "0x010000000000010000000000",
      "0x020000000000020000000000",
      "0x040000000000040000000000",
      "0x080000000000080000000000",
      "0x100000000000100000000000",
      "0x200000000000200000000000",
      "0x400000000000400000000000",
      "0x800000000000800000000000"
    ],
    "caches": [
      {
        "type": "L2",
        "size": 1048576,
        "linesize": 64,
        "associativity": 16,
        "num_cpus": 2,
        "cpusets": [
          "0x000000000001000000000001",
          "0x000000000002000000000002",
          "0x000000000004000000000004",
          "0x000000000008000000000008",
          "0x000000000010000000000010",
          "0x000000000020000000000020",
          "0x000000000040000000000040",
          "0x000000000080000000000080",
          "0x000000000100000000000100",
          "0x000000000200000000000200",
          "0x000000000400000000000400",
          "0x000000000800000000000800",
          "0x000000001000000000001000",
          "0x000000002000000000002000",
          "0x000000004000000000004000",
          "0x000000008000000000008000",
          "0x000000010000000000010000",
          "0x000000020000000000020000",
          "0x000000040000000000040000",
          "0x000000080000000000080000",
          "0x000000100000000000100000",
          "0x000000200000000000200000",
          "0x000000400000000000400000",
          "0x000000800000000000800000",
          "0x000001000000000001000000",
          "0x000002000000000002000000",
          "0x000004000000000004000000",
          "0x000008000000000008000000",
          "0x000010000000000010000000",
          "0x000020000000000020000000",
          "0x000040000000000040000000",
          "0x000080000000000080000000",
          "0x000100000000000100000000",
          "0x000200000000000200000000",
          "0x000400000000000400000000",
          "0x000800000000000800000000",
          "0x001000000000001000000000",
          "0x002000000000002000000000",
          "0x004000000000004000000000",
          "0x008000000000008000000000",
          "0x010000000000010000000000",
          "0x020000000000020000000000",
          "0x040000000000040000000000",
          "0x080000000000080000000000",
          "0x100000000000100000000000",
          "0x200000000000200000000000",
          "0x400000000000400000000000",
          "0x800000000000800000000000"
        ]
      },
      {
        "type": "L1",
        "size": 32768,
        "linesize": 64,
        "associativity": 8,
        "num_cpus": 2,
        "cpusets": [
          "0x000000000001000000000001",
          "0x000000000002000000000002",
          "0x000000000004000000000004",
          "0x000000000008000000000008",
          "0x000000000010000000000010",
          "0x000000000020000000000020",
          "0x000000000040000000000040",
          "0x000000000080000000000080",
          "0x000000000100000000000100",
          "0x000000000200000000000200",
          "0x000000000400000000000400",
          "0x000000000800000000000800",
          "0x000000001000000000001000",
          "0x000000002000000000002000",
          "0x000000004000000000004000",
          "0x000000008000000000008000",
          "0x000000010000000000010000",
          "0x000000020000000000020000",
          "0x000000040000000000040000",
          "0x000000080000000000080000",
          "0x000000100000000000100000",
          "0x000000200000000000200000",
          "0x000000400000000000400000",
          "0x000000800000000000800000",
          "0x000001000000000001000000",
          "0x000002000000000002000000",
          "0x000004000000000004000000",
          "0x000008000000000008000000",
          "0x000010000000000010000000",
          "0x000020000000000020000000",
          "0x000040000000000040000000",
          "0x000080000000000080000000",
          "0x000100000000000100000000",
          "0x000200000000000200000000",
          "0x000400000000000400000000",
          "0x000800000000000800000000",
          "0x001000000000001000000000",
          "0x002000000000002000000000",
          "0x004000000000004000000000",
          "0x008000000000008000000000",
          "0x010000000000010000000000",
          "0x020000000000020000000000",
          "0x040000000000040000000000",
          "0x080000000000080000000000",
          "0x100000000000100000000000",
          "0x200000000000200000000000",
          "0x400000000000400000000000",
          "0x800000000000800000000000"
        ]
      },
      {
        "type": "L3",
        "size": 34603008,
        "linesize": 64,
        "associativity": 11,
        "num_cpus": 48,
        "cpusets": [
          "0x000000ffffff000000ffffff",
          "0xffffff000000ffffff000000"
        ]
      }
    ]
  },
  "num_cpus": 96,
  "num_cpus_per_core": 2,
  "num_cpus_per_socket": 48,
  "num_sockets": 2
}
