{
  "arch": "skylake_avx512",
  "topology": {
    "numa_nodes": [
      "0x5555555555555555",
      "0xaaaaaaaaaaaaaaaa"
    ],
    "sockets": [
      "0x5555555555555555",
      "0xaaaaaaaaaaaaaaaa"
    ],
    "cores": [
      "0x0000000100000001",
      "0x0000000200000002",
      "0x0000000400000004",
      "0x0000000800000008",
      "0x0000001000000010",
      "0x0000002000000020",
      "0x0000004000000040",
      "0x0000008000000080",
      "0x0000010000000100",
      "0x0000020000000200",
      "0x0000040000000400",
      "0x0000080000000800",
      "0x0000100000001000",
      "0x0000200000002000",
      "0x0000400000004000",
      "0x0000800000008000",
      "0x0001000000010000",
      "0x0002000000020000",
      "0x0004000000040000",
      "0x0008000000080000",
      "0x0010000000100000",
      "0x0020000000200000",
      "0x0040000000400000",
      "0x0080000000800000",
      "0x0100000001000000",
      "0x0200000002000000",
      "0x0400000004000000",
      "0x0800000008000000",
      "0x1000000010000000",
      "0x2000000020000000",
      "0x4000000040000000",
      "0x8000000080000000"
    ],
    "caches": [
      {
        "type": "L2",
        "size": 1048576,
        "linesize": 64,
        "associativity": 16,
        "num_cpus": 2,
        "cpusets": [
          "0x0000000100000001",
          "0x0000000200000002",
          "0x0000000400000004",
          "0x0000000800000008",
          "0x0000001000000010",
          "0x0000002000000020",
          "0x0000004000000040",
          "0x0000008000000080",
          "0x0000010000000100",
          "0x0000020000000200",
          "0x0000040000000400",
          "0x0000080000000800",
          "0x0000100000001000",
          "0x0000200000002000",
          "0x0000400000004000",
          "0x0000800000008000",
          "0x0001000000010000",
          "0x0002000000020000",
          "0x0004000000040000",
          "0x0008000000080000",
          "0x0010000000100000",
          "0x0020000000200000",
          "0x0040000000400000",
          "0x0080000000800000",
          "0x0100000001000000",
          "0x0200000002000000",
          "0x0400000004000000",
          "0x0800000008000000",
          "0x1000000010000000",
          "0x2000000020000000",
          "0x4000000040000000",
          "0x8000000080000000"
        ]
      },
      {
        "type": "L1",
        "size": 32768,
        "linesize": 64,
        "associativity": 8,
        "num_cpus": 2,
        "cpusets": [
          "0x0000000100000001",
          "0x0000000200000002",
          "0x0000000400000004",
          "0x0000000800000008",
          "0x0000001000000010",
          "0x0000002000000020",
          "0x0000004000000040",
          "0x0000008000000080",
          "0x0000010000000100",
          "0x0000020000000200",
          "0x0000040000000400",
          "0x0000080000000800",
          "0x0000100000001000",
          "0x0000200000002000",
          "0x0000400000004000",
          "0x0000800000008000",
          "0x0001000000010000",
          "0x0002000000020000",
          "0x0004000000040000",
          "0x0008000000080000",
          "0x0010000000100000",
          "0x0020000000200000",
          "0x0040000000400000",
          "0x0080000000800000",
          "0x0100000001000000",
          "0x0200000002000000",
          "0x0400000004000000",
          "0x0800000008000000",
          "0x1000000010000000",
          "0x2000000020000000",
          "0x4000000040000000",
          "0x8000000080000000"
        ]
      },
      {
        "type": "L3",
        "size": 23068672,
        "linesize": 64,
        "associativity": 11,
        "num_cpus": 32,
        "cpusets": [
          "0x5555555555555555",
          "0xaaaaaaaaaaaaaaaa"
        ]
      }
    ]
  },
  "num_cpus": 64,
  "num_cpus_per_core": 2,
  "num_cpus_per_socket": 32,
  "num_sockets": 2
}
