2022-05-11T08:28:42+02:00|reframe 3.10.0-dev.3|GpuDirectRdmaTest_bw_D_H on cscs-daint:daint-icc21-impi21-ib-umod-gpu using gpu-direct-rdma|jobid=38343053|1_RDMA_GDR_Copy_Enabled=0|MB/s|ref=0 (l=null, u=null)|git=None,benchmark=bw,network_adapter=mlx5_0:1,num_nodes=2,ucx_tls=['rc', 'cuda_copy'],D_H,bw,communication_type=D_H
2022-05-11T08:28:42+02:00|reframe 3.10.0-dev.3|GpuDirectRdmaTest_bw_D_H on cscs-daint:daint-icc21-impi21-ib-umod-gpu using gpu-direct-rdma|jobid=38343053|1_RDMA_Enabled_GDR_Copy_Disabled=0|MB/s|ref=0 (l=null, u=null)|git=None,benchmark=bw,network_adapter=mlx5_0:1,num_nodes=2,ucx_tls=['rc', 'cuda_copy'],D_H,bw,communication_type=D_H
2022-05-11T08:28:42+02:00|reframe 3.10.0-dev.3|GpuDirectRdmaTest_bw_D_H on cscs-daint:daint-icc21-impi21-ib-umod-gpu using gpu-direct-rdma|jobid=38343053|1_RDMA_Disabled_GDR_Copy_Enabled=0|MB/s|ref=0 (l=null, u=null)|git=None,benchmark=bw,network_adapter=mlx5_0:1,num_nodes=2,ucx_tls=['rc', 'cuda_copy'],D_H,bw,communication_type=D_H
2022-05-11T08:28:42+02:00|reframe 3.10.0-dev.3|GpuDirectRdmaTest_bw_D_H on cscs-daint:daint-icc21-impi21-ib-umod-gpu using gpu-direct-rdma|jobid=38343053|1_RDMA_GDR_Copy_Disabled=0|MB/s|ref=0 (l=null, u=null)|git=None,benchmark=bw,network_adapter=mlx5_0:1,num_nodes=2,ucx_tls=['rc', 'cuda_copy'],D_H,bw,communication_type=D_H
2022-05-11T08:28:42+02:00|reframe 3.10.0-dev.3|GpuDirectRdmaTest_bw_D_H on cscs-daint:daint-icc21-impi21-ib-umod-gpu using gpu-direct-rdma|jobid=38343053|2_RDMA_GDR_Copy_Enabled=0|MB/s|ref=0 (l=null, u=null)|git=None,benchmark=bw,network_adapter=mlx5_0:1,num_nodes=2,ucx_tls=['rc', 'cuda_copy'],D_H,bw,communication_type=D_H
2022-05-11T08:28:42+02:00|reframe 3.10.0-dev.3|GpuDirectRdmaTest_bw_D_H on cscs-daint:daint-icc21-impi21-ib-umod-gpu using gpu-direct-rdma|jobid=38343053|4_RDMA_GDR_Copy_Enabled=0|MB/s|ref=0 (l=null, u=null)|git=None,benchmark=bw,network_adapter=mlx5_0:1,num_nodes=2,ucx_tls=['rc', 'cuda_copy'],D_H,bw,communication_type=D_H
2022-05-11T08:28:42+02:00|reframe 3.10.0-dev.3|GpuDirectRdmaTest_bw_D_H on cscs-daint:daint-icc21-impi21-ib-umod-gpu using gpu-direct-rdma|jobid=38343053|8_RDMA_GDR_Copy_Enabled=0|MB/s|ref=0 (l=null, u=null)|git=None,benchmark=bw,network_adapter=mlx5_0:1,num_nodes=2,ucx_tls=['rc', 'cuda_copy'],D_H,bw,communication_type=D_H
2022-05-11T08:28:42+02:00|reframe 3.10.0-dev.3|GpuDirectRdmaTest_bw_D_H on cscs-daint:daint-icc21-impi21-ib-umod-gpu using gpu-direct-rdma|jobid=38343053|16_RDMA_GDR_Copy_Enabled=0|MB/s|ref=0 (l=null, u=null)|git=None,benchmark=bw,network_adapter=mlx5_0:1,num_nodes=2,ucx_tls=['rc', 'cuda_copy'],D_H,bw,communication_type=D_H
2022-05-11T08:28:42+02:00|reframe 3.10.0-dev.3|GpuDirectRdmaTest_bw_D_H on cscs-daint:daint-icc21-impi21-ib-umod-gpu using gpu-direct-rdma|jobid=38343053|32_RDMA_GDR_Copy_Enabled=0|MB/s|ref=0 (l=null, u=null)|git=None,benchmark=bw,network_adapter=mlx5_0:1,num_nodes=2,ucx_tls=['rc', 'cuda_copy'],D_H,bw,communication_type=D_H
2022-05-11T08:28:42+02:00|reframe 3.10.0-dev.3|GpuDirectRdmaTest_bw_D_H on cscs-daint:daint-icc21-impi21-ib-umod-gpu using gpu-direct-rdma|jobid=38343053|64_RDMA_GDR_Copy_Enabled=0|MB/s|ref=0 (l=null, u=null)|git=None,benchmark=bw,network_adapter=mlx5_0:1,num_nodes=2,ucx_tls=['rc', 'cuda_copy'],D_H,bw,communication_type=D_H
2022-05-11T08:28:42+02:00|reframe 3.10.0-dev.3|GpuDirectRdmaTest_bw_D_H on cscs-daint:daint-icc21-impi21-ib-umod-gpu using gpu-direct-rdma|jobid=38343053|128_RDMA_GDR_Copy_Enabled=0|MB/s|ref=0 (l=null, u=null)|git=None,benchmark=bw,network_adapter=mlx5_0:1,num_nodes=2,ucx_tls=['rc', 'cuda_copy'],D_H,bw,communication_type=D_H
2022-05-11T08:28:42+02:00|reframe 3.10.0-dev.3|GpuDirectRdmaTest_bw_D_H on cscs-daint:daint-icc21-impi21-ib-umod-gpu using gpu-direct-rdma|jobid=38343053|256_RDMA_GDR_Copy_Enabled=0|MB/s|ref=0 (l=null, u=null)|git=None,benchmark=bw,network_adapter=mlx5_0:1,num_nodes=2,ucx_tls=['rc', 'cuda_copy'],D_H,bw,communication_type=D_H
2022-05-11T08:28:42+02:00|reframe 3.10.0-dev.3|GpuDirectRdmaTest_bw_D_H on cscs-daint:daint-icc21-impi21-ib-umod-gpu using gpu-direct-rdma|jobid=38343053|512_RDMA_GDR_Copy_Enabled=0|MB/s|ref=0 (l=null, u=null)|git=None,benchmark=bw,network_adapter=mlx5_0:1,num_nodes=2,ucx_tls=['rc', 'cuda_copy'],D_H,bw,communication_type=D_H
2022-05-11T08:28:42+02:00|reframe 3.10.0-dev.3|GpuDirectRdmaTest_bw_D_H on cscs-daint:daint-icc21-impi21-ib-umod-gpu using gpu-direct-rdma|jobid=38343053|1024_RDMA_GDR_Copy_Enabled=0|MB/s|ref=0 (l=null, u=null)|git=None,benchmark=bw,network_adapter=mlx5_0:1,num_nodes=2,ucx_tls=['rc', 'cuda_copy'],D_H,bw,communication_type=D_H
2022-05-11T08:28:42+02:00|reframe 3.10.0-dev.3|GpuDirectRdmaTest_bw_D_H on cscs-daint:daint-icc21-impi21-ib-umod-gpu using gpu-direct-rdma|jobid=38343053|2048_RDMA_GDR_Copy_Enabled=0|MB/s|ref=0 (l=null, u=null)|git=None,benchmark=bw,network_adapter=mlx5_0:1,num_nodes=2,ucx_tls=['rc', 'cuda_copy'],D_H,bw,communication_type=D_H
2022-05-11T08:28:42+02:00|reframe 3.10.0-dev.3|GpuDirectRdmaTest_bw_D_H on cscs-daint:daint-icc21-impi21-ib-umod-gpu using gpu-direct-rdma|jobid=38343053|4096_RDMA_GDR_Copy_Enabled=0|MB/s|ref=0 (l=null, u=null)|git=None,benchmark=bw,network_adapter=mlx5_0:1,num_nodes=2,ucx_tls=['rc', 'cuda_copy'],D_H,bw,communication_type=D_H
2022-05-11T08:28:42+02:00|reframe 3.10.0-dev.3|GpuDirectRdmaTest_bw_D_H on cscs-daint:daint-icc21-impi21-ib-umod-gpu using gpu-direct-rdma|jobid=38343053|8192_RDMA_GDR_Copy_Enabled=0|MB/s|ref=0 (l=null, u=null)|git=None,benchmark=bw,network_adapter=mlx5_0:1,num_nodes=2,ucx_tls=['rc', 'cuda_copy'],D_H,bw,communication_type=D_H
2022-05-11T08:28:42+02:00|reframe 3.10.0-dev.3|GpuDirectRdmaTest_bw_D_H on cscs-daint:daint-icc21-impi21-ib-umod-gpu using gpu-direct-rdma|jobid=38343053|16384_RDMA_GDR_Copy_Enabled=0|MB/s|ref=0 (l=null, u=null)|git=None,benchmark=bw,network_adapter=mlx5_0:1,num_nodes=2,ucx_tls=['rc', 'cuda_copy'],D_H,bw,communication_type=D_H
2022-05-11T08:28:42+02:00|reframe 3.10.0-dev.3|GpuDirectRdmaTest_bw_D_H on cscs-daint:daint-icc21-impi21-ib-umod-gpu using gpu-direct-rdma|jobid=38343053|32768_RDMA_GDR_Copy_Enabled=0|MB/s|ref=0 (l=null, u=null)|git=None,benchmark=bw,network_adapter=mlx5_0:1,num_nodes=2,ucx_tls=['rc', 'cuda_copy'],D_H,bw,communication_type=D_H
2022-05-11T08:28:42+02:00|reframe 3.10.0-dev.3|GpuDirectRdmaTest_bw_D_H on cscs-daint:daint-icc21-impi21-ib-umod-gpu using gpu-direct-rdma|jobid=38343053|65536_RDMA_GDR_Copy_Enabled=0|MB/s|ref=0 (l=null, u=null)|git=None,benchmark=bw,network_adapter=mlx5_0:1,num_nodes=2,ucx_tls=['rc', 'cuda_copy'],D_H,bw,communication_type=D_H
2022-05-11T08:28:42+02:00|reframe 3.10.0-dev.3|GpuDirectRdmaTest_bw_D_H on cscs-daint:daint-icc21-impi21-ib-umod-gpu using gpu-direct-rdma|jobid=38343053|131072_RDMA_GDR_Copy_Enabled=0|MB/s|ref=0 (l=null, u=null)|git=None,benchmark=bw,network_adapter=mlx5_0:1,num_nodes=2,ucx_tls=['rc', 'cuda_copy'],D_H,bw,communication_type=D_H
2022-05-11T08:28:42+02:00|reframe 3.10.0-dev.3|GpuDirectRdmaTest_bw_D_H on cscs-daint:daint-icc21-impi21-ib-umod-gpu using gpu-direct-rdma|jobid=38343053|262144_RDMA_GDR_Copy_Enabled=0|MB/s|ref=0 (l=null, u=null)|git=None,benchmark=bw,network_adapter=mlx5_0:1,num_nodes=2,ucx_tls=['rc', 'cuda_copy'],D_H,bw,communication_type=D_H
2022-05-11T08:28:42+02:00|reframe 3.10.0-dev.3|GpuDirectRdmaTest_bw_D_H on cscs-daint:daint-icc21-impi21-ib-umod-gpu using gpu-direct-rdma|jobid=38343053|524288_RDMA_GDR_Copy_Enabled=0|MB/s|ref=0 (l=null, u=null)|git=None,benchmark=bw,network_adapter=mlx5_0:1,num_nodes=2,ucx_tls=['rc', 'cuda_copy'],D_H,bw,communication_type=D_H
2022-05-11T08:28:42+02:00|reframe 3.10.0-dev.3|GpuDirectRdmaTest_bw_D_H on cscs-daint:daint-icc21-impi21-ib-umod-gpu using gpu-direct-rdma|jobid=38343053|1048576_RDMA_GDR_Copy_Enabled=0|MB/s|ref=0 (l=null, u=null)|git=None,benchmark=bw,network_adapter=mlx5_0:1,num_nodes=2,ucx_tls=['rc', 'cuda_copy'],D_H,bw,communication_type=D_H
2022-05-11T08:28:42+02:00|reframe 3.10.0-dev.3|GpuDirectRdmaTest_bw_D_H on cscs-daint:daint-icc21-impi21-ib-umod-gpu using gpu-direct-rdma|jobid=38343053|2097152_RDMA_GDR_Copy_Enabled=0|MB/s|ref=0 (l=null, u=null)|git=None,benchmark=bw,network_adapter=mlx5_0:1,num_nodes=2,ucx_tls=['rc', 'cuda_copy'],D_H,bw,communication_type=D_H
2022-05-11T08:28:42+02:00|reframe 3.10.0-dev.3|GpuDirectRdmaTest_bw_D_H on cscs-daint:daint-icc21-impi21-ib-umod-gpu using gpu-direct-rdma|jobid=38343053|4194304_RDMA_GDR_Copy_Enabled=0|MB/s|ref=0 (l=null, u=null)|git=None,benchmark=bw,network_adapter=mlx5_0:1,num_nodes=2,ucx_tls=['rc', 'cuda_copy'],D_H,bw,communication_type=D_H
2022-05-11T08:28:42+02:00|reframe 3.10.0-dev.3|GpuDirectRdmaTest_bw_D_H on cscs-daint:daint-icc21-impi21-ib-umod-gpu using gpu-direct-rdma|jobid=38343053|2_RDMA_Enabled_GDR_Copy_Disabled=0|MB/s|ref=0 (l=null, u=null)|git=None,benchmark=bw,network_adapter=mlx5_0:1,num_nodes=2,ucx_tls=['rc', 'cuda_copy'],D_H,bw,communication_type=D_H
2022-05-11T08:28:42+02:00|reframe 3.10.0-dev.3|GpuDirectRdmaTest_bw_D_H on cscs-daint:daint-icc21-impi21-ib-umod-gpu using gpu-direct-rdma|jobid=38343053|4_RDMA_Enabled_GDR_Copy_Disabled=0|MB/s|ref=0 (l=null, u=null)|git=None,benchmark=bw,network_adapter=mlx5_0:1,num_nodes=2,ucx_tls=['rc', 'cuda_copy'],D_H,bw,communication_type=D_H
2022-05-11T08:28:42+02:00|reframe 3.10.0-dev.3|GpuDirectRdmaTest_bw_D_H on cscs-daint:daint-icc21-impi21-ib-umod-gpu using gpu-direct-rdma|jobid=38343053|8_RDMA_Enabled_GDR_Copy_Disabled=0|MB/s|ref=0 (l=null, u=null)|git=None,benchmark=bw,network_adapter=mlx5_0:1,num_nodes=2,ucx_tls=['rc', 'cuda_copy'],D_H,bw,communication_type=D_H
2022-05-11T08:28:42+02:00|reframe 3.10.0-dev.3|GpuDirectRdmaTest_bw_D_H on cscs-daint:daint-icc21-impi21-ib-umod-gpu using gpu-direct-rdma|jobid=38343053|16_RDMA_Enabled_GDR_Copy_Disabled=0|MB/s|ref=0 (l=null, u=null)|git=None,benchmark=bw,network_adapter=mlx5_0:1,num_nodes=2,ucx_tls=['rc', 'cuda_copy'],D_H,bw,communication_type=D_H
2022-05-11T08:28:42+02:00|reframe 3.10.0-dev.3|GpuDirectRdmaTest_bw_D_H on cscs-daint:daint-icc21-impi21-ib-umod-gpu using gpu-direct-rdma|jobid=38343053|32_RDMA_Enabled_GDR_Copy_Disabled=0|MB/s|ref=0 (l=null, u=null)|git=None,benchmark=bw,network_adapter=mlx5_0:1,num_nodes=2,ucx_tls=['rc', 'cuda_copy'],D_H,bw,communication_type=D_H
2022-05-11T08:28:42+02:00|reframe 3.10.0-dev.3|GpuDirectRdmaTest_bw_D_H on cscs-daint:daint-icc21-impi21-ib-umod-gpu using gpu-direct-rdma|jobid=38343053|64_RDMA_Enabled_GDR_Copy_Disabled=0|MB/s|ref=0 (l=null, u=null)|git=None,benchmark=bw,network_adapter=mlx5_0:1,num_nodes=2,ucx_tls=['rc', 'cuda_copy'],D_H,bw,communication_type=D_H
2022-05-11T08:28:42+02:00|reframe 3.10.0-dev.3|GpuDirectRdmaTest_bw_D_H on cscs-daint:daint-icc21-impi21-ib-umod-gpu using gpu-direct-rdma|jobid=38343053|128_RDMA_Enabled_GDR_Copy_Disabled=0|MB/s|ref=0 (l=null, u=null)|git=None,benchmark=bw,network_adapter=mlx5_0:1,num_nodes=2,ucx_tls=['rc', 'cuda_copy'],D_H,bw,communication_type=D_H
2022-05-11T08:28:42+02:00|reframe 3.10.0-dev.3|GpuDirectRdmaTest_bw_D_H on cscs-daint:daint-icc21-impi21-ib-umod-gpu using gpu-direct-rdma|jobid=38343053|256_RDMA_Enabled_GDR_Copy_Disabled=0|MB/s|ref=0 (l=null, u=null)|git=None,benchmark=bw,network_adapter=mlx5_0:1,num_nodes=2,ucx_tls=['rc', 'cuda_copy'],D_H,bw,communication_type=D_H
2022-05-11T08:28:42+02:00|reframe 3.10.0-dev.3|GpuDirectRdmaTest_bw_D_H on cscs-daint:daint-icc21-impi21-ib-umod-gpu using gpu-direct-rdma|jobid=38343053|512_RDMA_Enabled_GDR_Copy_Disabled=0|MB/s|ref=0 (l=null, u=null)|git=None,benchmark=bw,network_adapter=mlx5_0:1,num_nodes=2,ucx_tls=['rc', 'cuda_copy'],D_H,bw,communication_type=D_H
2022-05-11T08:28:42+02:00|reframe 3.10.0-dev.3|GpuDirectRdmaTest_bw_D_H on cscs-daint:daint-icc21-impi21-ib-umod-gpu using gpu-direct-rdma|jobid=38343053|1024_RDMA_Enabled_GDR_Copy_Disabled=0|MB/s|ref=0 (l=null, u=null)|git=None,benchmark=bw,network_adapter=mlx5_0:1,num_nodes=2,ucx_tls=['rc', 'cuda_copy'],D_H,bw,communication_type=D_H
2022-05-11T08:28:42+02:00|reframe 3.10.0-dev.3|GpuDirectRdmaTest_bw_D_H on cscs-daint:daint-icc21-impi21-ib-umod-gpu using gpu-direct-rdma|jobid=38343053|2048_RDMA_Enabled_GDR_Copy_Disabled=0|MB/s|ref=0 (l=null, u=null)|git=None,benchmark=bw,network_adapter=mlx5_0:1,num_nodes=2,ucx_tls=['rc', 'cuda_copy'],D_H,bw,communication_type=D_H
2022-05-11T08:28:42+02:00|reframe 3.10.0-dev.3|GpuDirectRdmaTest_bw_D_H on cscs-daint:daint-icc21-impi21-ib-umod-gpu using gpu-direct-rdma|jobid=38343053|4096_RDMA_Enabled_GDR_Copy_Disabled=0|MB/s|ref=0 (l=null, u=null)|git=None,benchmark=bw,network_adapter=mlx5_0:1,num_nodes=2,ucx_tls=['rc', 'cuda_copy'],D_H,bw,communication_type=D_H
2022-05-11T08:28:42+02:00|reframe 3.10.0-dev.3|GpuDirectRdmaTest_bw_D_H on cscs-daint:daint-icc21-impi21-ib-umod-gpu using gpu-direct-rdma|jobid=38343053|8192_RDMA_Enabled_GDR_Copy_Disabled=0|MB/s|ref=0 (l=null, u=null)|git=None,benchmark=bw,network_adapter=mlx5_0:1,num_nodes=2,ucx_tls=['rc', 'cuda_copy'],D_H,bw,communication_type=D_H
2022-05-11T08:28:42+02:00|reframe 3.10.0-dev.3|GpuDirectRdmaTest_bw_D_H on cscs-daint:daint-icc21-impi21-ib-umod-gpu using gpu-direct-rdma|jobid=38343053|16384_RDMA_Enabled_GDR_Copy_Disabled=0|MB/s|ref=0 (l=null, u=null)|git=None,benchmark=bw,network_adapter=mlx5_0:1,num_nodes=2,ucx_tls=['rc', 'cuda_copy'],D_H,bw,communication_type=D_H
2022-05-11T08:28:42+02:00|reframe 3.10.0-dev.3|GpuDirectRdmaTest_bw_D_H on cscs-daint:daint-icc21-impi21-ib-umod-gpu using gpu-direct-rdma|jobid=38343053|32768_RDMA_Enabled_GDR_Copy_Disabled=0|MB/s|ref=0 (l=null, u=null)|git=None,benchmark=bw,network_adapter=mlx5_0:1,num_nodes=2,ucx_tls=['rc', 'cuda_copy'],D_H,bw,communication_type=D_H
2022-05-11T08:28:42+02:00|reframe 3.10.0-dev.3|GpuDirectRdmaTest_bw_D_H on cscs-daint:daint-icc21-impi21-ib-umod-gpu using gpu-direct-rdma|jobid=38343053|65536_RDMA_Enabled_GDR_Copy_Disabled=0|MB/s|ref=0 (l=null, u=null)|git=None,benchmark=bw,network_adapter=mlx5_0:1,num_nodes=2,ucx_tls=['rc', 'cuda_copy'],D_H,bw,communication_type=D_H
2022-05-11T08:28:42+02:00|reframe 3.10.0-dev.3|GpuDirectRdmaTest_bw_D_H on cscs-daint:daint-icc21-impi21-ib-umod-gpu using gpu-direct-rdma|jobid=38343053|131072_RDMA_Enabled_GDR_Copy_Disabled=0|MB/s|ref=0 (l=null, u=null)|git=None,benchmark=bw,network_adapter=mlx5_0:1,num_nodes=2,ucx_tls=['rc', 'cuda_copy'],D_H,bw,communication_type=D_H
2022-05-11T08:28:42+02:00|reframe 3.10.0-dev.3|GpuDirectRdmaTest_bw_D_H on cscs-daint:daint-icc21-impi21-ib-umod-gpu using gpu-direct-rdma|jobid=38343053|262144_RDMA_Enabled_GDR_Copy_Disabled=0|MB/s|ref=0 (l=null, u=null)|git=None,benchmark=bw,network_adapter=mlx5_0:1,num_nodes=2,ucx_tls=['rc', 'cuda_copy'],D_H,bw,communication_type=D_H
2022-05-11T08:28:42+02:00|reframe 3.10.0-dev.3|GpuDirectRdmaTest_bw_D_H on cscs-daint:daint-icc21-impi21-ib-umod-gpu using gpu-direct-rdma|jobid=38343053|524288_RDMA_Enabled_GDR_Copy_Disabled=0|MB/s|ref=0 (l=null, u=null)|git=None,benchmark=bw,network_adapter=mlx5_0:1,num_nodes=2,ucx_tls=['rc', 'cuda_copy'],D_H,bw,communication_type=D_H
2022-05-11T08:28:42+02:00|reframe 3.10.0-dev.3|GpuDirectRdmaTest_bw_D_H on cscs-daint:daint-icc21-impi21-ib-umod-gpu using gpu-direct-rdma|jobid=38343053|1048576_RDMA_Enabled_GDR_Copy_Disabled=0|MB/s|ref=0 (l=null, u=null)|git=None,benchmark=bw,network_adapter=mlx5_0:1,num_nodes=2,ucx_tls=['rc', 'cuda_copy'],D_H,bw,communication_type=D_H
2022-05-11T08:28:42+02:00|reframe 3.10.0-dev.3|GpuDirectRdmaTest_bw_D_H on cscs-daint:daint-icc21-impi21-ib-umod-gpu using gpu-direct-rdma|jobid=38343053|2097152_RDMA_Enabled_GDR_Copy_Disabled=0|MB/s|ref=0 (l=null, u=null)|git=None,benchmark=bw,network_adapter=mlx5_0:1,num_nodes=2,ucx_tls=['rc', 'cuda_copy'],D_H,bw,communication_type=D_H
2022-05-11T08:28:42+02:00|reframe 3.10.0-dev.3|GpuDirectRdmaTest_bw_D_H on cscs-daint:daint-icc21-impi21-ib-umod-gpu using gpu-direct-rdma|jobid=38343053|4194304_RDMA_Enabled_GDR_Copy_Disabled=0|MB/s|ref=0 (l=null, u=null)|git=None,benchmark=bw,network_adapter=mlx5_0:1,num_nodes=2,ucx_tls=['rc', 'cuda_copy'],D_H,bw,communication_type=D_H
2022-05-11T08:28:42+02:00|reframe 3.10.0-dev.3|GpuDirectRdmaTest_bw_D_H on cscs-daint:daint-icc21-impi21-ib-umod-gpu using gpu-direct-rdma|jobid=38343053|2_RDMA_Disabled_GDR_Copy_Enabled=0|MB/s|ref=0 (l=null, u=null)|git=None,benchmark=bw,network_adapter=mlx5_0:1,num_nodes=2,ucx_tls=['rc', 'cuda_copy'],D_H,bw,communication_type=D_H
2022-05-11T08:28:42+02:00|reframe 3.10.0-dev.3|GpuDirectRdmaTest_bw_D_H on cscs-daint:daint-icc21-impi21-ib-umod-gpu using gpu-direct-rdma|jobid=38343053|4_RDMA_Disabled_GDR_Copy_Enabled=0|MB/s|ref=0 (l=null, u=null)|git=None,benchmark=bw,network_adapter=mlx5_0:1,num_nodes=2,ucx_tls=['rc', 'cuda_copy'],D_H,bw,communication_type=D_H
2022-05-11T08:28:42+02:00|reframe 3.10.0-dev.3|GpuDirectRdmaTest_bw_D_H on cscs-daint:daint-icc21-impi21-ib-umod-gpu using gpu-direct-rdma|jobid=38343053|8_RDMA_Disabled_GDR_Copy_Enabled=0|MB/s|ref=0 (l=null, u=null)|git=None,benchmark=bw,network_adapter=mlx5_0:1,num_nodes=2,ucx_tls=['rc', 'cuda_copy'],D_H,bw,communication_type=D_H
2022-05-11T08:28:42+02:00|reframe 3.10.0-dev.3|GpuDirectRdmaTest_bw_D_H on cscs-daint:daint-icc21-impi21-ib-umod-gpu using gpu-direct-rdma|jobid=38343053|16_RDMA_Disabled_GDR_Copy_Enabled=0|MB/s|ref=0 (l=null, u=null)|git=None,benchmark=bw,network_adapter=mlx5_0:1,num_nodes=2,ucx_tls=['rc', 'cuda_copy'],D_H,bw,communication_type=D_H
2022-05-11T08:28:42+02:00|reframe 3.10.0-dev.3|GpuDirectRdmaTest_bw_D_H on cscs-daint:daint-icc21-impi21-ib-umod-gpu using gpu-direct-rdma|jobid=38343053|32_RDMA_Disabled_GDR_Copy_Enabled=0|MB/s|ref=0 (l=null, u=null)|git=None,benchmark=bw,network_adapter=mlx5_0:1,num_nodes=2,ucx_tls=['rc', 'cuda_copy'],D_H,bw,communication_type=D_H
2022-05-11T08:28:42+02:00|reframe 3.10.0-dev.3|GpuDirectRdmaTest_bw_D_H on cscs-daint:daint-icc21-impi21-ib-umod-gpu using gpu-direct-rdma|jobid=38343053|64_RDMA_Disabled_GDR_Copy_Enabled=0|MB/s|ref=0 (l=null, u=null)|git=None,benchmark=bw,network_adapter=mlx5_0:1,num_nodes=2,ucx_tls=['rc', 'cuda_copy'],D_H,bw,communication_type=D_H
2022-05-11T08:28:42+02:00|reframe 3.10.0-dev.3|GpuDirectRdmaTest_bw_D_H on cscs-daint:daint-icc21-impi21-ib-umod-gpu using gpu-direct-rdma|jobid=38343053|128_RDMA_Disabled_GDR_Copy_Enabled=0|MB/s|ref=0 (l=null, u=null)|git=None,benchmark=bw,network_adapter=mlx5_0:1,num_nodes=2,ucx_tls=['rc', 'cuda_copy'],D_H,bw,communication_type=D_H
2022-05-11T08:28:42+02:00|reframe 3.10.0-dev.3|GpuDirectRdmaTest_bw_D_H on cscs-daint:daint-icc21-impi21-ib-umod-gpu using gpu-direct-rdma|jobid=38343053|256_RDMA_Disabled_GDR_Copy_Enabled=0|MB/s|ref=0 (l=null, u=null)|git=None,benchmark=bw,network_adapter=mlx5_0:1,num_nodes=2,ucx_tls=['rc', 'cuda_copy'],D_H,bw,communication_type=D_H
2022-05-11T08:28:42+02:00|reframe 3.10.0-dev.3|GpuDirectRdmaTest_bw_D_H on cscs-daint:daint-icc21-impi21-ib-umod-gpu using gpu-direct-rdma|jobid=38343053|512_RDMA_Disabled_GDR_Copy_Enabled=0|MB/s|ref=0 (l=null, u=null)|git=None,benchmark=bw,network_adapter=mlx5_0:1,num_nodes=2,ucx_tls=['rc', 'cuda_copy'],D_H,bw,communication_type=D_H
2022-05-11T08:28:42+02:00|reframe 3.10.0-dev.3|GpuDirectRdmaTest_bw_D_H on cscs-daint:daint-icc21-impi21-ib-umod-gpu using gpu-direct-rdma|jobid=38343053|1024_RDMA_Disabled_GDR_Copy_Enabled=0|MB/s|ref=0 (l=null, u=null)|git=None,benchmark=bw,network_adapter=mlx5_0:1,num_nodes=2,ucx_tls=['rc', 'cuda_copy'],D_H,bw,communication_type=D_H
2022-05-11T08:28:42+02:00|reframe 3.10.0-dev.3|GpuDirectRdmaTest_bw_D_H on cscs-daint:daint-icc21-impi21-ib-umod-gpu using gpu-direct-rdma|jobid=38343053|2048_RDMA_Disabled_GDR_Copy_Enabled=0|MB/s|ref=0 (l=null, u=null)|git=None,benchmark=bw,network_adapter=mlx5_0:1,num_nodes=2,ucx_tls=['rc', 'cuda_copy'],D_H,bw,communication_type=D_H
2022-05-11T08:28:42+02:00|reframe 3.10.0-dev.3|GpuDirectRdmaTest_bw_D_H on cscs-daint:daint-icc21-impi21-ib-umod-gpu using gpu-direct-rdma|jobid=38343053|4096_RDMA_Disabled_GDR_Copy_Enabled=0|MB/s|ref=0 (l=null, u=null)|git=None,benchmark=bw,network_adapter=mlx5_0:1,num_nodes=2,ucx_tls=['rc', 'cuda_copy'],D_H,bw,communication_type=D_H
2022-05-11T08:28:42+02:00|reframe 3.10.0-dev.3|GpuDirectRdmaTest_bw_D_H on cscs-daint:daint-icc21-impi21-ib-umod-gpu using gpu-direct-rdma|jobid=38343053|8192_RDMA_Disabled_GDR_Copy_Enabled=0|MB/s|ref=0 (l=null, u=null)|git=None,benchmark=bw,network_adapter=mlx5_0:1,num_nodes=2,ucx_tls=['rc', 'cuda_copy'],D_H,bw,communication_type=D_H
2022-05-11T08:28:42+02:00|reframe 3.10.0-dev.3|GpuDirectRdmaTest_bw_D_H on cscs-daint:daint-icc21-impi21-ib-umod-gpu using gpu-direct-rdma|jobid=38343053|16384_RDMA_Disabled_GDR_Copy_Enabled=0|MB/s|ref=0 (l=null, u=null)|git=None,benchmark=bw,network_adapter=mlx5_0:1,num_nodes=2,ucx_tls=['rc', 'cuda_copy'],D_H,bw,communication_type=D_H
2022-05-11T08:28:42+02:00|reframe 3.10.0-dev.3|GpuDirectRdmaTest_bw_D_H on cscs-daint:daint-icc21-impi21-ib-umod-gpu using gpu-direct-rdma|jobid=38343053|32768_RDMA_Disabled_GDR_Copy_Enabled=0|MB/s|ref=0 (l=null, u=null)|git=None,benchmark=bw,network_adapter=mlx5_0:1,num_nodes=2,ucx_tls=['rc', 'cuda_copy'],D_H,bw,communication_type=D_H
2022-05-11T08:28:42+02:00|reframe 3.10.0-dev.3|GpuDirectRdmaTest_bw_D_H on cscs-daint:daint-icc21-impi21-ib-umod-gpu using gpu-direct-rdma|jobid=38343053|65536_RDMA_Disabled_GDR_Copy_Enabled=0|MB/s|ref=0 (l=null, u=null)|git=None,benchmark=bw,network_adapter=mlx5_0:1,num_nodes=2,ucx_tls=['rc', 'cuda_copy'],D_H,bw,communication_type=D_H
2022-05-11T08:28:42+02:00|reframe 3.10.0-dev.3|GpuDirectRdmaTest_bw_D_H on cscs-daint:daint-icc21-impi21-ib-umod-gpu using gpu-direct-rdma|jobid=38343053|131072_RDMA_Disabled_GDR_Copy_Enabled=0|MB/s|ref=0 (l=null, u=null)|git=None,benchmark=bw,network_adapter=mlx5_0:1,num_nodes=2,ucx_tls=['rc', 'cuda_copy'],D_H,bw,communication_type=D_H
2022-05-11T08:28:42+02:00|reframe 3.10.0-dev.3|GpuDirectRdmaTest_bw_D_H on cscs-daint:daint-icc21-impi21-ib-umod-gpu using gpu-direct-rdma|jobid=38343053|262144_RDMA_Disabled_GDR_Copy_Enabled=0|MB/s|ref=0 (l=null, u=null)|git=None,benchmark=bw,network_adapter=mlx5_0:1,num_nodes=2,ucx_tls=['rc', 'cuda_copy'],D_H,bw,communication_type=D_H
2022-05-11T08:28:42+02:00|reframe 3.10.0-dev.3|GpuDirectRdmaTest_bw_D_H on cscs-daint:daint-icc21-impi21-ib-umod-gpu using gpu-direct-rdma|jobid=38343053|524288_RDMA_Disabled_GDR_Copy_Enabled=0|MB/s|ref=0 (l=null, u=null)|git=None,benchmark=bw,network_adapter=mlx5_0:1,num_nodes=2,ucx_tls=['rc', 'cuda_copy'],D_H,bw,communication_type=D_H
2022-05-11T08:28:42+02:00|reframe 3.10.0-dev.3|GpuDirectRdmaTest_bw_D_H on cscs-daint:daint-icc21-impi21-ib-umod-gpu using gpu-direct-rdma|jobid=38343053|1048576_RDMA_Disabled_GDR_Copy_Enabled=0|MB/s|ref=0 (l=null, u=null)|git=None,benchmark=bw,network_adapter=mlx5_0:1,num_nodes=2,ucx_tls=['rc', 'cuda_copy'],D_H,bw,communication_type=D_H
2022-05-11T08:28:42+02:00|reframe 3.10.0-dev.3|GpuDirectRdmaTest_bw_D_H on cscs-daint:daint-icc21-impi21-ib-umod-gpu using gpu-direct-rdma|jobid=38343053|2097152_RDMA_Disabled_GDR_Copy_Enabled=0|MB/s|ref=0 (l=null, u=null)|git=None,benchmark=bw,network_adapter=mlx5_0:1,num_nodes=2,ucx_tls=['rc', 'cuda_copy'],D_H,bw,communication_type=D_H
2022-05-11T08:28:42+02:00|reframe 3.10.0-dev.3|GpuDirectRdmaTest_bw_D_H on cscs-daint:daint-icc21-impi21-ib-umod-gpu using gpu-direct-rdma|jobid=38343053|4194304_RDMA_Disabled_GDR_Copy_Enabled=0|MB/s|ref=0 (l=null, u=null)|git=None,benchmark=bw,network_adapter=mlx5_0:1,num_nodes=2,ucx_tls=['rc', 'cuda_copy'],D_H,bw,communication_type=D_H
2022-05-11T08:28:42+02:00|reframe 3.10.0-dev.3|GpuDirectRdmaTest_bw_D_H on cscs-daint:daint-icc21-impi21-ib-umod-gpu using gpu-direct-rdma|jobid=38343053|2_RDMA_GDR_Copy_Disabled=0|MB/s|ref=0 (l=null, u=null)|git=None,benchmark=bw,network_adapter=mlx5_0:1,num_nodes=2,ucx_tls=['rc', 'cuda_copy'],D_H,bw,communication_type=D_H
2022-05-11T08:28:42+02:00|reframe 3.10.0-dev.3|GpuDirectRdmaTest_bw_D_H on cscs-daint:daint-icc21-impi21-ib-umod-gpu using gpu-direct-rdma|jobid=38343053|4_RDMA_GDR_Copy_Disabled=0|MB/s|ref=0 (l=null, u=null)|git=None,benchmark=bw,network_adapter=mlx5_0:1,num_nodes=2,ucx_tls=['rc', 'cuda_copy'],D_H,bw,communication_type=D_H
2022-05-11T08:28:42+02:00|reframe 3.10.0-dev.3|GpuDirectRdmaTest_bw_D_H on cscs-daint:daint-icc21-impi21-ib-umod-gpu using gpu-direct-rdma|jobid=38343053|8_RDMA_GDR_Copy_Disabled=0|MB/s|ref=0 (l=null, u=null)|git=None,benchmark=bw,network_adapter=mlx5_0:1,num_nodes=2,ucx_tls=['rc', 'cuda_copy'],D_H,bw,communication_type=D_H
2022-05-11T08:28:42+02:00|reframe 3.10.0-dev.3|GpuDirectRdmaTest_bw_D_H on cscs-daint:daint-icc21-impi21-ib-umod-gpu using gpu-direct-rdma|jobid=38343053|16_RDMA_GDR_Copy_Disabled=0|MB/s|ref=0 (l=null, u=null)|git=None,benchmark=bw,network_adapter=mlx5_0:1,num_nodes=2,ucx_tls=['rc', 'cuda_copy'],D_H,bw,communication_type=D_H
2022-05-11T08:28:42+02:00|reframe 3.10.0-dev.3|GpuDirectRdmaTest_bw_D_H on cscs-daint:daint-icc21-impi21-ib-umod-gpu using gpu-direct-rdma|jobid=38343053|32_RDMA_GDR_Copy_Disabled=0|MB/s|ref=0 (l=null, u=null)|git=None,benchmark=bw,network_adapter=mlx5_0:1,num_nodes=2,ucx_tls=['rc', 'cuda_copy'],D_H,bw,communication_type=D_H
2022-05-11T08:28:42+02:00|reframe 3.10.0-dev.3|GpuDirectRdmaTest_bw_D_H on cscs-daint:daint-icc21-impi21-ib-umod-gpu using gpu-direct-rdma|jobid=38343053|64_RDMA_GDR_Copy_Disabled=0|MB/s|ref=0 (l=null, u=null)|git=None,benchmark=bw,network_adapter=mlx5_0:1,num_nodes=2,ucx_tls=['rc', 'cuda_copy'],D_H,bw,communication_type=D_H
2022-05-11T08:28:42+02:00|reframe 3.10.0-dev.3|GpuDirectRdmaTest_bw_D_H on cscs-daint:daint-icc21-impi21-ib-umod-gpu using gpu-direct-rdma|jobid=38343053|128_RDMA_GDR_Copy_Disabled=0|MB/s|ref=0 (l=null, u=null)|git=None,benchmark=bw,network_adapter=mlx5_0:1,num_nodes=2,ucx_tls=['rc', 'cuda_copy'],D_H,bw,communication_type=D_H
2022-05-11T08:28:42+02:00|reframe 3.10.0-dev.3|GpuDirectRdmaTest_bw_D_H on cscs-daint:daint-icc21-impi21-ib-umod-gpu using gpu-direct-rdma|jobid=38343053|256_RDMA_GDR_Copy_Disabled=0|MB/s|ref=0 (l=null, u=null)|git=None,benchmark=bw,network_adapter=mlx5_0:1,num_nodes=2,ucx_tls=['rc', 'cuda_copy'],D_H,bw,communication_type=D_H
2022-05-11T08:28:42+02:00|reframe 3.10.0-dev.3|GpuDirectRdmaTest_bw_D_H on cscs-daint:daint-icc21-impi21-ib-umod-gpu using gpu-direct-rdma|jobid=38343053|512_RDMA_GDR_Copy_Disabled=0|MB/s|ref=0 (l=null, u=null)|git=None,benchmark=bw,network_adapter=mlx5_0:1,num_nodes=2,ucx_tls=['rc', 'cuda_copy'],D_H,bw,communication_type=D_H
2022-05-11T08:28:42+02:00|reframe 3.10.0-dev.3|GpuDirectRdmaTest_bw_D_H on cscs-daint:daint-icc21-impi21-ib-umod-gpu using gpu-direct-rdma|jobid=38343053|1024_RDMA_GDR_Copy_Disabled=0|MB/s|ref=0 (l=null, u=null)|git=None,benchmark=bw,network_adapter=mlx5_0:1,num_nodes=2,ucx_tls=['rc', 'cuda_copy'],D_H,bw,communication_type=D_H
2022-05-11T08:28:42+02:00|reframe 3.10.0-dev.3|GpuDirectRdmaTest_bw_D_H on cscs-daint:daint-icc21-impi21-ib-umod-gpu using gpu-direct-rdma|jobid=38343053|2048_RDMA_GDR_Copy_Disabled=0|MB/s|ref=0 (l=null, u=null)|git=None,benchmark=bw,network_adapter=mlx5_0:1,num_nodes=2,ucx_tls=['rc', 'cuda_copy'],D_H,bw,communication_type=D_H
2022-05-11T08:28:42+02:00|reframe 3.10.0-dev.3|GpuDirectRdmaTest_bw_D_H on cscs-daint:daint-icc21-impi21-ib-umod-gpu using gpu-direct-rdma|jobid=38343053|4096_RDMA_GDR_Copy_Disabled=0|MB/s|ref=0 (l=null, u=null)|git=None,benchmark=bw,network_adapter=mlx5_0:1,num_nodes=2,ucx_tls=['rc', 'cuda_copy'],D_H,bw,communication_type=D_H
2022-05-11T08:28:42+02:00|reframe 3.10.0-dev.3|GpuDirectRdmaTest_bw_D_H on cscs-daint:daint-icc21-impi21-ib-umod-gpu using gpu-direct-rdma|jobid=38343053|8192_RDMA_GDR_Copy_Disabled=0|MB/s|ref=0 (l=null, u=null)|git=None,benchmark=bw,network_adapter=mlx5_0:1,num_nodes=2,ucx_tls=['rc', 'cuda_copy'],D_H,bw,communication_type=D_H
2022-05-11T08:28:42+02:00|reframe 3.10.0-dev.3|GpuDirectRdmaTest_bw_D_H on cscs-daint:daint-icc21-impi21-ib-umod-gpu using gpu-direct-rdma|jobid=38343053|16384_RDMA_GDR_Copy_Disabled=0|MB/s|ref=0 (l=null, u=null)|git=None,benchmark=bw,network_adapter=mlx5_0:1,num_nodes=2,ucx_tls=['rc', 'cuda_copy'],D_H,bw,communication_type=D_H
2022-05-11T08:28:42+02:00|reframe 3.10.0-dev.3|GpuDirectRdmaTest_bw_D_H on cscs-daint:daint-icc21-impi21-ib-umod-gpu using gpu-direct-rdma|jobid=38343053|32768_RDMA_GDR_Copy_Disabled=0|MB/s|ref=0 (l=null, u=null)|git=None,benchmark=bw,network_adapter=mlx5_0:1,num_nodes=2,ucx_tls=['rc', 'cuda_copy'],D_H,bw,communication_type=D_H
2022-05-11T08:28:42+02:00|reframe 3.10.0-dev.3|GpuDirectRdmaTest_bw_D_H on cscs-daint:daint-icc21-impi21-ib-umod-gpu using gpu-direct-rdma|jobid=38343053|65536_RDMA_GDR_Copy_Disabled=0|MB/s|ref=0 (l=null, u=null)|git=None,benchmark=bw,network_adapter=mlx5_0:1,num_nodes=2,ucx_tls=['rc', 'cuda_copy'],D_H,bw,communication_type=D_H
2022-05-11T08:28:42+02:00|reframe 3.10.0-dev.3|GpuDirectRdmaTest_bw_D_H on cscs-daint:daint-icc21-impi21-ib-umod-gpu using gpu-direct-rdma|jobid=38343053|131072_RDMA_GDR_Copy_Disabled=0|MB/s|ref=0 (l=null, u=null)|git=None,benchmark=bw,network_adapter=mlx5_0:1,num_nodes=2,ucx_tls=['rc', 'cuda_copy'],D_H,bw,communication_type=D_H
2022-05-11T08:28:42+02:00|reframe 3.10.0-dev.3|GpuDirectRdmaTest_bw_D_H on cscs-daint:daint-icc21-impi21-ib-umod-gpu using gpu-direct-rdma|jobid=38343053|262144_RDMA_GDR_Copy_Disabled=0|MB/s|ref=0 (l=null, u=null)|git=None,benchmark=bw,network_adapter=mlx5_0:1,num_nodes=2,ucx_tls=['rc', 'cuda_copy'],D_H,bw,communication_type=D_H
2022-05-11T08:28:42+02:00|reframe 3.10.0-dev.3|GpuDirectRdmaTest_bw_D_H on cscs-daint:daint-icc21-impi21-ib-umod-gpu using gpu-direct-rdma|jobid=38343053|524288_RDMA_GDR_Copy_Disabled=0|MB/s|ref=0 (l=null, u=null)|git=None,benchmark=bw,network_adapter=mlx5_0:1,num_nodes=2,ucx_tls=['rc', 'cuda_copy'],D_H,bw,communication_type=D_H
2022-05-11T08:28:42+02:00|reframe 3.10.0-dev.3|GpuDirectRdmaTest_bw_D_H on cscs-daint:daint-icc21-impi21-ib-umod-gpu using gpu-direct-rdma|jobid=38343053|1048576_RDMA_GDR_Copy_Disabled=0|MB/s|ref=0 (l=null, u=null)|git=None,benchmark=bw,network_adapter=mlx5_0:1,num_nodes=2,ucx_tls=['rc', 'cuda_copy'],D_H,bw,communication_type=D_H
2022-05-11T08:28:42+02:00|reframe 3.10.0-dev.3|GpuDirectRdmaTest_bw_D_H on cscs-daint:daint-icc21-impi21-ib-umod-gpu using gpu-direct-rdma|jobid=38343053|2097152_RDMA_GDR_Copy_Disabled=0|MB/s|ref=0 (l=null, u=null)|git=None,benchmark=bw,network_adapter=mlx5_0:1,num_nodes=2,ucx_tls=['rc', 'cuda_copy'],D_H,bw,communication_type=D_H
2022-05-11T08:28:42+02:00|reframe 3.10.0-dev.3|GpuDirectRdmaTest_bw_D_H on cscs-daint:daint-icc21-impi21-ib-umod-gpu using gpu-direct-rdma|jobid=38343053|4194304_RDMA_GDR_Copy_Disabled=0|MB/s|ref=0 (l=null, u=null)|git=None,benchmark=bw,network_adapter=mlx5_0:1,num_nodes=2,ucx_tls=['rc', 'cuda_copy'],D_H,bw,communication_type=D_H
