{
    "annotations": {
        "list": [{
            "builtIn": 1,
            "datasource": "-- Grafana --",
            "enable": true,
            "hide": true,
            "iconColor": "rgba(0, 211, 255, 1)",
            "name": "Annotations & Alerts",
            "type": "dashboard"
        }]
    },
    "editable": false,
    "gnetId": null,
    "graphTooltip": 1,
    "iteration": 1588543370021,
    "links": [],
    "panels": [{
            "datasource": null,
            "gridPos": {
                "h": 1,
                "w": 24,
                "x": 0,
                "y": 0
            },
            "id": 90,
            "title": "Cluster",
            "type": "row"
        },
        {
            "cacheTimeout": null,
            "colorBackground": true,
            "colorPostfix": false,
            "colorPrefix": false,
            "colorValue": false,
            "colors": [
                "#299c46",
                "rgba(237, 129, 40, 0.89)",
                "#d44a3a"
            ],
            "datasource": null,
            "format": "none",
            "gauge": {
                "maxValue": 100,
                "minValue": 0,
                "show": false,
                "thresholdLabels": false,
                "thresholdMarkers": true
            },
            "gridPos": {
                "h": 3,
                "w": 12,
                "x": 0,
                "y": 1
            },
            "id": 92,
            "interval": null,
            "links": [],
            "mappingType": 1,
            "mappingTypes": [{
                    "name": "value to text",
                    "value": 1
                },
                {
                    "name": "range to text",
                    "value": 2
                }
            ],
            "maxDataPoints": 100,
            "nullPointMode": "connected",
            "nullText": null,
            "options": {},
            "postfix": "",
            "postfixFontSize": "50%",
            "prefix": "",
            "prefixFontSize": "50%",
            "rangeMaps": [{
                "from": "null",
                "text": "N/A",
                "to": "null"
            }],
            "sparkline": {
                "fillColor": "rgba(31, 118, 189, 0.18)",
                "full": false,
                "lineColor": "rgb(31, 120, 193)",
                "show": false
            },
            "tableColumn": "",
            "targets": [{
                "expr": "avg(elasticsearch_cluster_health_status{color=\"green\",cluster=~\"$cluster\"}) + avg(elasticsearch_cluster_health_status{color=\"yellow\",cluster=~\"$cluster\"}) * 2 + avg(elasticsearch_cluster_health_status{color=\"red\",cluster=~\"$cluster\"}) * 3",
                "format": "time_series",
                "instant": false,
                "intervalFactor": 1,
                "legendFormat": "",
                "refId": "A"
            }],
            "thresholds": "2,3",
            "title": "Cluster Status",
            "type": "singlestat",
            "valueFontSize": "120%",
            "valueMaps": [{
                    "op": "=",
                    "text": "N/A",
                    "value": "null"
                },
                {
                    "op": "=",
                    "text": "green",
                    "value": "1"
                },
                {
                    "op": "=",
                    "text": "yellow",
                    "value": "2"
                },
                {
                    "op": "=",
                    "text": "red",
                    "value": "3"
                }
            ],
            "valueName": "current"
        },
        {
            "cacheTimeout": null,
            "colorBackground": false,
            "colorValue": false,
            "colors": [
                "rgba(245, 54, 54, 0.9)",
                "rgba(237, 129, 40, 0.89)",
                "rgba(50, 172, 45, 0.97)"
            ],
            "datasource": "$server",
            "editable": false,
            "error": false,
            "format": "none",
            "gauge": {
                "maxValue": 100,
                "minValue": 0,
                "show": false,
                "thresholdLabels": false,
                "thresholdMarkers": true
            },
            "gridPos": {
                "h": 3,
                "w": 4,
                "x": 12,
                "y": 1
            },
            "id": 8,
            "interval": null,
            "links": [],
            "mappingType": 1,
            "mappingTypes": [{
                    "name": "value to text",
                    "value": 1
                },
                {
                    "name": "range to text",
                    "value": 2
                }
            ],
            "maxDataPoints": 100,
            "nullPointMode": "connected",
            "nullText": null,
            "options": {},
            "postfix": "",
            "postfixFontSize": "50%",
            "prefix": "",
            "prefixFontSize": "50%",
            "rangeMaps": [{
                "from": "null",
                "text": "N/A",
                "to": "null"
            }],
            "sparkline": {
                "fillColor": "rgba(31, 118, 189, 0.18)",
                "full": false,
                "lineColor": "rgb(31, 120, 193)",
                "show": true
            },
            "tableColumn": "",
            "targets": [{
                "expr": "sum(elasticsearch_cluster_health_number_of_nodes{cluster=~\"$cluster\"})/count(elasticsearch_cluster_health_number_of_nodes{cluster=~\"$cluster\"})",
                "format": "time_series",
                "interval": "",
                "intervalFactor": 2,
                "legendFormat": "",
                "metric": "elasticsearch_cluster_health_number_of_nodes",
                "refId": "A",
                "step": 1800
            }],
            "thresholds": "",
            "timeFrom": null,
            "timeShift": null,
            "title": "Running Nodes",
            "type": "singlestat",
            "valueFontSize": "120%",
            "valueMaps": [{
                "op": "=",
                "text": "N/A",
                "value": "null"
            }],
            "valueName": "current"
        },
        {
            "cacheTimeout": null,
            "colorBackground": false,
            "colorValue": false,
            "colors": [
                "#299c46",
                "rgba(237, 129, 40, 0.89)",
                "#d44a3a"
            ],
            "datasource": null,
            "format": "none",
            "gauge": {
                "maxValue": 100,
                "minValue": 0,
                "show": false,
                "thresholdLabels": false,
                "thresholdMarkers": true
            },
            "gridPos": {
                "h": 3,
                "w": 4,
                "x": 16,
                "y": 1
            },
            "id": 94,
            "interval": null,
            "links": [],
            "mappingType": 1,
            "mappingTypes": [{
                    "name": "value to text",
                    "value": 1
                },
                {
                    "name": "range to text",
                    "value": 2
                }
            ],
            "maxDataPoints": 100,
            "nullPointMode": "connected",
            "nullText": null,
            "options": {},
            "postfix": "",
            "postfixFontSize": "50%",
            "prefix": "",
            "prefixFontSize": "50%",
            "rangeMaps": [{
                "from": "null",
                "text": "N/A",
                "to": "null"
            }],
            "sparkline": {
                "fillColor": "rgba(31, 118, 189, 0.18)",
                "full": false,
                "lineColor": "rgb(31, 120, 193)",
                "show": true
            },
            "tableColumn": "",
            "targets": [{
                "expr": "elasticsearch_cluster_health_number_of_data_nodes{cluster=~\"$cluster\",instance=~\"$instance\"}",
                "format": "time_series",
                "intervalFactor": 1,
                "refId": "A"
            }],
            "thresholds": "",
            "title": "Active Data Nodes",
            "type": "singlestat",
            "valueFontSize": "120%",
            "valueMaps": [{
                "op": "=",
                "text": "N/A",
                "value": "null"
            }],
            "valueName": "current"
        },
        {
            "cacheTimeout": null,
            "colorBackground": false,
            "colorValue": true,
            "colors": [
                "#299c46",
                "rgba(237, 129, 40, 0.89)",
                "#d44a3a"
            ],
            "datasource": null,
            "format": "none",
            "gauge": {
                "maxValue": 100,
                "minValue": 0,
                "show": false,
                "thresholdLabels": false,
                "thresholdMarkers": true
            },
            "gridPos": {
                "h": 3,
                "w": 4,
                "x": 20,
                "y": 1
            },
            "id": 96,
            "interval": null,
            "links": [],
            "mappingType": 1,
            "mappingTypes": [{
                    "name": "value to text",
                    "value": 1
                },
                {
                    "name": "range to text",
                    "value": 2
                }
            ],
            "maxDataPoints": 100,
            "nullPointMode": "connected",
            "nullText": null,
            "options": {},
            "postfix": "",
            "postfixFontSize": "50%",
            "prefix": "",
            "prefixFontSize": "50%",
            "rangeMaps": [{
                "from": "null",
                "text": "N/A",
                "to": "null"
            }],
            "sparkline": {
                "fillColor": "rgba(31, 118, 189, 0.18)",
                "full": false,
                "lineColor": "rgb(31, 120, 193)",
                "show": true
            },
            "tableColumn": "",
            "targets": [{
                "expr": "elasticsearch_cluster_health_number_of_pending_tasks{cluster=~\"$cluster\",instance=~\"$instance\"}",
                "format": "time_series",
                "intervalFactor": 1,
                "refId": "A"
            }],
            "thresholds": "0.5,1",
            "title": "Pending Tasks",
            "type": "singlestat",
            "valueFontSize": "120%",
            "valueMaps": [{
                "op": "=",
                "text": "N/A",
                "value": "null"
            }],
            "valueName": "current"
        },
        {
            "collapsed": false,
            "datasource": null,
            "gridPos": {
                "h": 1,
                "w": 24,
                "x": 0,
                "y": 4
            },
            "id": 76,
            "panels": [],
            "title": "Shards",
            "type": "row"
        },
        {
            "cacheTimeout": null,
            "colorBackground": false,
            "colorValue": false,
            "colors": [
                "#299c46",
                "rgba(237, 129, 40, 0.89)",
                "#d44a3a"
            ],
            "datasource": null,
            "format": "none",
            "gauge": {
                "maxValue": 100,
                "minValue": 0,
                "show": false,
                "thresholdLabels": false,
                "thresholdMarkers": true
            },
            "gridPos": {
                "h": 3,
                "w": 4,
                "x": 0,
                "y": 5
            },
            "id": 78,
            "interval": null,
            "links": [],
            "mappingType": 1,
            "mappingTypes": [{
                    "name": "value to text",
                    "value": 1
                },
                {
                    "name": "range to text",
                    "value": 2
                }
            ],
            "maxDataPoints": 100,
            "nullPointMode": "connected",
            "nullText": null,
            "options": {},
            "postfix": "",
            "postfixFontSize": "50%",
            "prefix": "",
            "prefixFontSize": "50%",
            "rangeMaps": [{
                "from": "null",
                "text": "N/A",
                "to": "null"
            }],
            "sparkline": {
                "fillColor": "rgba(31, 118, 189, 0.18)",
                "full": false,
                "lineColor": "rgb(31, 120, 193)",
                "show": true
            },
            "tableColumn": "",
            "targets": [{
                "expr": "elasticsearch_cluster_health_active_shards{cluster=~\"$cluster\",instance=~\"$instance\"}",
                "format": "time_series",
                "intervalFactor": 1,
                "refId": "A"
            }],
            "thresholds": "",
            "title": "Active Shards",
            "type": "singlestat",
            "valueFontSize": "120%",
            "valueMaps": [{
                "op": "=",
                "text": "N/A",
                "value": "null"
            }],
            "valueName": "current"
        },
        {
            "cacheTimeout": null,
            "colorBackground": false,
            "colorValue": false,
            "colors": [
                "#299c46",
                "rgba(237, 129, 40, 0.89)",
                "#d44a3a"
            ],
            "datasource": null,
            "format": "none",
            "gauge": {
                "maxValue": 100,
                "minValue": 0,
                "show": false,
                "thresholdLabels": false,
                "thresholdMarkers": true
            },
            "gridPos": {
                "h": 3,
                "w": 4,
                "x": 4,
                "y": 5
            },
            "id": 80,
            "interval": null,
            "links": [],
            "mappingType": 1,
            "mappingTypes": [{
                    "name": "value to text",
                    "value": 1
                },
                {
                    "name": "range to text",
                    "value": 2
                }
            ],
            "maxDataPoints": 100,
            "nullPointMode": "connected",
            "nullText": null,
            "options": {},
            "postfix": "",
            "postfixFontSize": "50%",
            "prefix": "",
            "prefixFontSize": "50%",
            "rangeMaps": [{
                "from": "null",
                "text": "N/A",
                "to": "null"
            }],
            "sparkline": {
                "fillColor": "rgba(31, 118, 189, 0.18)",
                "full": false,
                "lineColor": "rgb(31, 120, 193)",
                "show": true
            },
            "tableColumn": "",
            "targets": [{
                "expr": "elasticsearch_cluster_health_active_primary_shards{cluster=~\"$cluster\",instance=~\"$instance\"}",
                "format": "time_series",
                "intervalFactor": 1,
                "refId": "A"
            }],
            "thresholds": "",
            "title": "Active Primary Shards",
            "type": "singlestat",
            "valueFontSize": "120%",
            "valueMaps": [{
                "op": "=",
                "text": "N/A",
                "value": "null"
            }],
            "valueName": "current"
        },
        {
            "cacheTimeout": null,
            "colorBackground": false,
            "colorValue": true,
            "colors": [
                "#299c46",
                "rgba(237, 129, 40, 0.89)",
                "#d44a3a"
            ],
            "datasource": null,
            "format": "none",
            "gauge": {
                "maxValue": 100,
                "minValue": 0,
                "show": false,
                "thresholdLabels": false,
                "thresholdMarkers": true
            },
            "gridPos": {
                "h": 3,
                "w": 4,
                "x": 8,
                "y": 5
            },
            "id": 82,
            "interval": null,
            "links": [],
            "mappingType": 1,
            "mappingTypes": [{
                    "name": "value to text",
                    "value": 1
                },
                {
                    "name": "range to text",
                    "value": 2
                }
            ],
            "maxDataPoints": 100,
            "nullPointMode": "connected",
            "nullText": null,
            "options": {},
            "postfix": "",
            "postfixFontSize": "50%",
            "prefix": "",
            "prefixFontSize": "50%",
            "rangeMaps": [{
                "from": "null",
                "text": "N/A",
                "to": "null"
            }],
            "sparkline": {
                "fillColor": "rgba(31, 118, 189, 0.18)",
                "full": false,
                "lineColor": "rgb(31, 120, 193)",
                "show": true
            },
            "tableColumn": "",
            "targets": [{
                "expr": "elasticsearch_cluster_health_initializing_shards{cluster=~\"$cluster\",instance=~\"$instance\"}",
                "format": "time_series",
                "intervalFactor": 1,
                "refId": "A"
            }],
            "thresholds": "0.5,1",
            "title": "Initializing Shards",
            "type": "singlestat",
            "valueFontSize": "120%",
            "valueMaps": [{
                "op": "=",
                "text": "N/A",
                "value": "null"
            }],
            "valueName": "current"
        },
        {
            "cacheTimeout": null,
            "colorBackground": false,
            "colorValue": true,
            "colors": [
                "#299c46",
                "rgba(237, 129, 40, 0.89)",
                "#d44a3a"
            ],
            "datasource": null,
            "format": "none",
            "gauge": {
                "maxValue": 100,
                "minValue": 0,
                "show": false,
                "thresholdLabels": false,
                "thresholdMarkers": true
            },
            "gridPos": {
                "h": 3,
                "w": 4,
                "x": 12,
                "y": 5
            },
            "id": 84,
            "interval": null,
            "links": [],
            "mappingType": 1,
            "mappingTypes": [{
                    "name": "value to text",
                    "value": 1
                },
                {
                    "name": "range to text",
                    "value": 2
                }
            ],
            "maxDataPoints": 100,
            "nullPointMode": "connected",
            "nullText": null,
            "options": {},
            "postfix": "",
            "postfixFontSize": "50%",
            "prefix": "",
            "prefixFontSize": "50%",
            "rangeMaps": [{
                "from": "null",
                "text": "N/A",
                "to": "null"
            }],
            "sparkline": {
                "fillColor": "rgba(31, 118, 189, 0.18)",
                "full": false,
                "lineColor": "rgb(31, 120, 193)",
                "show": true
            },
            "tableColumn": "",
            "targets": [{
                "expr": "elasticsearch_cluster_health_relocating_shards{cluster=~\"$cluster\",instance=~\"$instance\"}",
                "format": "time_series",
                "intervalFactor": 1,
                "refId": "A"
            }],
            "thresholds": "0.5,1",
            "title": "Relocating Shards",
            "type": "singlestat",
            "valueFontSize": "120%",
            "valueMaps": [{
                "op": "=",
                "text": "N/A",
                "value": "null"
            }],
            "valueName": "current"
        },
        {
            "cacheTimeout": null,
            "colorBackground": false,
            "colorValue": true,
            "colors": [
                "#299c46",
                "rgba(237, 129, 40, 0.89)",
                "#d44a3a"
            ],
            "datasource": null,
            "format": "none",
            "gauge": {
                "maxValue": 100,
                "minValue": 0,
                "show": false,
                "thresholdLabels": false,
                "thresholdMarkers": true
            },
            "gridPos": {
                "h": 3,
                "w": 4,
                "x": 16,
                "y": 5
            },
            "id": 86,
            "interval": null,
            "links": [],
            "mappingType": 1,
            "mappingTypes": [{
                    "name": "value to text",
                    "value": 1
                },
                {
                    "name": "range to text",
                    "value": 2
                }
            ],
            "maxDataPoints": 100,
            "nullPointMode": "connected",
            "nullText": null,
            "options": {},
            "postfix": "",
            "postfixFontSize": "50%",
            "prefix": "",
            "prefixFontSize": "50%",
            "rangeMaps": [{
                "from": "null",
                "text": "N/A",
                "to": "null"
            }],
            "sparkline": {
                "fillColor": "rgba(31, 118, 189, 0.18)",
                "full": false,
                "lineColor": "rgb(31, 120, 193)",
                "show": true
            },
            "tableColumn": "",
            "targets": [{
                "expr": "elasticsearch_cluster_health_unassigned_shards{cluster=~\"$cluster\",instance=~\"$instance\"}",
                "format": "time_series",
                "intervalFactor": 1,
                "refId": "A"
            }],
            "thresholds": "0.5,1",
            "title": "Unassigned Shards",
            "type": "singlestat",
            "valueFontSize": "120%",
            "valueMaps": [{
                "op": "=",
                "text": "N/A",
                "value": "null"
            }],
            "valueName": "current"
        },
        {
            "cacheTimeout": null,
            "colorBackground": false,
            "colorValue": true,
            "colors": [
                "#299c46",
                "rgba(237, 129, 40, 0.89)",
                "#d44a3a"
            ],
            "datasource": null,
            "format": "none",
            "gauge": {
                "maxValue": 100,
                "minValue": 0,
                "show": false,
                "thresholdLabels": false,
                "thresholdMarkers": true
            },
            "gridPos": {
                "h": 3,
                "w": 4,
                "x": 20,
                "y": 5
            },
            "id": 88,
            "interval": null,
            "links": [],
            "mappingType": 1,
            "mappingTypes": [{
                    "name": "value to text",
                    "value": 1
                },
                {
                    "name": "range to text",
                    "value": 2
                }
            ],
            "maxDataPoints": 100,
            "nullPointMode": "connected",
            "nullText": null,
            "options": {},
            "postfix": "",
            "postfixFontSize": "50%",
            "prefix": "",
            "prefixFontSize": "50%",
            "rangeMaps": [{
                "from": "null",
                "text": "N/A",
                "to": "null"
            }],
            "sparkline": {
                "fillColor": "rgba(31, 118, 189, 0.18)",
                "full": false,
                "lineColor": "rgb(31, 120, 193)",
                "show": true
            },
            "tableColumn": "",
            "targets": [{
                "expr": "elasticsearch_cluster_health_delayed_unassigned_shards{cluster=~\"$cluster\",instance=~\"$instance\"}",
                "format": "time_series",
                "intervalFactor": 1,
                "refId": "A"
            }],
            "thresholds": "0.5,1",
            "title": "Delayed Unassigned Shards",
            "type": "singlestat",
            "valueFontSize": "120%",
            "valueMaps": [{
                "op": "=",
                "text": "N/A",
                "value": "null"
            }],
            "valueName": "current"
        },
        {
            "collapsed": false,
            "datasource": null,
            "gridPos": {
                "h": 1,
                "w": 24,
                "x": 0,
                "y": 8
            },
            "id": 70,
            "panels": [],
            "title": "Documents",
            "type": "row"
        },
        {
            "aliasColors": {},
            "bars": false,
            "dashLength": 10,
            "dashes": false,
            "datasource": "$server",
            "editable": false,
            "error": false,
            "fill": 1,
            "fillGradient": 0,
            "grid": {},
            "gridPos": {
                "h": 9,
                "w": 12,
                "x": 0,
                "y": 9
            },
            "hiddenSeries": false,
            "id": 3,
            "legend": {
                "alignAsTable": true,
                "avg": true,
                "current": true,
                "max": true,
                "min": true,
                "show": true,
                "total": false,
                "values": true
            },
            "lines": true,
            "linewidth": 2,
            "links": [],
            "nullPointMode": "connected",
            "options": {
                "dataLinks": []
            },
            "percentage": false,
            "pointradius": 5,
            "points": false,
            "renderer": "flot",
            "seriesOverrides": [],
            "spaceLength": 10,
            "stack": false,
            "steppedLine": false,
            "targets": [{
                "expr": "sum(elasticsearch_indices_docs{cluster=~\"$cluster\"})",
                "format": "time_series",
                "intervalFactor": 2,
                "legendFormat": "Documents",
                "refId": "A",
                "step": 240
            }],
            "thresholds": [],
            "timeFrom": null,
            "timeRegions": [],
            "timeShift": null,
            "title": "Documents indexed",
            "tooltip": {
                "msResolution": true,
                "shared": true,
                "sort": 0,
                "value_type": "cumulative"
            },
            "type": "graph",
            "xaxis": {
                "buckets": null,
                "mode": "time",
                "name": null,
                "show": true,
                "values": []
            },
            "yaxes": [{
                    "format": "short",
                    "logBase": 1,
                    "max": null,
                    "min": 0,
                    "show": true
                },
                {
                    "format": "short",
                    "logBase": 1,
                    "max": null,
                    "min": null,
                    "show": true
                }
            ],
            "yaxis": {
                "align": false,
                "alignLevel": null
            }
        },
        {
            "aliasColors": {},
            "bars": false,
            "dashLength": 10,
            "dashes": false,
            "datasource": "$server",
            "editable": false,
            "error": false,
            "fill": 1,
            "fillGradient": 0,
            "grid": {},
            "gridPos": {
                "h": 9,
                "w": 12,
                "x": 12,
                "y": 9
            },
            "hiddenSeries": false,
            "id": 4,
            "legend": {
                "alignAsTable": true,
                "avg": true,
                "current": true,
                "max": true,
                "min": true,
                "show": true,
                "total": false,
                "values": true
            },
            "lines": true,
            "linewidth": 2,
            "links": [],
            "nullPointMode": "connected",
            "options": {
                "dataLinks": []
            },
            "percentage": false,
            "pointradius": 5,
            "points": false,
            "renderer": "flot",
            "seriesOverrides": [],
            "spaceLength": 10,
            "stack": false,
            "steppedLine": false,
            "targets": [{
                "expr": "sum(elasticsearch_indices_store_size_bytes{cluster=~\"$cluster\"})",
                "format": "time_series",
                "intervalFactor": 2,
                "legendFormat": "Index Size",
                "refId": "A",
                "step": 240
            }],
            "thresholds": [],
            "timeFrom": null,
            "timeRegions": [],
            "timeShift": null,
            "title": "Index Size",
            "tooltip": {
                "msResolution": true,
                "shared": true,
                "sort": 0,
                "value_type": "cumulative"
            },
            "type": "graph",
            "xaxis": {
                "buckets": null,
                "mode": "time",
                "name": null,
                "show": true,
                "values": []
            },
            "yaxes": [{
                    "format": "bytes",
                    "logBase": 1,
                    "max": null,
                    "min": 0,
                    "show": true
                },
                {
                    "format": "short",
                    "logBase": 1,
                    "max": null,
                    "min": null,
                    "show": true
                }
            ],
            "yaxis": {
                "align": false,
                "alignLevel": null
            }
        },
        {
            "aliasColors": {},
            "bars": false,
            "dashLength": 10,
            "dashes": false,
            "datasource": null,
            "fill": 1,
            "fillGradient": 0,
            "gridPos": {
                "h": 9,
                "w": 12,
                "x": 0,
                "y": 18
            },
            "hiddenSeries": false,
            "id": 72,
            "legend": {
                "alignAsTable": true,
                "avg": true,
                "current": true,
                "max": true,
                "min": true,
                "show": true,
                "total": false,
                "values": true
            },
            "lines": true,
            "linewidth": 1,
            "links": [],
            "nullPointMode": "null",
            "options": {
                "dataLinks": []
            },
            "percentage": false,
            "pointradius": 5,
            "points": false,
            "renderer": "flot",
            "seriesOverrides": [],
            "spaceLength": 10,
            "stack": false,
            "steppedLine": false,
            "targets": [{
                "expr": "rate(elasticsearch_indices_indexing_index_total{cluster=~\"$cluster\"}[1h])",
                "format": "time_series",
                "intervalFactor": 1,
                "legendFormat": "{{name}}",
                "refId": "A"
            }],
            "thresholds": [],
            "timeFrom": null,
            "timeRegions": [],
            "timeShift": null,
            "title": "Documents Indexed Rate",
            "tooltip": {
                "shared": true,
                "sort": 0,
                "value_type": "individual"
            },
            "type": "graph",
            "xaxis": {
                "buckets": null,
                "mode": "time",
                "name": null,
                "show": true,
                "values": []
            },
            "yaxes": [{
                    "format": "short",
                    "label": "Documents/s",
                    "logBase": 1,
                    "max": null,
                    "min": null,
                    "show": true
                },
                {
                    "format": "short",
                    "label": null,
                    "logBase": 1,
                    "max": null,
                    "min": null,
                    "show": true
                }
            ],
            "yaxis": {
                "align": false,
                "alignLevel": null
            }
        },
        {
            "aliasColors": {},
            "bars": false,
            "dashLength": 10,
            "dashes": false,
            "datasource": null,
            "fill": 1,
            "fillGradient": 0,
            "gridPos": {
                "h": 9,
                "w": 12,
                "x": 12,
                "y": 18
            },
            "hiddenSeries": false,
            "id": 74,
            "legend": {
                "alignAsTable": true,
                "avg": true,
                "current": true,
                "max": true,
                "min": true,
                "show": true,
                "total": false,
                "values": true
            },
            "lines": true,
            "linewidth": 1,
            "links": [],
            "nullPointMode": "null",
            "options": {
                "dataLinks": []
            },
            "percentage": false,
            "pointradius": 5,
            "points": false,
            "renderer": "flot",
            "seriesOverrides": [],
            "spaceLength": 10,
            "stack": false,
            "steppedLine": false,
            "targets": [{
                "expr": "rate(elasticsearch_indices_search_fetch_total{cluster=~\"$cluster\"}[1h])",
                "format": "time_series",
                "intervalFactor": 1,
                "legendFormat": "{{name}}",
                "refId": "A"
            }],
            "thresholds": [],
            "timeFrom": null,
            "timeRegions": [],
            "timeShift": null,
            "title": "Query Rate",
            "tooltip": {
                "shared": true,
                "sort": 0,
                "value_type": "individual"
            },
            "type": "graph",
            "xaxis": {
                "buckets": null,
                "mode": "time",
                "name": null,
                "show": true,
                "values": []
            },
            "yaxes": [{
                    "format": "short",
                    "label": "Queris/s",
                    "logBase": 1,
                    "max": null,
                    "min": null,
                    "show": true
                },
                {
                    "format": "short",
                    "label": null,
                    "logBase": 1,
                    "max": null,
                    "min": null,
                    "show": true
                }
            ],
            "yaxis": {
                "align": false,
                "alignLevel": null
            }
        },
        {
            "aliasColors": {},
            "bars": false,
            "dashLength": 10,
            "dashes": false,
            "datasource": "$server",
            "editable": false,
            "error": false,
            "fill": 1,
            "fillGradient": 0,
            "grid": {},
            "gridPos": {
                "h": 8,
                "w": 24,
                "x": 0,
                "y": 27
            },
            "height": "",
            "hiddenSeries": false,
            "id": 64,
            "legend": {
                "avg": false,
                "current": false,
                "max": false,
                "min": false,
                "show": true,
                "total": false,
                "values": false
            },
            "lines": true,
            "linewidth": 2,
            "links": [],
            "nullPointMode": "connected",
            "options": {
                "dataLinks": []
            },
            "percentage": false,
            "pointradius": 5,
            "points": false,
            "renderer": "flot",
            "seriesOverrides": [],
            "spaceLength": 10,
            "stack": false,
            "steppedLine": false,
            "targets": [{
                "expr": "sum(elasticsearch_thread_pool_queue_count{cluster=~\"$cluster\", type!=\"management\"}) by (type)",
                "interval": "",
                "intervalFactor": 2,
                "legendFormat": "Type: {{type}}",
                "refId": "A",
                "step": 240
            }],
            "thresholds": [],
            "timeFrom": null,
            "timeRegions": [],
            "timeShift": null,
            "title": "Queue Count",
            "tooltip": {
                "msResolution": true,
                "shared": true,
                "sort": 0,
                "value_type": "cumulative"
            },
            "type": "graph",
            "xaxis": {
                "buckets": null,
                "mode": "time",
                "name": null,
                "show": true,
                "values": []
            },
            "yaxes": [{
                    "format": "short",
                    "logBase": 1,
                    "max": null,
                    "min": null,
                    "show": true
                },
                {
                    "format": "short",
                    "logBase": 1,
                    "max": null,
                    "min": null,
                    "show": true
                }
            ],
            "yaxis": {
                "align": false,
                "alignLevel": null
            }
        },
        {
            "collapsed": false,
            "datasource": null,
            "gridPos": {
                "h": 1,
                "w": 24,
                "x": 0,
                "y": 35
            },
            "id": 68,
            "panels": [],
            "title": "System",
            "type": "row"
        },
        {
            "cacheTimeout": null,
            "colorBackground": false,
            "colorValue": false,
            "colors": [
                "rgba(245, 54, 54, 0.9)",
                "rgba(237, 129, 40, 0.89)",
                "rgba(50, 172, 45, 0.97)"
            ],
            "datasource": "$server",
            "editable": false,
            "error": false,
            "format": "bytes",
            "gauge": {
                "maxValue": 100,
                "minValue": 0,
                "show": false,
                "thresholdLabels": false,
                "thresholdMarkers": true
            },
            "gridPos": {
                "h": 3,
                "w": 8,
                "x": 0,
                "y": 36
            },
            "height": "",
            "id": 12,
            "interval": null,
            "links": [],
            "mappingType": 1,
            "mappingTypes": [{
                    "name": "value to text",
                    "value": 1
                },
                {
                    "name": "range to text",
                    "value": 2
                }
            ],
            "maxDataPoints": 100,
            "nullPointMode": "connected",
            "nullText": null,
            "options": {},
            "postfix": "",
            "postfixFontSize": "50%",
            "prefix": "",
            "prefixFontSize": "50%",
            "rangeMaps": [{
                "from": "null",
                "text": "N/A",
                "to": "null"
            }],
            "sparkline": {
                "fillColor": "rgba(31, 118, 189, 0.18)",
                "full": false,
                "lineColor": "rgb(31, 120, 193)",
                "show": true
            },
            "tableColumn": "",
            "targets": [{
                "expr": "sum(node_memory_MemTotal_bytes{cluster=~\"$cluster\"})",
                "intervalFactor": 2,
                "legendFormat": "",
                "metric": "",
                "refId": "A",
                "step": 1800
            }],
            "thresholds": "",
            "title": "Total Memory",
            "type": "singlestat",
            "valueFontSize": "80%",
            "valueMaps": [{
                "op": "=",
                "text": "N/A",
                "value": "null"
            }],
            "valueName": "current"
        },
        {
            "cacheTimeout": null,
            "colorBackground": false,
            "colorValue": false,
            "colors": [
                "rgba(245, 54, 54, 0.9)",
                "rgba(237, 129, 40, 0.89)",
                "rgba(50, 172, 45, 0.97)"
            ],
            "datasource": "$server",
            "editable": false,
            "error": false,
            "format": "bytes",
            "gauge": {
                "maxValue": 100,
                "minValue": 0,
                "show": false,
                "thresholdLabels": false,
                "thresholdMarkers": true
            },
            "gridPos": {
                "h": 3,
                "w": 8,
                "x": 8,
                "y": 36
            },
            "height": "",
            "id": 13,
            "interval": null,
            "links": [],
            "mappingType": 1,
            "mappingTypes": [{
                    "name": "value to text",
                    "value": 1
                },
                {
                    "name": "range to text",
                    "value": 2
                }
            ],
            "maxDataPoints": 100,
            "nullPointMode": "connected",
            "nullText": null,
            "options": {},
            "postfix": "",
            "postfixFontSize": "50%",
            "prefix": "",
            "prefixFontSize": "50%",
            "rangeMaps": [{
                "from": "null",
                "text": "N/A",
                "to": "null"
            }],
            "sparkline": {
                "fillColor": "rgba(31, 118, 189, 0.18)",
                "full": false,
                "lineColor": "rgb(31, 120, 193)",
                "show": true
            },
            "tableColumn": "",
            "targets": [{
                "expr": "sum(node_memory_MemFree_bytes{cluster=~\"$cluster\"})",
                "intervalFactor": 2,
                "legendFormat": "",
                "refId": "A",
                "step": 1800
            }],
            "thresholds": "",
            "title": "Total Memory Free",
            "type": "singlestat",
            "valueFontSize": "80%",
            "valueMaps": [{
                "op": "=",
                "text": "N/A",
                "value": "null"
            }],
            "valueName": "current"
        },
        {
            "cacheTimeout": null,
            "colorBackground": false,
            "colorValue": false,
            "colors": [
                "rgba(245, 54, 54, 0.9)",
                "rgba(237, 129, 40, 0.89)",
                "rgba(50, 172, 45, 0.97)"
            ],
            "datasource": "$server",
            "editable": false,
            "error": false,
            "format": "bytes",
            "gauge": {
                "maxValue": 100,
                "minValue": 0,
                "show": false,
                "thresholdLabels": false,
                "thresholdMarkers": true
            },
            "gridPos": {
                "h": 3,
                "w": 8,
                "x": 16,
                "y": 36
            },
            "height": "",
            "id": 14,
            "interval": null,
            "links": [],
            "mappingType": 1,
            "mappingTypes": [{
                    "name": "value to text",
                    "value": 1
                },
                {
                    "name": "range to text",
                    "value": 2
                }
            ],
            "maxDataPoints": 100,
            "nullPointMode": "connected",
            "nullText": null,
            "options": {},
            "postfix": "",
            "postfixFontSize": "50%",
            "prefix": "",
            "prefixFontSize": "50%",
            "rangeMaps": [{
                "from": "null",
                "text": "N/A",
                "to": "null"
            }],
            "sparkline": {
                "fillColor": "rgba(31, 118, 189, 0.18)",
                "full": false,
                "lineColor": "rgb(31, 120, 193)",
                "show": true
            },
            "tableColumn": "",
            "targets": [{
                "expr": "sum(node_memory_MemAvailable_bytes{cluster=~\"$cluster\"})",
                "intervalFactor": 2,
                "legendFormat": "",
                "refId": "A",
                "step": 1800
            }],
            "thresholds": "",
            "title": "Total Memory Available",
            "type": "singlestat",
            "valueFontSize": "80%",
            "valueMaps": [{
                "op": "=",
                "text": "N/A",
                "value": "null"
            }],
            "valueName": "current"
        },
        {
            "aliasColors": {},
            "bars": false,
            "dashLength": 10,
            "dashes": false,
            "datasource": "$server",
            "editable": false,
            "error": false,
            "fill": 1,
            "fillGradient": 0,
            "grid": {},
            "gridPos": {
                "h": 8,
                "w": 12,
                "x": 0,
                "y": 39
            },
            "hiddenSeries": false,
            "id": 1,
            "legend": {
                "avg": false,
                "current": false,
                "max": false,
                "min": false,
                "show": true,
                "total": false,
                "values": false
            },
            "lines": true,
            "linewidth": 2,
            "links": [],
            "nullPointMode": "connected",
            "options": {
                "dataLinks": []
            },
            "percentage": false,
            "pointradius": 5,
            "points": false,
            "renderer": "flot",
            "seriesOverrides": [],
            "spaceLength": 10,
            "stack": false,
            "steppedLine": false,
            "targets": [{
                "expr": "sum(elasticsearch_thread_pool_active_count{cluster=~\"$cluster\", type!=\"management\"}) by (type)",
                "format": "time_series",
                "interval": "",
                "intervalFactor": 2,
                "legendFormat": "Type: {{ type }}",
                "refId": "A",
                "step": 240
            }],
            "thresholds": [],
            "timeFrom": null,
            "timeRegions": [],
            "timeShift": null,
            "title": "Thread Pools",
            "tooltip": {
                "msResolution": true,
                "shared": true,
                "sort": 0,
                "value_type": "cumulative"
            },
            "type": "graph",
            "xaxis": {
                "buckets": null,
                "mode": "time",
                "name": null,
                "show": true,
                "values": []
            },
            "yaxes": [{
                    "format": "short",
                    "logBase": 1,
                    "max": null,
                    "min": null,
                    "show": true
                },
                {
                    "format": "short",
                    "logBase": 1,
                    "max": null,
                    "min": null,
                    "show": true
                }
            ],
            "yaxis": {
                "align": false,
                "alignLevel": null
            }
        },
        {
            "aliasColors": {},
            "bars": false,
            "dashLength": 10,
            "dashes": false,
            "datasource": "$server",
            "editable": false,
            "error": false,
            "fill": 1,
            "fillGradient": 0,
            "grid": {},
            "gridPos": {
                "h": 8,
                "w": 12,
                "x": 12,
                "y": 39
            },
            "hiddenSeries": false,
            "id": 66,
            "legend": {
                "avg": false,
                "current": false,
                "max": false,
                "min": false,
                "show": true,
                "total": false,
                "values": false
            },
            "lines": true,
            "linewidth": 2,
            "links": [],
            "nullPointMode": "connected",
            "options": {
                "dataLinks": []
            },
            "percentage": false,
            "pointradius": 5,
            "points": false,
            "renderer": "flot",
            "seriesOverrides": [],
            "spaceLength": 10,
            "stack": false,
            "steppedLine": false,
            "targets": [{
                "expr": "rate(elasticsearch_thread_pool_rejected_count{cluster=~\"$cluster\", type!=\"management\"}[5m])",
                "interval": "",
                "intervalFactor": 2,
                "legendFormat": "{{ name }} {{ type }}",
                "refId": "A",
                "step": 240
            }],
            "thresholds": [],
            "timeFrom": null,
            "timeRegions": [],
            "timeShift": null,
            "title": "Thread pool rejections",
            "tooltip": {
                "msResolution": true,
                "shared": true,
                "sort": 0,
                "value_type": "cumulative"
            },
            "type": "graph",
            "xaxis": {
                "buckets": null,
                "mode": "time",
                "name": null,
                "show": true,
                "values": []
            },
            "yaxes": [{
                    "format": "short",
                    "logBase": 1,
                    "max": null,
                    "min": null,
                    "show": true
                },
                {
                    "format": "short",
                    "logBase": 1,
                    "max": null,
                    "min": null,
                    "show": true
                }
            ],
            "yaxis": {
                "align": false,
                "alignLevel": null
            }
        },
        {
            "aliasColors": {},
            "bars": false,
            "dashLength": 10,
            "dashes": false,
            "datasource": "$server",
            "fill": 1,
            "fillGradient": 0,
            "gridPos": {
                "h": 9,
                "w": 12,
                "x": 0,
                "y": 47
            },
            "hiddenSeries": false,
            "id": 57,
            "legend": {
                "avg": false,
                "current": false,
                "max": false,
                "min": false,
                "show": true,
                "total": false,
                "values": false
            },
            "lines": true,
            "linewidth": 1,
            "links": [],
            "nullPointMode": "null",
            "options": {
                "dataLinks": []
            },
            "percentage": false,
            "pointradius": 5,
            "points": false,
            "renderer": "flot",
            "seriesOverrides": [],
            "spaceLength": 10,
            "stack": false,
            "steppedLine": false,
            "targets": [{
                "bucketAggs": [{
                    "id": "2",
                    "settings": {
                        "interval": "auto"
                    },
                    "type": "date_histogram"
                }],
                "dsType": "elasticsearch",
                "expr": "avg(rate(node_cpu_seconds_total{cluster=~\"$cluster\"}[20s])) by(mode) *100",
                "format": "time_series",
                "intervalFactor": 2,
                "legendFormat": "{{ mode }}",
                "metric": "elasticsearch_breakers_tripped",
                "metrics": [{
                    "id": "1",
                    "type": "count"
                }],
                "refId": "A",
                "step": 240,
                "timeField": "failure_tstamp"
            }],
            "thresholds": [],
            "timeFrom": null,
            "timeRegions": [],
            "timeShift": null,
            "title": "Avg. CPU Usage",
            "tooltip": {
                "shared": true,
                "sort": 0,
                "value_type": "individual"
            },
            "type": "graph",
            "xaxis": {
                "buckets": null,
                "mode": "time",
                "name": null,
                "show": true,
                "values": []
            },
            "yaxes": [{
                    "format": "short",
                    "label": "",
                    "logBase": 1,
                    "max": null,
                    "min": "0",
                    "show": true
                },
                {
                    "format": "short",
                    "label": null,
                    "logBase": 1,
                    "max": null,
                    "min": null,
                    "show": true
                }
            ],
            "yaxis": {
                "align": false,
                "alignLevel": null
            }
        },
        {
            "aliasColors": {},
            "bars": false,
            "dashLength": 10,
            "dashes": false,
            "datasource": "$server",
            "editable": false,
            "error": false,
            "fill": 1,
            "fillGradient": 0,
            "grid": {},
            "gridPos": {
                "h": 9,
                "w": 12,
                "x": 12,
                "y": 47
            },
            "hiddenSeries": false,
            "id": 28,
            "legend": {
                "alignAsTable": true,
                "avg": true,
                "current": true,
                "max": true,
                "min": true,
                "rightSide": false,
                "show": true,
                "total": false,
                "values": true
            },
            "lines": true,
            "linewidth": 2,
            "links": [],
            "nullPointMode": "connected",
            "options": {
                "dataLinks": []
            },
            "percentage": false,
            "pointradius": 5,
            "points": false,
            "renderer": "flot",
            "seriesOverrides": [],
            "spaceLength": 10,
            "stack": false,
            "steppedLine": false,
            "targets": [{
                "expr": "avg_over_time(elasticsearch_jvm_memory_used_bytes{area=\"heap\",cluster=~\"$cluster\"}[15m]) / elasticsearch_jvm_memory_max_bytes{area=\"heap\",cluster=~\"$cluster\"}",
                "format": "time_series",
                "interval": "",
                "intervalFactor": 2,
                "legendFormat": "{{ name }}",
                "refId": "A",
                "step": 240
            }],
            "thresholds": [],
            "timeFrom": null,
            "timeRegions": [],
            "timeShift": null,
            "title": "Avg Heap in 15min",
            "tooltip": {
                "msResolution": true,
                "shared": true,
                "sort": 0,
                "value_type": "cumulative"
            },
            "type": "graph",
            "xaxis": {
                "buckets": null,
                "mode": "time",
                "name": null,
                "show": true,
                "values": []
            },
            "yaxes": [{
                    "format": "percentunit",
                    "label": "",
                    "logBase": 1,
                    "max": 1,
                    "min": 0,
                    "show": true
                },
                {
                    "format": "short",
                    "label": null,
                    "logBase": 1,
                    "max": null,
                    "min": null,
                    "show": false
                }
            ],
            "yaxis": {
                "align": false,
                "alignLevel": null
            }
        },
        {
            "aliasColors": {},
            "bars": false,
            "dashLength": 10,
            "dashes": false,
            "datasource": "$server",
            "editable": false,
            "error": false,
            "fill": 1,
            "fillGradient": 0,
            "grid": {},
            "gridPos": {
                "h": 8,
                "w": 12,
                "x": 0,
                "y": 56
            },
            "hiddenSeries": false,
            "id": 5,
            "legend": {
                "alignAsTable": true,
                "avg": true,
                "current": true,
                "max": true,
                "min": true,
                "show": true,
                "total": false,
                "values": true
            },
            "lines": true,
            "linewidth": 2,
            "links": [],
            "nullPointMode": "connected",
            "options": {
                "dataLinks": []
            },
            "percentage": false,
            "pointradius": 5,
            "points": false,
            "renderer": "flot",
            "seriesOverrides": [],
            "spaceLength": 10,
            "stack": false,
            "steppedLine": false,
            "targets": [{
                    "expr": "sum(rate(elasticsearch_transport_rx_packets_total{cluster=~\"$cluster\"}[5m]))",
                    "format": "time_series",
                    "intervalFactor": 2,
                    "legendFormat": "RX",
                    "refId": "A",
                    "step": 240
                },
                {
                    "expr": "sum(rate(elasticsearch_transport_tx_packets_total{cluster=~\"$cluster\"}[5m])) * -1",
                    "format": "time_series",
                    "intervalFactor": 2,
                    "legendFormat": "TX",
                    "refId": "B",
                    "step": 240
                }
            ],
            "thresholds": [],
            "timeFrom": null,
            "timeRegions": [],
            "timeShift": null,
            "title": "RX/TX Rate 5m",
            "tooltip": {
                "msResolution": true,
                "shared": true,
                "sort": 0,
                "value_type": "cumulative"
            },
            "type": "graph",
            "xaxis": {
                "buckets": null,
                "mode": "time",
                "name": null,
                "show": true,
                "values": []
            },
            "yaxes": [{
                    "format": "short",
                    "logBase": 1,
                    "max": null,
                    "min": null,
                    "show": true
                },
                {
                    "format": "short",
                    "logBase": 1,
                    "max": null,
                    "min": null,
                    "show": true
                }
            ],
            "yaxis": {
                "align": false,
                "alignLevel": null
            }
        },
        {
            "aliasColors": {},
            "bars": false,
            "dashLength": 10,
            "dashes": false,
            "datasource": "$server",
            "editable": false,
            "error": false,
            "fill": 1,
            "fillGradient": 0,
            "grid": {},
            "gridPos": {
                "h": 8,
                "w": 12,
                "x": 12,
                "y": 56
            },
            "hiddenSeries": false,
            "id": 65,
            "legend": {
                "avg": false,
                "current": false,
                "max": false,
                "min": false,
                "show": true,
                "total": false,
                "values": false
            },
            "lines": true,
            "linewidth": 2,
            "links": [],
            "nullPointMode": "connected",
            "options": {
                "dataLinks": []
            },
            "percentage": false,
            "pointradius": 5,
            "points": false,
            "renderer": "flot",
            "seriesOverrides": [],
            "spaceLength": 10,
            "stack": false,
            "steppedLine": false,
            "targets": [{
                "expr": "irate(elasticsearch_jvm_gc_collection_seconds_sum{cluster=~\"$cluster\"}[1m])",
                "interval": "",
                "intervalFactor": 2,
                "legendFormat": "{{ name }} {{ gc }}",
                "refId": "A",
                "step": 240
            }],
            "thresholds": [],
            "timeFrom": null,
            "timeRegions": [],
            "timeShift": null,
            "title": "GC seconds",
            "tooltip": {
                "msResolution": true,
                "shared": true,
                "sort": 0,
                "value_type": "cumulative"
            },
            "type": "graph",
            "xaxis": {
                "buckets": null,
                "mode": "time",
                "name": null,
                "show": true,
                "values": []
            },
            "yaxes": [{
                    "format": "short",
                    "logBase": 1,
                    "max": null,
                    "min": null,
                    "show": true
                },
                {
                    "format": "short",
                    "logBase": 1,
                    "max": null,
                    "min": null,
                    "show": true
                }
            ],
            "yaxis": {
                "align": false,
                "alignLevel": null
            }
        }
    ],
    "refresh": "1m",
    "schemaVersion": 22,
    "style": "dark",
    "tags": [
        "infra",
        "b2c",
        "elastic"
    ],
    "templating": {
        "list": [{
                "current": {
                    "selected": true,
                    "text": "Prometheus",
                    "value": "Prometheus"
                },
                "hide": 0,
                "includeAll": false,
                "label": "Server",
                "multi": false,
                "name": "server",
                "options": [],
                "query": "prometheus",
                "refresh": 1,
                "regex": "",
                "skipUrlSync": false,
                "type": "datasource"
            },
            {
                "allValue": null,
                "current": {
                    "text": "ska-systems1",
                    "value": "ska-systems1"
                },
                "datasource": "$server",
                "definition": "",
                "hide": 0,
                "includeAll": false,
                "label": "Cluster:",
                "multi": false,
                "name": "cluster",
                "options": [],
                "query": "label_values(elasticsearch_cluster_health_status,cluster)",
                "refresh": 1,
                "regex": "",
                "skipUrlSync": false,
                "sort": 0,
                "tagValuesQuery": "",
                "tags": [],
                "tagsQuery": "",
                "type": "query",
                "useTags": false
            },
            {
                "allValue": null,
                "current": {
                    "selected": true,
                    "text": "192.168.93.94:9114",
                    "value": "192.168.93.94:9114"
                },
                "datasource": "$server",
                "definition": "",
                "hide": 0,
                "includeAll": false,
                "label": "Instance:",
                "multi": false,
                "name": "instance",
                "options": [],
                "query": "label_values(elasticsearch_cluster_health_status,instance)",
                "refresh": 1,
                "regex": "",
                "skipUrlSync": false,
                "sort": 0,
                "tagValuesQuery": "",
                "tags": [],
                "tagsQuery": "",
                "type": "query",
                "useTags": false
            }
        ]
    },
    "time": {
        "from": "now-1h",
        "to": "now"
    },
    "timepicker": {
        "refresh_intervals": [
            "5s",
            "10s",
            "30s",
            "1m",
            "5m",
            "15m",
            "30m",
            "1h",
            "2h",
            "1d"
        ],
        "time_options": [
            "5m",
            "15m",
            "1h",
            "6h",
            "12h",
            "24h",
            "2d",
            "7d",
            "30d"
        ]
    },
    "timezone": "utc",
    "title": "ElasticSearch Dashboard",
    "uid": "n_nxrE_mk",
    "version": 4
}