{
    "user_claim": "nickname",
    "allowed_redirect_uris": "http://localhost:8250/oidc/callback,https://vault.skao.int/ui/vault/auth/oidc/oidc/callback",
    "bound_audiences": "e94204e8ae0e73ffca8ad8abf5f42e106a174fa8eaa0ec6d9d96875746018b93",
    "oidc_scopes": "openid",
    "role_type": "oidc",
    "policies": "default, cicd",
    "ttl": "1h",
    "bound_claims": { "groups": ["ska-telescope/ska-dev"] }
}