{
  "occur_at": 1716913882,
  "operator": "admin",
  "event_data": {
      "resources": [
          {
          "digest": "sha256:28e01ab32c9dbcbaae96cf0d5b472f22e231d9e603811857b295e61197e40a9b",
          "tag": "v01",
          "resource_url": "harbor.skao.int/test-validations/busybox:v01"
          }
      ],
      "repository": {
          "date_created": 1713296145,
          "namespace": "test-validations",
          "repo_full_name": "test-validations/busybox",
          "repo_type": "private"
      }
  }
}