Timestamp,UTC,Callsign,Position,Altitude,Speed,Direction
1554725226,2019-04-08T12:07:06Z,,"-26.014498,28.238651",8575,0,313
1554725237,2019-04-08T12:07:17Z,,"-26.007374,28.218573",9196,0,291
1554725244,2019-04-08T12:07:24Z,,"-26.007828,28.211502",9327,0,291
1554725255,2019-04-08T12:07:35Z,,"-26.008018,28.193781",9882,0,291
1554725262,2019-04-08T12:07:42Z,,"-26.009851,28.181309",10231,0,268
1554725269,2019-04-08T12:07:49Z,,"-26.011324,28.168932",10481,0,265
1554725280,2019-04-08T12:08:00Z,,"-26.012712,28.155993",10599,0,262
1554725298,2019-04-08T12:08:18Z,,"-26.016548,28.124687",10950,0,259
1554725314,2019-04-08T12:08:34Z,,"-26.019878,28.104368",11150,0,259
1554725329,2019-04-08T12:08:49Z,,"-26.022907,28.072607",11711,0,262
1554725344,2019-04-08T12:09:04Z,,"-26.027517,28.048513",12171,0,259
1554725378,2019-04-08T12:09:38Z,,"-26.04538,27.98106",13777,0,246
1554725386,2019-04-08T12:09:46Z,,"-26.052711,27.966789",14204,0,242
1554725393,2019-04-08T12:09:53Z,,"-26.060892,27.953503",14666,0,237
1554725400,2019-04-08T12:10:00Z,,"-26.069777,27.942043",15092,0,231
1554725410,2019-04-08T12:10:10Z,,"-26.07876,27.93189",15500,0,227
1554725436,2019-04-08T12:10:36Z,,"-26.115242,27.892504",16950,0,217
1554725446,2019-04-08T12:10:46Z,,"-26.12752,27.882792",17264,0,216
1554725454,2019-04-08T12:10:54Z,,"-26.13936,27.872988",17598,0,216
1554725460,2019-04-08T12:11:00Z,,"-26.14995,27.864388",17862,0,216
1554725494,2019-04-08T12:11:34Z,,"-26.19459,27.824434",19234,0,218
1554725557,2019-04-08T12:12:37Z,,"-26.276033,27.744078",21550,0,222
1554725622,2019-04-08T12:13:42Z,,"-26.363859,27.649549",23732,0,224
1554725685,2019-04-08T12:14:45Z,,"-26.450846,27.555229",25519,0,224
1554725746,2019-04-08T12:15:46Z,,"-26.534777,27.464197",26871,0,224
1554725810,2019-04-08T12:16:50Z,,"-26.627373,27.363781",28225,0,224
1554725870,2019-04-08T12:17:50Z,,"-26.716753,27.267017",29750,0,224
1554725937,2019-04-08T12:18:57Z,,"-26.798138,27.178812",31800,0,224
1554726000,2019-04-08T12:20:00Z,,"-26.906111,27.061113",33950,0,224
1554726077,2019-04-08T12:21:17Z,,"-26.994114,26.964977",35267,0,224
1554726139,2019-04-08T12:22:19Z,,"-27.086975,26.849348",36705,0,246
1554726145,2019-04-08T12:22:25Z,,"-27.094036,26.843147",36800,0,246
1554726166,2019-04-08T12:22:46Z,,"-27.1052,26.832094",36900,0,246
1554726238,2019-04-08T12:23:58Z,,"-27.222553,26.712311",38000,0,226
1554726257,2019-04-08T12:24:17Z,,"-27.240343,26.69389",38000,0,223
1554726293,2019-04-08T12:24:53Z,,"-27.284285,26.646973",37999,0,223
1554726384,2019-04-08T12:26:24Z,,"-27.414022,26.50416",38000,0,223
1554726396,2019-04-08T12:26:36Z,,"-27.433401,26.482521",38000,0,223
1554726473,2019-04-08T12:27:53Z,,"-27.535555,26.368608",38000,0,225
1554726566,2019-04-08T12:29:26Z,,"-27.657166,26.233574",38000,0,225
1554726641,2019-04-08T12:30:41Z,,"-27.674973,26.213634",38000,0,225
1554726696,2019-04-08T12:31:36Z,,"-27.815619,26.056435",38000,0,225
1554726800,2019-04-08T12:33:20Z,,"-27.843477,26.023399",38000,0,225
1554726954,2019-04-08T12:35:54Z,,"-27.979546,25.871284",38000,0,225
1554727426,2019-04-08T12:43:46Z,,"-28.78861,24.943722",37999,0,213
1554727434,2019-04-08T12:43:54Z,,"-28.799625,24.934546",38000,0,216
1554727480,2019-04-08T12:44:40Z,,"-28.847902,24.885235",38000,0,216
1554727576,2019-04-08T12:46:16Z,,"-28.978134,24.740362",38000,0,216
1554727625,2019-04-08T12:47:05Z,,"-29.024334,24.637228",38000,0,205
1554727688,2019-04-08T12:48:08Z,,"-29.103733,24.581684",38000,0,215
1554727722,2019-04-08T12:48:42Z,,"-29.177551,24.506927",38000,0,222
1554728222,2019-04-08T12:57:02Z,,"-29.713837,23.873676",38000,0,225
1554728346,2019-04-08T12:59:06Z,,"-29.88328,23.672724",38000,0,226
1554728425,2019-04-08T13:00:25Z,,"-30.079367,23.438898",38000,0,226
1554728468,2019-04-08T13:01:08Z,,"-30.143734,23.361549",38000,0,226
1554728556,2019-04-08T13:02:36Z,,"-30.256382,23.226622",38000,0,226
1554728616,2019-04-08T13:03:36Z,,"-30.334883,23.131752",38000,0,226
1554728678,2019-04-08T13:04:38Z,,"-30.407497,23.044662",38000,0,226
1554728785,2019-04-08T13:06:25Z,,"-30.416647,23.033634",38000,0,226
1554728872,2019-04-08T13:07:52Z,,"-30.620255,22.786957",38000,0,226
1554728941,2019-04-08T13:09:01Z,,"-30.73468,22.647287",38000,0,226
1554728962,2019-04-08T13:09:22Z,,"-30.769129,22.604895",37999,0,226
1554729062,2019-04-08T13:11:02Z,,"-30.870317,22.479572",38000,0,227
1554729097,2019-04-08T13:11:37Z,,"-30.930176,22.404581",37999,0,227
1554729154,2019-04-08T13:12:34Z,,"-30.945089,22.385721",38000,0,227
1554729865,2019-04-08T13:24:25Z,,"-31.888479,21.196146",38000,0,228
1554729938,2019-04-08T13:25:38Z,,"-31.984741,21.072876",38000,0,228
1554729996,2019-04-08T13:26:36Z,,"-32.057674,20.978876",38000,0,228
1554730062,2019-04-08T13:27:42Z,,"-32.135387,20.875134",38000,0,228
1554730124,2019-04-08T13:28:44Z,,"-32.215157,20.773886",38000,0,227
1554730188,2019-04-08T13:29:48Z,,"-32.292034,20.674248",38000,0,228
1554730250,2019-04-08T13:30:50Z,,"-32.366581,20.576193",38000,0,228
1554730312,2019-04-08T13:31:52Z,,"-32.444134,20.476242",37850,0,228
1554730377,2019-04-08T13:32:57Z,,"-32.522572,20.373865",36768,0,228
1554730441,2019-04-08T13:34:01Z,,"-32.591282,20.283993",35904,0,228
1554730505,2019-04-08T13:35:05Z,,"-32.682858,20.163931",34736,0,228
1554730569,2019-04-08T13:36:09Z,,"-32.761623,20.061247",32418,0,228
1554730632,2019-04-08T13:37:12Z,,"-32.83313,19.964914",30205,0,229
1554730698,2019-04-08T13:38:18Z,,"-32.903267,19.871538",28025,0,229
1554730764,2019-04-08T13:39:24Z,,"-32.986855,19.762129",25696,0,228
1554730828,2019-04-08T13:40:28Z,,"-33.055069,19.669626",23501,0,229
1554730893,2019-04-08T13:41:33Z,,"-33.123711,19.577522",21407,0,229
1554730952,2019-04-08T13:42:32Z,,"-33.186218,19.493519",19538,0,228
1554731021,2019-04-08T13:43:41Z,,"-33.256187,19.39893",17489,0,229
1554731052,2019-04-08T13:44:12Z,,"-33.288952,19.355883",16525,0,228
1554731084,2019-04-08T13:44:44Z,,"-33.319607,19.314287",15800,0,228
1554731120,2019-04-08T13:45:20Z,,"-33.347965,19.276243",15145,0,228
1554731157,2019-04-08T13:45:57Z,,"-33.39093,19.218033",14597,0,228
1554731190,2019-04-08T13:46:30Z,,"-33.420872,19.177525",13713,0,227
1554731220,2019-04-08T13:47:00Z,,"-33.455223,19.139095",12891,0,222
1554731254,2019-04-08T13:47:34Z,,"-33.490112,19.104317",12192,0,220
1554731289,2019-04-08T13:48:09Z,,"-33.528038,19.066338",11024,0,220
1554731301,2019-04-08T13:48:21Z,,"-33.540207,19.054321",10664,0,220
1554731313,2019-04-08T13:48:33Z,,"-33.554409,19.04015",10303,0,220
1554731324,2019-04-08T13:48:44Z,,"-33.566296,19.028189",10050,0,220
1554731338,2019-04-08T13:48:58Z,,"-33.579552,19.014633",9773,0,220
1554731352,2019-04-08T13:49:12Z,,"-33.596111,18.99786",9437,0,220
1554731364,2019-04-08T13:49:24Z,,"-33.608273,18.985386",9157,0,220
1554731373,2019-04-08T13:49:33Z,,"-33.615417,18.977606",8950,0,222
1554731392,2019-04-08T13:49:52Z,,"-33.635067,18.957296",8439,0,221
1554731405,2019-04-08T13:50:05Z,,"-33.645947,18.946003",8100,0,221
1554731414,2019-04-08T13:50:14Z,,"-33.653236,18.938272",7900,0,221
1554731428,2019-04-08T13:50:28Z,,"-33.668652,18.922102",7492,0,221
1554731441,2019-04-08T13:50:41Z,,"-33.678825,18.911331",7175,0,221
1554731454,2019-04-08T13:50:54Z,,"-33.690208,18.89901",6819,0,222
1554731468,2019-04-08T13:51:08Z,,"-33.704346,18.884224",6375,0,221
1554731484,2019-04-08T13:51:24Z,,"-33.719284,18.868641",5995,0,221
1554731496,2019-04-08T13:51:36Z,,"-33.730679,18.856819",5708,0,221
1554731510,2019-04-08T13:51:50Z,,"-33.740604,18.846281",5450,0,221
1554731522,2019-04-08T13:52:02Z,,"-33.752048,18.834421",5263,0,221
1554731535,2019-04-08T13:52:15Z,,"-33.762543,18.823507",5078,0,221
1554731545,2019-04-08T13:52:25Z,,"-33.773495,18.811983",4925,0,221
1554731553,2019-04-08T13:52:33Z,,"-33.780163,18.80493",4925,0,221
1554731565,2019-04-08T13:52:45Z,,"-33.790932,18.793468",4900,0,221
1554731572,2019-04-08T13:52:52Z,,"-33.797695,18.786255",4799,0,221
1554731580,2019-04-08T13:53:00Z,,"-33.804981,18.778406",4644,0,221
1554731589,2019-04-08T13:53:09Z,,"-33.811707,18.771219",4344,0,221
1554731597,2019-04-08T13:53:17Z,,"-33.818394,18.764093",4035,0,221
1554731608,2019-04-08T13:53:28Z,,"-33.828266,18.75362",3638,0,221
1554731620,2019-04-08T13:53:40Z,,"-33.838875,18.742405",3461,0,221
1554731629,2019-04-08T13:53:49Z,,"-33.845619,18.734894",3379,0,222
1554731638,2019-04-08T13:53:58Z,,"-33.851463,18.727507",3350,0,225
1554731648,2019-04-08T13:54:08Z,,"-33.859081,18.71563",3263,0,229
1554731656,2019-04-08T13:54:16Z,,"-33.863811,18.706518",3187,0,235
1554731664,2019-04-08T13:54:24Z,,"-33.867203,18.698435",3132,0,240
1554731672,2019-04-08T13:54:32Z,,"-33.870644,18.689573",3069,0,243
1554731678,2019-04-08T13:54:38Z,,"-33.871998,18.685581",3037,0,246
1554731688,2019-04-08T13:54:48Z,,"-33.876247,18.672531",2859,0,247
1554731697,2019-04-08T13:54:57Z,,"-33.87862,18.664288",2705,0,250
1554731704,2019-04-08T13:55:04Z,,"-33.880558,18.656755",2606,0,252
1554731713,2019-04-08T13:55:13Z,,"-33.882629,18.648668",2496,0,252
1554731724,2019-04-08T13:55:24Z,,"-33.885082,18.637232",2213,0,256
1554731732,2019-04-08T13:55:32Z,,"-33.886555,18.629387",2039,0,257
1554731741,2019-04-08T13:55:41Z,,"-33.887821,18.622135",1825,0,258
1554731749,2019-04-08T13:55:49Z,,"-33.889027,18.615828",1725,0,258
1554731760,2019-04-08T13:56:00Z,,"-33.89164,18.605036",1445,0,255
1554731768,2019-04-08T13:56:08Z,,"-33.893337,18.598894",1350,0,253
1554731776,2019-04-08T13:56:16Z,,"-33.895355,18.592031",1330,0,252
1554731786,2019-04-08T13:56:26Z,,"-33.897278,18.586552",1305,0,250
1554731797,2019-04-08T13:56:37Z,,"-33.900177,18.580694",1250,0,245
1554731804,2019-04-08T13:56:44Z,,"-33.902809,18.576796",1200,0,245
1554731812,2019-04-08T13:56:52Z,,"-33.909229,18.572895",1100,0,226
1554731830,2019-04-08T13:57:10Z,,"-33.914982,18.573578",873,0,219
1554731836,2019-04-08T13:57:16Z,,"-33.9212,18.575317",773,748,180
1554731842,2019-04-08T13:57:22Z,,"-33.924522,18.576187",713,688,169
1554731848,2019-04-08T13:57:28Z,,"-33.930298,18.578684",614,589,162
1554731857,2019-04-08T13:57:37Z,,"-33.936607,18.581215",508,483,161
1554731864,2019-04-08T13:57:44Z,,"-33.942677,18.584106",402,377,158
1554731877,2019-04-08T13:57:57Z,,"-33.948574,18.587196",324,299,156
