Timestamp,UTC,Callsign,Position,Altitude,Speed,Direction
1556794368,2019-05-02T10:52:48Z,CAW417,"-26.074295,28.260546",7229,200,12
1556794392,2019-05-02T10:53:12Z,CAW417,"-26.070797,28.261139",7308,200,12
1556794410,2019-05-02T10:53:30Z,CAW417,"-26.037317,28.260187",8099,212,264
1556794430,2019-05-02T10:53:50Z,CAW417,"-26.015215,28.239666",9000,225,303
1556794448,2019-05-02T10:54:08Z,CAW417,"-26.010674,28.226549",9236,223,296
1556794466,2019-05-02T10:54:26Z,CAW417,"-26.008593,28.207266",9750,223,296
1556794475,2019-05-02T10:54:35Z,CAW417,"-26.018011,28.190489",10263,237,259
1556794484,2019-05-02T10:54:44Z,CAW417,"-26.026703,28.178438",10590,318,235
1556794490,2019-05-02T10:54:50Z,CAW417,"-26.034878,28.167393",10885,326,233
1556794496,2019-05-02T10:54:56Z,CAW417,"-26.040707,28.161684",11004,347,227
1556794502,2019-05-02T10:55:02Z,CAW417,"-26.048882,28.150402",11275,340,230
1556794520,2019-05-02T10:55:20Z,CAW417,"-26.065619,28.130405",11666,350,227
1556794530,2019-05-02T10:55:30Z,CAW417,"-26.079641,28.114376",11862,354,226
1556794547,2019-05-02T10:55:47Z,CAW417,"-26.098978,28.094067",12224,365,223
1556794576,2019-05-02T10:56:16Z,CAW417,"-26.13722,28.055872",13320,384,222
1556794615,2019-05-02T10:56:55Z,CAW417,"-26.191628,28.00132",15117,388,222
1556794647,2019-05-02T10:57:27Z,CAW417,"-26.231884,27.957571",16425,385,225
1556794679,2019-05-02T10:57:59Z,CAW417,"-26.270315,27.911564",17800,383,227
1556794710,2019-05-02T10:58:30Z,CAW417,"-26.309156,27.863932",19289,380,228
1556794774,2019-05-02T10:59:34Z,CAW417,"-26.389399,27.76989",21575,395,226
1556794843,2019-05-02T11:00:43Z,CAW417,"-26.467972,27.679253",23575,411,226
1556794906,2019-05-02T11:01:46Z,CAW417,"-26.565422,27.566223",26332,420,226
1556794968,2019-05-02T11:02:48Z,CAW417,"-26.647148,27.471928",27748,421,226
1556795032,2019-05-02T11:03:52Z,CAW417,"-26.735844,27.368658",29575,440,226
1556795094,2019-05-02T11:04:54Z,CAW417,"-26.825319,27.263887",31783,436,226
1556795156,2019-05-02T11:05:56Z,CAW417,"-26.906443,27.168905",31974,427,226
1556795219,2019-05-02T11:06:59Z,CAW417,"-26.99485,27.065672",31975,424,226
1556795278,2019-05-02T11:07:58Z,CAW417,"-27.071308,26.977112",31975,427,226
1556795342,2019-05-02T11:09:02Z,CAW417,"-27.161709,26.870485",31974,421,226
1556795406,2019-05-02T11:10:06Z,CAW417,"-27.248442,26.768177",31975,420,226
1556795468,2019-05-02T11:11:08Z,CAW417,"-27.328037,26.674273",31975,420,226
1556795531,2019-05-02T11:12:11Z,CAW417,"-27.414112,26.572628",31974,420,226
1556795594,2019-05-02T11:13:14Z,CAW417,"-27.493862,26.477455",31974,420,226
1556795668,2019-05-02T11:14:28Z,CAW417,"-27.579927,26.37495",31999,421,226
1556795718,2019-05-02T11:15:18Z,CAW417,"-27.6499,26.291428",31974,420,226
1556795803,2019-05-02T11:16:43Z,CAW417,"-27.780531,26.135437",32000,422,226
1556795862,2019-05-02T11:17:42Z,CAW417,"-27.855497,26.046028",32000,424,226
1556795928,2019-05-02T11:18:48Z,CAW417,"-27.935913,25.949087",31975,424,226
1556795983,2019-05-02T11:19:43Z,CAW417,"-28.006594,25.863276",31974,427,227
1556796074,2019-05-02T11:21:14Z,CAW417,"-28.150251,25.69894",32000,428,224
1556796132,2019-05-02T11:22:12Z,CAW417,"-28.227663,25.612154",31999,428,224
1556796200,2019-05-02T11:23:20Z,CAW417,"-28.322023,25.505171",31974,420,225
1556796264,2019-05-02T11:24:24Z,CAW417,"-28.400043,25.41601",31975,420,225
1556796335,2019-05-02T11:25:35Z,CAW417,"-28.491539,25.310528",31975,420,225
1556796362,2019-05-02T11:26:02Z,CAW417,"-28.547642,25.246269",31975,420,225
1556797370,2019-05-02T11:42:50Z,CAW417,"-29.907898,23.649803",32000,420,226
1556797394,2019-05-02T11:43:14Z,CAW417,"-29.923737,23.631029",31975,420,46
1556797455,2019-05-02T11:44:15Z,CAW417,"-29.967617,23.578526",31975,420,226
1556797486,2019-05-02T11:44:46Z,CAW417,"-30.036922,23.495594",31975,420,227
1556798726,2019-05-02T12:05:26Z,CAW417,"-30.984213,22.336332",31974,420,47
1556799526,2019-05-02T12:18:46Z,CAW417,"-32.681976,20.165318",31974,404,228
1556799558,2019-05-02T12:19:18Z,CAW417,"-32.687885,20.157505",31975,406,228
1556799614,2019-05-02T12:20:14Z,CAW417,"-32.793575,20.017811",32000,406,228
1556799702,2019-05-02T12:21:42Z,CAW417,"-32.892384,19.887011",31975,400,229
1556799768,2019-05-02T12:22:48Z,CAW417,"-32.976116,19.774288",31300,397,228
1556799830,2019-05-02T12:23:50Z,CAW417,"-33.058956,19.663666",30224,390,228
1556799891,2019-05-02T12:24:51Z,CAW417,"-33.13187,19.566107",28325,403,228
1556799954,2019-05-02T12:25:54Z,CAW417,"-33.210808,19.460337",25377,393,228
1556800014,2019-05-02T12:26:54Z,CAW417,"-33.281658,19.365313",22809,381,228
1556800079,2019-05-02T12:27:59Z,CAW417,"-33.353806,19.268293",20154,361,228
1556800144,2019-05-02T12:29:04Z,CAW417,"-33.422493,19.176191",17582,350,228
1556800174,2019-05-02T12:29:34Z,CAW417,"-33.458206,19.134748",16330,335,223
1556800207,2019-05-02T12:30:07Z,CAW417,"-33.491726,19.101089",14857,339,220
1556800239,2019-05-02T12:30:39Z,CAW417,"-33.537045,19.055656",13489,345,219
1556800268,2019-05-02T12:31:08Z,CAW417,"-33.570496,19.022163",13175,338,220
1556800300,2019-05-02T12:31:40Z,CAW417,"-33.604244,18.987782",12756,307,220
1556800335,2019-05-02T12:32:15Z,CAW417,"-33.639221,18.951349",11735,273,221
1556800347,2019-05-02T12:32:27Z,CAW417,"-33.650787,18.939423",11400,275,221
1556800363,2019-05-02T12:32:43Z,CAW417,"-33.665527,18.924208",10970,267,221
1556800374,2019-05-02T12:32:54Z,CAW417,"-33.676914,18.912518",10630,266,221
1556800388,2019-05-02T12:33:08Z,CAW417,"-33.688129,18.900892",10309,263,221
1556800404,2019-05-02T12:33:24Z,CAW417,"-33.702564,18.885754",10052,263,221
1556800414,2019-05-02T12:33:34Z,CAW417,"-33.713509,18.874378",9924,263,221
1556800431,2019-05-02T12:33:51Z,CAW417,"-33.729408,18.860962",9950,267,212
1556800443,2019-05-02T12:34:03Z,CAW417,"-33.740383,18.848717",9950,264,220
1556800456,2019-05-02T12:34:16Z,CAW417,"-33.750168,18.837818",9950,257,222
1556800463,2019-05-02T12:34:23Z,CAW417,"-33.756989,18.830288",9972,250,222
1556800474,2019-05-02T12:34:34Z,CAW417,"-33.766556,18.81967",9975,246,222
1556800487,2019-05-02T12:34:47Z,CAW417,"-33.775829,18.809523",9975,235,222
1556800499,2019-05-02T12:34:59Z,CAW417,"-33.785614,18.798889",9796,233,222
1556800515,2019-05-02T12:35:15Z,CAW417,"-33.795418,18.787954",9342,210,222
1556800526,2019-05-02T12:35:26Z,CAW417,"-33.805309,18.77743",9052,229,222
1556800542,2019-05-02T12:35:42Z,CAW417,"-33.818859,18.763302",8709,235,221
1556800558,2019-05-02T12:35:58Z,CAW417,"-33.8321,18.749653",8418,234,221
1556800571,2019-05-02T12:36:11Z,CAW417,"-33.841572,18.739946",8214,232,221
1556800583,2019-05-02T12:36:23Z,CAW417,"-33.851616,18.730448",7992,230,219
1556800598,2019-05-02T12:36:38Z,CAW417,"-33.863464,18.717695",7653,223,222
1556800610,2019-05-02T12:36:50Z,CAW417,"-33.869431,18.711256",7470,221,222
1556800626,2019-05-02T12:37:06Z,CAW417,"-33.884773,18.695625",6938,216,221
1556800638,2019-05-02T12:37:18Z,CAW417,"-33.8951,18.688543",6644,215,210
1556800648,2019-05-02T12:37:28Z,CAW417,"-33.90284,18.685564",6413,217,201
1556800655,2019-05-02T12:37:35Z,CAW417,"-33.91116,18.684698",6251,218,189
1556800661,2019-05-02T12:37:41Z,CAW417,"-33.915352,18.68503",6156,218,189
1556800670,2019-05-02T12:37:50Z,CAW417,"-33.92868,18.688009",5869,235,169
1556800679,2019-05-02T12:37:59Z,CAW417,"-33.938137,18.691519",5698,245,163
1556800686,2019-05-02T12:38:06Z,CAW417,"-33.947342,18.695787",5542,255,159
1556800699,2019-05-02T12:38:19Z,CAW417,"-33.961479,18.702879",5368,261,158
1556800714,2019-05-02T12:38:34Z,CAW417,"-33.980732,18.712559",5085,272,156
1556800727,2019-05-02T12:38:47Z,CAW417,"-33.994648,18.719397",4950,270,157
1556800735,2019-05-02T12:38:55Z,CAW417,"-34.003944,18.723646",4950,270,158
1556800746,2019-05-02T12:39:06Z,CAW417,"-34.0173,18.729374",4915,266,159
1556800754,2019-05-02T12:39:14Z,CAW417,"-34.026276,18.732965",4757,263,159
1556800762,2019-05-02T12:39:22Z,CAW417,"-34.035282,18.736252",4484,257,161
1556800774,2019-05-02T12:39:34Z,CAW417,"-34.048504,18.740479",4097,252,164
1556800783,2019-05-02T12:39:43Z,CAW417,"-34.058182,18.743151",3975,251,166
1556800792,2019-05-02T12:39:52Z,CAW417,"-34.067238,18.745232",3949,254,168
1556800800,2019-05-02T12:40:00Z,CAW417,"-34.075459,18.74754",3975,248,166
1556800808,2019-05-02T12:40:08Z,CAW417,"-34.084503,18.750174",3959,244,166
1556800814,2019-05-02T12:40:14Z,CAW417,"-34.093468,18.752483",3949,246,166
1556800820,2019-05-02T12:40:20Z,CAW417,"-34.098869,18.753965",3882,246,166
1556800826,2019-05-02T12:40:26Z,CAW417,"-34.106979,18.756233",3767,247,166
1556800836,2019-05-02T12:40:36Z,CAW417,"-34.115791,18.758713",3674,248,166
1556800846,2019-05-02T12:40:46Z,CAW417,"-34.129265,18.762533",3595,244,166
1556800856,2019-05-02T12:40:56Z,CAW417,"-34.137753,18.76499",3547,242,166
1556800862,2019-05-02T12:41:02Z,CAW417,"-34.145767,18.766884",3500,237,167
1556800872,2019-05-02T12:41:12Z,CAW417,"-34.15517,18.768087",3392,234,171
1556800894,2019-05-02T12:41:34Z,CAW417,"-34.173931,18.762701",3236,224,191
1556800902,2019-05-02T12:41:42Z,CAW417,"-34.181656,18.755741",3135,224,191
1556800911,2019-05-02T12:41:51Z,CAW417,"-34.184265,18.748007",3081,210,230
1556800918,2019-05-02T12:41:58Z,CAW417,"-34.187172,18.739628",3016,198,244
1556800930,2019-05-02T12:42:10Z,CAW417,"-34.188904,18.730886",2950,198,250
1556800942,2019-05-02T12:42:22Z,CAW417,"-34.192795,18.714102",2950,206,259
1556800951,2019-05-02T12:42:31Z,CAW417,"-34.192966,18.705107",2974,211,266
1556800979,2019-05-02T12:42:59Z,CAW417,"-34.190083,18.678106",2975,195,281
1556800985,2019-05-02T12:43:05Z,CAW417,"-34.188038,18.671722",2975,181,289
1556800998,2019-05-02T12:43:18Z,CAW417,"-34.176346,18.660633",2950,191,321
1556801007,2019-05-02T12:43:27Z,CAW417,"-34.170094,18.656673",2975,194,330
1556801015,2019-05-02T12:43:35Z,CAW417,"-34.163448,18.653299",2992,192,336
1556801022,2019-05-02T12:43:42Z,CAW417,"-34.15638,18.650406",2976,195,340
1556801030,2019-05-02T12:43:50Z,CAW417,"-34.149601,18.648174",2949,193,343
1556801036,2019-05-02T12:43:56Z,CAW417,"-34.146233,18.647339",2950,193,343
1556801044,2019-05-02T12:44:04Z,CAW417,"-34.139629,18.646107",2950,191,349
1556801051,2019-05-02T12:44:11Z,CAW417,"-34.133236,18.644892",2925,182,349
1556801059,2019-05-02T12:44:19Z,CAW417,"-34.126831,18.643866",2862,177,353
1556801066,2019-05-02T12:44:26Z,CAW417,"-34.121365,18.643097",2761,170,352
1556801079,2019-05-02T12:44:39Z,CAW417,"-34.112846,18.641882",2585,159,353
1556801086,2019-05-02T12:44:46Z,CAW417,"-34.108131,18.641539",2488,151,356
1556801092,2019-05-02T12:44:52Z,CAW417,"-34.105511,18.641201",2431,151,356
1556801100,2019-05-02T12:45:00Z,CAW417,"-34.10043,18.640581",2337,146,355
1556801107,2019-05-02T12:45:07Z,CAW417,"-34.09586,18.639845",2275,139,353
1556801120,2019-05-02T12:45:20Z,CAW417,"-34.089153,18.638615",2175,129,351
1556801128,2019-05-02T12:45:28Z,CAW417,"-34.085072,18.637966",2129,125,352
1556801136,2019-05-02T12:45:36Z,CAW417,"-34.080643,18.637232",2045,123,352
1556801142,2019-05-02T12:45:42Z,CAW417,"-34.076172,18.636383",1961,121,352
1556801150,2019-05-02T12:45:50Z,CAW417,"-34.072384,18.635571",1875,120,350
1556801158,2019-05-02T12:45:58Z,CAW417,"-34.067455,18.634378",1775,120,349
1556801171,2019-05-02T12:46:11Z,CAW417,"-34.063656,18.633295",1675,116,347
1556801177,2019-05-02T12:46:17Z,CAW417,"-34.059574,18.632196",1600,117,347
1556801184,2019-05-02T12:46:24Z,CAW417,"-34.055428,18.630928",1550,114,346
1556801192,2019-05-02T12:46:32Z,CAW417,"-34.051323,18.629633",1450,112,346
1556801200,2019-05-02T12:46:40Z,CAW417,"-34.045822,18.627821",1334,111,345
1556801206,2019-05-02T12:46:46Z,CAW417,"-34.043938,18.627127",1300,110,344
1556801216,2019-05-02T12:46:56Z,CAW417,"-34.041988,18.626457",1264,110,344
1556801222,2019-05-02T12:47:02Z,CAW417,"-34.036125,18.62462",1150,110,344
1556801230,2019-05-02T12:47:10Z,CAW417,"-34.032524,18.62344",1090,106,345
1556801238,2019-05-02T12:47:18Z,CAW417,"-34.029068,18.622137",1022,103,345
1556801249,2019-05-02T12:47:29Z,CAW417,"-34.023312,18.620129",899,100,345
1556801263,2019-05-02T12:47:43Z,CAW417,"-34.017944,18.618402",785,100,345
1556801271,2019-05-02T12:47:51Z,CAW417,"-34.014141,18.617218",700,100,345
1556801282,2019-05-02T12:48:02Z,CAW417,"-34.008667,18.615501",581,104,345
1556801290,2019-05-02T12:48:10Z,CAW417,"-34.004711,18.614269",500,106,345
1556801303,2019-05-02T12:48:23Z,CAW417,"-33.998676,18.612423",367,107,345
1556801314,2019-05-02T12:48:34Z,CAW417,"-33.992607,18.610573",249,108,345
