Timestamp,UTC,Callsign,Position,Altitude,Speed,Direction
1556625291,2019-04-30T11:54:51Z,,"-26.075306,28.13517",10549,100,231
1556625302,2019-04-30T11:55:02Z,,"-26.085302,28.120819",10725,100,232
1556625314,2019-04-30T11:55:14Z,,"-26.097067,28.103569",10938,100,232
1556625326,2019-04-30T11:55:26Z,,"-26.108908,28.08585",11172,100,233
1556625340,2019-04-30T11:55:40Z,,"-26.12007,28.068924",11711,100,233
1556625359,2019-04-30T11:55:59Z,,"-26.135881,28.044876",12275,100,233
1556625391,2019-04-30T11:56:31Z,,"-26.173273,27.988707",13692,100,233
1556625422,2019-04-30T11:57:02Z,,"-26.207804,27.936972",15028,100,233
1556625454,2019-04-30T11:57:34Z,,"-26.242847,27.884598",16425,100,233
1556625486,2019-04-30T11:58:06Z,,"-26.277718,27.832884",17849,100,233
1556625518,2019-04-30T11:58:38Z,,"-26.314171,27.778763",19125,100,233
1556625592,2019-04-30T11:59:52Z,,"-26.391268,27.664076",21567,100,233
1556625654,2019-04-30T12:00:54Z,,"-26.476156,27.543631",23750,100,230
1556625723,2019-04-30T12:02:03Z,,"-26.570776,27.443529",25874,100,222
1556625784,2019-04-30T12:03:04Z,,"-26.66293,27.348885",27600,100,223
1556625847,2019-04-30T12:04:07Z,,"-26.765802,27.239708",29575,100,223
1556625906,2019-04-30T12:05:06Z,,"-26.856094,27.142843",31532,100,223
1556625970,2019-04-30T12:06:10Z,,"-26.95216,27.038671",32975,100,224
1556626043,2019-04-30T12:07:23Z,,"-27.040857,26.941786",34125,100,224
1556626114,2019-04-30T12:08:34Z,,"-27.151384,26.819094",36075,100,225
1556626188,2019-04-30T12:09:48Z,,"-27.253658,26.705334",38000,100,225
1556626252,2019-04-30T12:10:52Z,,"-27.352545,26.595762",38000,100,225
1556626312,2019-04-30T12:11:52Z,,"-27.426477,26.513571",38000,100,225
1556626375,2019-04-30T12:12:55Z,,"-27.521904,26.407522",38000,100,225
1556626438,2019-04-30T12:13:58Z,,"-27.603945,26.316038",38000,100,225
1556626502,2019-04-30T12:15:02Z,,"-27.705566,26.201904",38000,100,225
1556626568,2019-04-30T12:16:08Z,,"-27.78359,26.114202",38000,100,225
1556626612,2019-04-30T12:16:52Z,,"-27.849016,26.040573",38000,100,225
1556626700,2019-04-30T12:18:20Z,,"-27.976009,25.897472",38000,100,225
1556626758,2019-04-30T12:19:18Z,,"-28.057884,25.80492",38000,100,225
1556626823,2019-04-30T12:20:23Z,,"-28.147615,25.70339",38000,100,225
1556626886,2019-04-30T12:21:26Z,,"-28.234848,25.604254",38000,100,225
1556626900,2019-04-30T12:21:40Z,,"-28.251816,25.5849",38000,100,225
1556626991,2019-04-30T12:23:11Z,,"-28.376076,25.443249",38000,100,225
1556627054,2019-04-30T12:24:14Z,,"-28.472193,25.333368",38000,100,225
1556627083,2019-04-30T12:24:43Z,,"-28.512096,25.287548",37975,100,225
1556627136,2019-04-30T12:25:36Z,,"-28.518034,25.280754",37975,100,225
1556628123,2019-04-30T12:42:03Z,,"-29.912624,23.645435",37975,100,226
1556628192,2019-04-30T12:43:12Z,,"-30.009178,23.529696",37992,100,226
1556628255,2019-04-30T12:44:15Z,,"-30.102633,23.417522",37975,100,226
1556628315,2019-04-30T12:45:15Z,,"-30.200663,23.299154",37975,100,226
1556628378,2019-04-30T12:46:18Z,,"-30.289602,23.191444",37975,100,226
1556628444,2019-04-30T12:47:24Z,,"-30.377384,23.084797",37975,100,226
1556628481,2019-04-30T12:48:01Z,,"-30.42301,23.029402",37975,100,226
1556628564,2019-04-30T12:49:24Z,,"-30.531675,22.896431",37975,100,226
1556628610,2019-04-30T12:50:10Z,,"-30.608627,22.802124",37975,100,226
1556628706,2019-04-30T12:51:46Z,,"-30.719774,22.665951",37974,100,226
1556628738,2019-04-30T12:52:18Z,,"-30.77014,22.604687",37975,100,226
1556628796,2019-04-30T12:53:16Z,,"-30.863077,22.489998",37975,100,226
1556628919,2019-04-30T12:55:19Z,,"-30.869135,22.482401",37975,100,226
1556629554,2019-04-30T13:05:54Z,,"-31.907915,21.172754",37975,100,227
1556629615,2019-04-30T13:06:55Z,,"-31.991133,21.065956",37975,100,227
1556629678,2019-04-30T13:07:58Z,,"-32.072495,20.962299",37975,100,227
1556629695,2019-04-30T13:08:15Z,,"-32.100967,20.926239",37975,100,229
1556629780,2019-04-30T13:09:40Z,,"-32.21323,20.779173",37975,100,228
1556629846,2019-04-30T13:10:46Z,,"-32.305004,20.659906",37975,100,228
1556629914,2019-04-30T13:11:54Z,,"-32.396194,20.540113",37975,100,228
1556629976,2019-04-30T13:12:56Z,,"-32.478619,20.432035",37975,100,228
1556630038,2019-04-30T13:13:58Z,,"-32.566002,20.317772",37975,100,228
1556630098,2019-04-30T13:14:58Z,,"-32.641949,20.220444",37975,100,228
1556630160,2019-04-30T13:16:00Z,,"-32.727467,20.105883",37975,100,229
1556630223,2019-04-30T13:17:03Z,,"-32.813953,19.990774",36855,100,228
1556630283,2019-04-30T13:18:03Z,,"-32.937325,19.824066",34537,100,226
1556630351,2019-04-30T13:19:11Z,,"-32.982452,19.766418",31231,100,229
1556630414,2019-04-30T13:20:14Z,,"-33.066189,19.653986",27249,100,228
1556630474,2019-04-30T13:21:14Z,,"-33.148441,19.543797",25083,100,228
1556630536,2019-04-30T13:22:16Z,,"-33.223827,19.442423",22785,100,228
1556630599,2019-04-30T13:23:19Z,,"-33.300644,19.340075",19486,100,228
1556630663,2019-04-30T13:24:23Z,,"-33.376713,19.237686",17275,100,228
1556630696,2019-04-30T13:24:56Z,,"-33.411343,19.189939",16056,100,229
1556630726,2019-04-30T13:25:26Z,,"-33.448174,19.145718",14669,100,223
1556630762,2019-04-30T13:26:02Z,,"-33.493679,19.099476",13204,100,220
1556630796,2019-04-30T13:26:36Z,,"-33.53389,19.059546",11963,100,220
1556630808,2019-04-30T13:26:48Z,,"-33.549068,19.04455",11446,100,220
1556630822,2019-04-30T13:27:02Z,,"-33.568745,19.025101",10900,100,220
1556630836,2019-04-30T13:27:16Z,,"-33.583538,19.010117",10700,100,220
1556630852,2019-04-30T13:27:32Z,,"-33.602661,18.990709",10525,100,220
1556630866,2019-04-30T13:27:46Z,,"-33.620552,18.97238",10361,100,220
1556630878,2019-04-30T13:27:58Z,,"-33.633514,18.958923",10225,100,220
1556630892,2019-04-30T13:28:12Z,,"-33.646175,18.94578",10017,100,220
1556630906,2019-04-30T13:28:26Z,,"-33.662464,18.928738",9680,100,221
1556630918,2019-04-30T13:28:38Z,,"-33.674007,18.916592",9494,100,221
1556630930,2019-04-30T13:28:50Z,,"-33.685585,18.904272",9239,100,221
1556630942,2019-04-30T13:29:02Z,,"-33.696987,18.892155",8964,100,221
1556630959,2019-04-30T13:29:19Z,,"-33.712246,18.876169",8579,100,221
1556630966,2019-04-30T13:29:26Z,,"-33.719681,18.868433",8387,100,221
1556630979,2019-04-30T13:29:39Z,,"-33.731087,18.856462",8070,100,221
1556630990,2019-04-30T13:29:50Z,,"-33.742008,18.84503",7745,100,221
1556631002,2019-04-30T13:30:02Z,,"-33.752556,18.833956",7468,100,221
1556631012,2019-04-30T13:30:12Z,,"-33.760273,18.825855",7263,100,221
1556631022,2019-04-30T13:30:22Z,,"-33.771336,18.814278",6940,100,221
1556631034,2019-04-30T13:30:34Z,,"-33.782433,18.80267",6707,100,221
1556631046,2019-04-30T13:30:46Z,,"-33.793854,18.790735",6600,100,221
1556631058,2019-04-30T13:30:58Z,,"-33.804649,18.77939",6502,100,221
1556631072,2019-04-30T13:31:12Z,,"-33.815285,18.768145",6318,100,221
1556631087,2019-04-30T13:31:27Z,,"-33.828629,18.75392",6018,100,221
1556631094,2019-04-30T13:31:34Z,,"-33.835732,18.746897",5890,100,220
1556631108,2019-04-30T13:31:48Z,,"-33.847019,18.738321",5588,100,216
1556631115,2019-04-30T13:31:55Z,,"-33.855198,18.73468",5427,100,208
1556631122,2019-04-30T13:32:02Z,,"-33.863663,18.732643",5263,100,199
1556631130,2019-04-30T13:32:10Z,,"-33.873066,18.731565",5082,100,191
1556631143,2019-04-30T13:32:23Z,,"-33.88232,18.731661",4936,100,183
1556631152,2019-04-30T13:32:32Z,,"-33.896412,18.73317",4690,100,175
1556631158,2019-04-30T13:32:38Z,,"-33.906582,18.734554",4483,100,173
1556631170,2019-04-30T13:32:50Z,,"-33.921055,18.737347",4217,100,171
1556631178,2019-04-30T13:32:58Z,,"-33.930901,18.739235",4060,100,170
1556631191,2019-04-30T13:33:11Z,,"-33.945351,18.742039",3865,100,170
1556631199,2019-04-30T13:33:19Z,,"-33.955402,18.743782",3754,100,170
1556631211,2019-04-30T13:33:31Z,,"-33.969784,18.746162",3675,100,171
1556631225,2019-04-30T13:33:45Z,,"-33.983826,18.748201",3532,100,172
1556631234,2019-04-30T13:33:54Z,,"-33.997456,18.749844",3390,100,173
1556631242,2019-04-30T13:34:02Z,,"-34.006317,18.750769",3279,100,173
1556631248,2019-04-30T13:34:08Z,,"-34.010864,18.751207",3215,100,174
1556631255,2019-04-30T13:34:15Z,,"-34.019032,18.751925",3117,100,174
1556631264,2019-04-30T13:34:24Z,,"-34.028065,18.752632",2955,100,175
1556631275,2019-04-30T13:34:35Z,,"-34.040405,18.753412",2900,100,175
1556631302,2019-04-30T13:35:02Z,,"-34.068142,18.748119",2875,100,197
1556631311,2019-04-30T13:35:11Z,,"-34.076241,18.743073",2850,100,205
1556631323,2019-04-30T13:35:23Z,,"-34.084587,18.733585",2704,100,220
1556631336,2019-04-30T13:35:36Z,,"-34.09145,18.721655",2650,100,232
1556631345,2019-04-30T13:35:45Z,,"-34.093452,18.713493",2668,100,248
1556631351,2019-04-30T13:35:51Z,,"-34.095898,18.703825",2628,100,252
1556631357,2019-04-30T13:35:57Z,,"-34.09716,18.694242",2511,100,258
1556631378,2019-04-30T13:36:18Z,,"-34.095966,18.668501",2200,100,272
1556631386,2019-04-30T13:36:26Z,,"-34.093987,18.659748",2102,100,278
1556631393,2019-04-30T13:36:33Z,,"-34.092632,18.656116",2075,100,284
1556631402,2019-04-30T13:36:42Z,,"-34.087639,18.64274",1870,100,289
1556631411,2019-04-30T13:36:51Z,,"-34.083328,18.635496",1700,100,298
1556631419,2019-04-30T13:36:59Z,,"-34.078026,18.628248",1532,100,306
1556631428,2019-04-30T13:37:08Z,,"-34.075237,18.625711",1475,100,318
1556631435,2019-04-30T13:37:15Z,,"-34.067635,18.619274",1300,100,315
1556631443,2019-04-30T13:37:23Z,,"-34.06004,18.61585",1175,100,336
1556631483,2019-04-30T13:38:03Z,,"-34.04987,18.610579",1050,100,346
1556631496,2019-04-30T13:38:16Z,,"-34.031742,18.600357",725,700,346
