Timestamp,UTC,Callsign,Position,Altitude,Speed,Direction
1549265327,2019-02-04T07:28:47Z,,"-34.020035,18.61388",1825,100,177
1549265360,2019-02-04T07:29:20Z,,"-34.062859,18.599705",2974,100,210
1549265366,2019-02-04T07:29:26Z,,"-34.070198,18.593847",3275,100,210
1549265375,2019-02-04T07:29:35Z,,"-34.076591,18.587234",3621,100,218
1549265394,2019-02-04T07:29:54Z,,"-34.094677,18.562037",4925,100,225
1549265417,2019-02-04T07:30:17Z,,"-34.098236,18.541492",5500,100,251
1549265426,2019-02-04T07:30:26Z,,"-34.102001,18.526619",5957,100,251
1549265446,2019-02-04T07:30:46Z,,"-34.095234,18.499916",6750,100,287
1549265458,2019-02-04T07:30:58Z,,"-34.07737,18.482458",7415,100,287
1549265476,2019-02-04T07:31:16Z,,"-34.050552,18.473598",8246,100,334
1549265482,2019-02-04T07:31:22Z,,"-34.03252,18.471136",8815,100,343
1549265491,2019-02-04T07:31:31Z,,"-34.017307,18.470881",9275,100,86
1549265498,2019-02-04T07:31:38Z,,"-34.009945,18.471653",9453,100,23
1549265511,2019-02-04T07:31:51Z,,"-33.99081,18.473389",9987,100,274
1549265531,2019-02-04T07:32:11Z,,"-33.949451,18.484409",10618,100,33
1549265543,2019-02-04T07:32:23Z,,"-33.927746,18.494396",10825,100,23
1549265558,2019-02-04T07:32:38Z,,"-33.906151,18.502138",11125,100,16
1549265568,2019-02-04T07:32:48Z,,"-33.885685,18.510841",11675,100,16
1549265582,2019-02-04T07:33:02Z,,"-33.857521,18.523001",12388,100,17
1549265619,2019-02-04T07:33:39Z,,"-33.793488,18.54641",13901,100,20
1549265654,2019-02-04T07:34:14Z,,"-33.731342,18.57506",15269,100,27
1549265682,2019-02-04T07:34:42Z,,"-33.682529,18.588978",16520,100,13
1549265688,2019-02-04T07:34:48Z,,"-33.675419,18.590885",16684,100,13
1549265720,2019-02-04T07:35:20Z,,"-33.619263,18.609556",17931,100,13
1549265752,2019-02-04T07:35:52Z,,"-33.56015,18.625824",19260,100,12
1549265814,2019-02-04T07:36:54Z,,"-33.437466,18.663603",21010,100,14
1549265882,2019-02-04T07:38:02Z,,"-33.299206,18.70682",23519,100,14
1549265943,2019-02-04T07:39:03Z,,"-33.176014,18.745308",25436,100,14
1549265982,2019-02-04T07:39:42Z,,"-33.099342,18.791752",26544,100,35
1549265988,2019-02-04T07:39:48Z,,"-33.093388,18.798697",26605,100,35
1549265994,2019-02-04T07:39:54Z,,"-33.081573,18.813293",26867,100,41
1549266000,2019-02-04T07:40:00Z,,"-33.075283,18.821438",26954,100,47
1549266010,2019-02-04T07:40:10Z,,"-33.057243,18.846668",27300,100,48
1549266019,2019-02-04T07:40:19Z,,"-33.048576,18.862442",27501,100,52
1549266086,2019-02-04T07:41:26Z,,"-32.954639,19.0109",29424,100,53
1549266150,2019-02-04T07:42:30Z,,"-32.863358,19.143097",31174,100,50
1549266214,2019-02-04T07:43:34Z,,"-32.769501,19.2735",33211,100,48
1549266284,2019-02-04T07:44:44Z,,"-32.675865,19.401194",34751,100,48
1549266303,2019-02-04T07:45:03Z,,"-32.646313,19.441048",35100,100,47
1549266387,2019-02-04T07:46:27Z,,"-32.541786,19.584654",36325,100,49
1549266452,2019-02-04T07:47:32Z,,"-32.447071,19.713583",37000,100,49
1549266515,2019-02-04T07:48:35Z,,"-32.353809,19.838654",37000,100,49
1549266590,2019-02-04T07:49:50Z,,"-32.225563,20.003916",37000,100,46
1549266668,2019-02-04T07:51:08Z,,"-32.111217,20.157063",36975,100,46
1549266698,2019-02-04T07:51:38Z,,"-32.051182,20.236599",37000,100,46
1549267608,2019-02-04T08:06:48Z,,"-30.725754,21.97567",37000,100,47
1549267707,2019-02-04T08:08:27Z,,"-30.538694,22.213886",36975,100,47
1549267796,2019-02-04T08:09:56Z,,"-30.515366,22.243752",37000,100,47
1549268058,2019-02-04T08:14:18Z,,"-30.294954,22.522661",37000,100,47
1549268623,2019-02-04T08:23:43Z,,"-29.148275,23.935232",37000,100,41
1549268670,2019-02-04T08:24:30Z,,"-29.0875,24.010832",36975,100,41
1549268726,2019-02-04T08:25:26Z,,"-28.957586,24.150419",37000,100,34
1549268776,2019-02-04T08:26:16Z,,"-28.905727,24.207361",37000,100,43
1549268816,2019-02-04T08:26:56Z,,"-28.829477,24.308311",37000,100,55
1549268824,2019-02-04T08:27:04Z,,"-28.82585,24.31525",36975,100,55
1549268862,2019-02-04T08:27:42Z,,"-28.768545,24.39469",37000,100,51
1549269375,2019-02-04T08:36:15Z,,"-28.032499,25.270927",36975,100,46
1549269394,2019-02-04T08:36:34Z,,"-27.989635,25.321337",36975,100,46
1549269459,2019-02-04T08:37:39Z,,"-27.883984,25.450886",37000,100,47
1549269544,2019-02-04T08:39:04Z,,"-27.76215,25.603468",37000,100,47
1549269570,2019-02-04T08:39:30Z,,"-27.714169,25.66316",37000,100,47
1549269616,2019-02-04T08:40:16Z,,"-27.649084,25.743523",37000,100,47
1549269702,2019-02-04T08:41:42Z,,"-27.522141,25.899441",37000,100,47
1549269767,2019-02-04T08:42:47Z,,"-27.43305,26.008944",37000,100,47
1549269832,2019-02-04T08:43:52Z,,"-27.335159,26.128157",36975,100,47
1549269900,2019-02-04T08:45:00Z,,"-27.236273,26.248486",36974,100,47
1549269968,2019-02-04T08:46:08Z,,"-27.155962,26.345863",35000,100,47
1549270034,2019-02-04T08:47:14Z,,"-27.042849,26.483263",31875,100,47
1549270096,2019-02-04T08:48:16Z,,"-26.966621,26.575527",29775,100,46
1549270158,2019-02-04T08:49:18Z,,"-26.877792,26.681894",27550,100,46
1549270226,2019-02-04T08:50:26Z,,"-26.805468,26.767982",25716,100,46
1549270288,2019-02-04T08:51:28Z,,"-26.715948,26.876204",23508,100,46
1549270350,2019-02-04T08:52:30Z,,"-26.637888,26.969727",21600,100,46
1549270412,2019-02-04T08:53:32Z,,"-26.566341,27.055479",20507,100,46
1549270476,2019-02-04T08:54:36Z,,"-26.495178,27.140924",19650,100,46
1549270538,2019-02-04T08:55:38Z,,"-26.437498,27.235878",17075,100,58
1549270570,2019-02-04T08:56:10Z,,"-26.409094,27.288",16086,100,58
1549270604,2019-02-04T08:56:44Z,,"-26.380688,27.339811",14850,100,58
1549270637,2019-02-04T08:57:17Z,,"-26.352156,27.390448",13619,100,57
1549270667,2019-02-04T08:57:47Z,,"-26.324091,27.439077",12356,100,57
1549270695,2019-02-04T08:58:15Z,,"-26.299095,27.481985",11550,100,56
1549270738,2019-02-04T08:58:58Z,,"-26.271017,27.528454",10900,100,56
1549270760,2019-02-04T08:59:20Z,,"-26.245426,27.5613",10200,100,49
1549270770,2019-02-04T08:59:30Z,,"-26.237446,27.571375",10075,100,49
1549270782,2019-02-04T08:59:42Z,,"-26.218258,27.594164",9925,100,43
1549270798,2019-02-04T08:59:58Z,,"-26.205742,27.6085",9664,100,44
1549270814,2019-02-04T09:00:14Z,,"-26.187057,27.630293",9242,100,44
1549270830,2019-02-04T09:00:30Z,,"-26.176107,27.642679",9050,100,44
1549270842,2019-02-04T09:00:42Z,,"-26.161249,27.659771",8876,100,45
1549270854,2019-02-04T09:00:54Z,,"-26.154331,27.667458",8771,100,44
1549270870,2019-02-04T09:01:10Z,,"-26.137007,27.687231",8386,100,45
1549270884,2019-02-04T09:01:24Z,,"-26.12768,27.697893",8150,100,46
1549270890,2019-02-04T09:01:30Z,,"-26.123226,27.703104",8050,100,46
