Timestamp,UTC,Callsign,Position,Altitude,Speed,Direction
1549296144,2019-02-04T16:02:24Z,,"-34.028343,18.62051",1974,100,165
1549296151,2019-02-04T16:02:31Z,,"-34.043758,18.626085",2350,100,165
1549296158,2019-02-04T16:02:38Z,,"-34.052235,18.629068",2644,100,163
1549296164,2019-02-04T16:02:44Z,,"-34.057751,18.630919",2891,100,163
1549296170,2019-02-04T16:02:50Z,,"-34.066933,18.633583",3383,100,165
1549296180,2019-02-04T16:03:00Z,,"-34.075653,18.635126",3762,100,169
1549296187,2019-02-04T16:03:07Z,,"-34.085114,18.635256",4225,100,176
1549296215,2019-02-04T16:03:35Z,,"-34.108002,18.628633",5375,100,195
1549296228,2019-02-04T16:03:48Z,,"-34.120541,18.602467",6432,100,243
1549296254,2019-02-04T16:04:14Z,,"-34.114731,18.559826",8100,100,289
1549296262,2019-02-04T16:04:22Z,,"-34.107967,18.542545",8866,100,286
1549296272,2019-02-04T16:04:32Z,,"-34.102867,18.53706",9048,100,306
1549296279,2019-02-04T16:04:39Z,,"-34.089157,18.521387",9625,100,307
1549296292,2019-02-04T16:04:52Z,,"-34.082294,18.516867",9721,100,324
1549296298,2019-02-04T16:04:58Z,,"-34.059978,18.498724",10200,100,324
1549296304,2019-02-04T16:05:04Z,,"-34.051823,18.495604",10321,100,337
1549296310,2019-02-04T16:05:10Z,,"-34.042839,18.490753",10578,100,337
1549296316,2019-02-04T16:05:16Z,,"-34.03159,18.483747",10950,100,337
1549296324,2019-02-04T16:05:24Z,,"-34.013687,18.475332",11402,100,338
1549296344,2019-02-04T16:05:44Z,,"-33.977612,18.456331",12272,100,336
1549296374,2019-02-04T16:06:14Z,,"-33.919289,18.430624",13678,100,339
1549296411,2019-02-04T16:06:51Z,,"-33.858582,18.39963",15185,100,338
1549296454,2019-02-04T16:07:34Z,,"-33.782307,18.396135",16642,100,37
1549296479,2019-02-04T16:07:59Z,,"-33.746727,18.422775",17476,100,42
1549296486,2019-02-04T16:08:06Z,,"-33.734131,18.438423",17782,100,44
1549296495,2019-02-04T16:08:15Z,,"-33.728542,18.446375",17964,100,44
1549296526,2019-02-04T16:08:46Z,,"-33.675827,18.506817",19289,100,41
1549296550,2019-02-04T16:09:10Z,,"-33.646709,18.556297",20212,100,53
1549296616,2019-02-04T16:10:16Z,,"-33.568207,18.678835",22228,100,50
1549296679,2019-02-04T16:11:19Z,,"-33.480927,18.794472",23975,100,47
1549296744,2019-02-04T16:12:24Z,,"-33.386631,18.914986",26125,100,44
1549296806,2019-02-04T16:13:26Z,,"-33.295547,19.033346",27963,100,49
1549296872,2019-02-04T16:14:32Z,,"-33.197128,19.156904",29270,100,46
1549296938,2019-02-04T16:15:38Z,,"-33.093727,19.290926",30974,100,46
1549296950,2019-02-04T16:15:50Z,,"-33.074959,19.315723",31302,100,46
1549297040,2019-02-04T16:17:20Z,,"-32.942806,19.485565",34050,100,46
1549297102,2019-02-04T16:18:22Z,,"-32.847771,19.610035",35500,100,46
1549297167,2019-02-04T16:19:27Z,,"-32.755253,19.728909",36675,100,45
1549297232,2019-02-04T16:20:32Z,,"-32.653152,19.854431",37000,100,46
1549297292,2019-02-04T16:21:32Z,,"-32.565002,19.964628",37000,100,46
1549297324,2019-02-04T16:22:04Z,,"-32.525291,20.014729",37000,100,46
1549297372,2019-02-04T16:22:52Z,,"-32.443962,20.11507",37000,100,43
1549297416,2019-02-04T16:23:36Z,,"-32.431328,20.131159",37000,100,61
1549297466,2019-02-04T16:24:26Z,,"-32.365334,20.212574",37000,100,42
1549297499,2019-02-04T16:24:59Z,,"-32.287342,20.310076",37000,100,47
1549297587,2019-02-04T16:26:27Z,,"-32.201797,20.415977",37000,100,46
1549297924,2019-02-04T16:32:04Z,,"-31.646408,21.084288",37000,100,45
1549299140,2019-02-04T16:52:20Z,,"-29.824589,23.261583",37000,100,44
1549299206,2019-02-04T16:53:26Z,,"-29.679884,23.427488",37000,100,44
1549299240,2019-02-04T16:54:00Z,,"-29.632458,23.481785",37000,100,44
1549299270,2019-02-04T16:54:30Z,,"-29.575792,23.546675",37000,100,44
1549299582,2019-02-04T16:59:42Z,,"-29.046339,24.131996",37000,100,44
1549299672,2019-02-04T17:01:12Z,,"-28.93082,24.267504",37000,100,39
1549299732,2019-02-04T17:02:12Z,,"-28.841949,24.373199",37000,100,47
1549299767,2019-02-04T17:02:47Z,,"-28.778021,24.448418",37000,100,44
1549299812,2019-02-04T17:03:32Z,,"-28.763933,24.464664",37000,100,49
1549300255,2019-02-04T17:10:55Z,,"-28.033634,25.272001",37000,100,43
1549300278,2019-02-04T17:11:18Z,,"-28.001898,25.306721",37000,100,43
1549300335,2019-02-04T17:12:15Z,,"-27.984892,25.325972",37000,100,43
1549300431,2019-02-04T17:13:51Z,,"-27.78677,25.572206",37000,100,47
1549300492,2019-02-04T17:14:52Z,,"-27.691898,25.691338",37000,100,47
1549300560,2019-02-04T17:16:00Z,,"-27.599356,25.805189",37000,100,46
1549300630,2019-02-04T17:17:10Z,,"-27.504665,25.921209",37000,100,46
1549300694,2019-02-04T17:18:14Z,,"-27.402531,26.046671",37000,100,46
1549300765,2019-02-04T17:19:25Z,,"-27.312214,26.156553",37000,100,46
1549300830,2019-02-04T17:20:30Z,,"-27.215549,26.274033",37000,100,46
1549300838,2019-02-04T17:20:38Z,,"-27.198673,26.294645",37000,100,46
1549300927,2019-02-04T17:22:07Z,,"-27.074011,26.445702",37000,100,46
1549300991,2019-02-04T17:23:11Z,,"-26.982653,26.555603",35274,100,46
1549301051,2019-02-04T17:24:11Z,,"-26.896269,26.659372",31898,100,46
1549301114,2019-02-04T17:25:14Z,,"-26.809402,26.764488",29471,100,46
1549301178,2019-02-04T17:26:18Z,,"-26.712996,26.879282",26600,100,46
1549301248,2019-02-04T17:27:28Z,,"-26.621487,26.98967",23951,100,46
1549301311,2019-02-04T17:28:31Z,,"-26.537294,27.090338",21794,100,46
1549301370,2019-02-04T17:29:30Z,,"-26.467169,27.184116",18675,100,53
1549301434,2019-02-04T17:30:34Z,,"-26.401512,27.30027",14900,100,57
1549301467,2019-02-04T17:31:07Z,,"-26.392906,27.316591",14675,100,58
1549301502,2019-02-04T17:31:42Z,,"-26.353306,27.38586",13375,100,58
1549301539,2019-02-04T17:32:19Z,,"-26.303278,27.47348",12275,100,58
1549301571,2019-02-04T17:32:51Z,,"-26.271538,27.52734",11518,100,56
1549301619,2019-02-04T17:33:39Z,,"-26.263374,27.538893",11325,100,52
1549301646,2019-02-04T17:34:06Z,,"-26.197172,27.622736",10056,100,52
1549301659,2019-02-04T17:34:19Z,,"-26.190363,27.629789",10025,100,44
1549301674,2019-02-04T17:34:34Z,,"-26.181822,27.640516",9950,100,47
1549301686,2019-02-04T17:34:46Z,,"-26.160652,27.665365",9775,100,43
1549301698,2019-02-04T17:34:58Z,,"-26.150312,27.676256",9700,100,42
1549301712,2019-02-04T17:35:12Z,,"-26.140081,27.687328",9654,100,43
1549301726,2019-02-04T17:35:26Z,,"-26.127119,27.701723",9475,100,44
1549301732,2019-02-04T17:35:32Z,,"-26.124397,27.704763",9425,100,44
1549301772,2019-02-04T17:36:12Z,,"-26.114412,27.716375",9075,100,146
