Timestamp,UTC,Callsign,Position,Altitude,Speed,Direction
1556787231,2019-05-02T08:53:51Z,,"-26.027937,28.262735",8436,236,3
1556787243,2019-05-02T08:54:03Z,,"-26.009132,28.247902",8950,245,236
1556787266,2019-05-02T08:54:26Z,,"-25.997982,28.224909",9600,245,236
1556787290,2019-05-02T08:54:50Z,,"-25.998222,28.193359",10537,273,259
1556787303,2019-05-02T08:55:03Z,,"-25.99889,28.183458",10725,259,264
1556787323,2019-05-02T08:55:23Z,,"-26.001509,28.16942",10950,259,264
1556787336,2019-05-02T08:55:36Z,,"-26.022831,28.130358",12053,331,234
1556787344,2019-05-02T08:55:44Z,,"-26.040209,28.116177",12497,438,221
1556787354,2019-05-02T08:55:54Z,,"-26.046818,28.109766",12725,438,221
1556787362,2019-05-02T08:56:02Z,,"-26.064095,28.087303",13508,438,221
1556787368,2019-05-02T08:56:08Z,,"-26.070253,28.081406",13675,450,221
1556787402,2019-05-02T08:56:42Z,,"-26.118792,28.026331",15345,414,226
1556787434,2019-05-02T08:57:14Z,,"-26.159252,27.976858",16992,401,228
1556787468,2019-05-02T08:57:48Z,,"-26.197287,27.927935",18573,394,229
1556787530,2019-05-02T08:58:50Z,,"-26.269354,27.829239",21350,386,231
1556787595,2019-05-02T08:59:55Z,,"-26.343269,27.726032",24000,399,231
1556787658,2019-05-02T09:00:58Z,,"-26.417458,27.622417",26573,408,231
1556787730,2019-05-02T09:02:10Z,,"-26.491478,27.524883",28274,421,226
1556787798,2019-05-02T09:03:18Z,,"-26.601236,27.409531",31200,432,223
1556787858,2019-05-02T09:04:18Z,,"-26.692823,27.315557",33400,431,222
1556787896,2019-05-02T09:04:56Z,,"-26.74473,27.261269",34375,422,222
1556787954,2019-05-02T09:05:54Z,,"-26.825966,27.175098",35775,422,222
1556788040,2019-05-02T09:07:20Z,,"-26.939669,27.052444",36000,399,224
1556788082,2019-05-02T09:08:02Z,,"-26.99172,26.995829",36000,399,224
1556788170,2019-05-02T09:09:30Z,,"-27.092672,26.884649",36000,399,225
1556788230,2019-05-02T09:10:30Z,,"-27.194374,26.771729",36000,406,225
1556788295,2019-05-02T09:11:35Z,,"-27.270929,26.686617",36000,399,225
1556788383,2019-05-02T09:13:03Z,,"-27.391045,26.553162",36000,399,225
1556788414,2019-05-02T09:13:34Z,,"-27.427708,26.51239",36000,399,225
1556788506,2019-05-02T09:15:06Z,,"-27.539272,26.388023",36000,399,225
1556788551,2019-05-02T09:15:51Z,,"-27.607319,26.31193",36025,399,225
1556788632,2019-05-02T09:17:12Z,,"-27.715977,26.190054",35999,399,225
1556788694,2019-05-02T09:18:14Z,,"-27.795483,26.100872",36000,399,225
1556788780,2019-05-02T09:19:40Z,,"-27.910131,25.971876",36000,398,225
1556788799,2019-05-02T09:19:59Z,,"-27.915382,25.965944",36000,398,225
1556788834,2019-05-02T09:20:34Z,,"-27.940056,25.938162",36025,398,225
1556788896,2019-05-02T09:21:36Z,,"-28.05938,25.802872",36025,394,225
1556788984,2019-05-02T09:23:04Z,,"-28.147871,25.702675",36025,394,225
1556789010,2019-05-02T09:23:30Z,,"-28.210133,25.631765",36025,394,225
1556789064,2019-05-02T09:24:24Z,,"-28.21442,25.626253",36025,394,225
1556789095,2019-05-02T09:24:55Z,,"-28.283274,25.548067",36025,394,225
1556789130,2019-05-02T09:25:30Z,,"-28.329248,25.495745",36025,394,225
1556789214,2019-05-02T09:26:54Z,,"-28.474043,25.329762",36000,394,225
1556789294,2019-05-02T09:28:14Z,,"-28.479145,25.323929",36000,392,225
1556790619,2019-05-02T09:50:19Z,,"-30.258707,23.228296",36025,392,227
1556791876,2019-05-02T10:11:16Z,,"-31.810228,21.298416",36000,392,228
1556791940,2019-05-02T10:12:20Z,,"-31.819565,21.286327",36000,380,228
1556792108,2019-05-02T10:15:08Z,,"-31.891874,21.193983",36025,380,228
1556792236,2019-05-02T10:17:16Z,,"-32.150848,20.859707",36000,380,227
1556792307,2019-05-02T10:18:27Z,,"-32.29356,20.675472",36000,380,227
1556792376,2019-05-02T10:19:36Z,,"-32.397625,20.540182",36025,380,227
1556792446,2019-05-02T10:20:46Z,,"-32.472462,20.441767",36025,380,228
1556792515,2019-05-02T10:21:55Z,,"-32.495289,20.411932",36000,380,228
1556792559,2019-05-02T10:22:39Z,,"-32.586994,20.291765",36025,376,228
1556792654,2019-05-02T10:24:14Z,,"-32.707809,20.132843",36000,371,228
1556792704,2019-05-02T10:25:04Z,,"-32.769753,20.051098",36000,371,228
1556792775,2019-05-02T10:26:15Z,,"-32.872646,19.915972",36025,410,227
1556792864,2019-05-02T10:27:44Z,,"-32.978706,19.772942",36000,356,51
1556792920,2019-05-02T10:28:40Z,,"-33.017262,19.721357",34175,381,182
1556792943,2019-05-02T10:29:03Z,,"-33.050983,19.678833",32650,388,215
1556792952,2019-05-02T10:29:12Z,,"-33.061699,19.666092",32649,392,222
1556792960,2019-05-02T10:29:20Z,,"-33.065163,19.661779",32249,392,222
1556792968,2019-05-02T10:29:28Z,,"-33.075169,19.649338",32224,392,222
1556792974,2019-05-02T10:29:34Z,,"-33.083321,19.639229",32225,379,225
1556793038,2019-05-02T10:30:38Z,,"-33.166965,19.53994",29175,372,225
1556793102,2019-05-02T10:31:42Z,,"-33.238853,19.453409",26975,330,224
1556793167,2019-05-02T10:32:47Z,,"-33.302593,19.365946",24561,320,231
1556793228,2019-05-02T10:33:48Z,,"-33.351837,19.284525",22417,312,233
1556793291,2019-05-02T10:34:51Z,,"-33.408421,19.194569",20028,311,233
1556793350,2019-05-02T10:35:50Z,,"-33.470974,19.120573",17804,312,222
1556793383,2019-05-02T10:36:23Z,,"-33.507683,19.085354",16651,318,219
1556793420,2019-05-02T10:37:00Z,,"-33.549061,19.045046",15475,314,219
1556793452,2019-05-02T10:37:32Z,,"-33.58456,19.009617",14276,310,220
1556793483,2019-05-02T10:38:03Z,,"-33.617786,18.975193",13356,296,220
1556793516,2019-05-02T10:38:36Z,,"-33.649097,18.942116",12318,281,222
1556793547,2019-05-02T10:39:07Z,,"-33.680195,18.909447",11167,276,221
1556793556,2019-05-02T10:39:16Z,,"-33.687588,18.901722",10892,273,221
1556793571,2019-05-02T10:39:31Z,,"-33.70277,18.885525",10325,266,221
1556793582,2019-05-02T10:39:42Z,,"-33.713871,18.87413",9956,271,221
1556793599,2019-05-02T10:39:59Z,,"-33.729328,18.85833",9425,276,220
1556793616,2019-05-02T10:40:16Z,,"-33.74511,18.841951",8959,278,220
1556793627,2019-05-02T10:40:27Z,,"-33.756859,18.829815",8539,274,221
1556793640,2019-05-02T10:40:40Z,,"-33.768291,18.817913",8174,272,221
1556793654,2019-05-02T10:40:54Z,,"-33.783169,18.802273",7954,270,221
1556793666,2019-05-02T10:41:06Z,,"-33.793884,18.791037",7850,263,221
1556793682,2019-05-02T10:41:22Z,,"-33.808979,18.775459",7675,256,221
1556793698,2019-05-02T10:41:38Z,,"-33.821602,18.762062",7423,241,221
1556793711,2019-05-02T10:41:51Z,,"-33.830635,18.752502",7256,236,221
1556793728,2019-05-02T10:42:08Z,,"-33.842869,18.739729",7031,225,220
1556793742,2019-05-02T10:42:22Z,,"-33.854057,18.727993",6694,215,221
1556793754,2019-05-02T10:42:34Z,,"-33.863926,18.719736",6458,211,215
1556793763,2019-05-02T10:42:43Z,,"-33.870914,18.715826",6337,210,207
1556793776,2019-05-02T10:42:56Z,,"-33.87822,18.713348",6200,210,198
1556793783,2019-05-02T10:43:03Z,,"-33.889984,18.710264",5891,210,198
1556793792,2019-05-02T10:43:12Z,,"-33.899094,18.711336",5767,226,180
1556793799,2019-05-02T10:43:19Z,,"-33.908577,18.71273",5603,235,174
1556793806,2019-05-02T10:43:26Z,,"-33.918133,18.714584",5414,245,171
1556793814,2019-05-02T10:43:34Z,,"-33.927719,18.716764",5210,251,169
1556793820,2019-05-02T10:43:40Z,,"-33.932209,18.717939",5133,251,169
1556793831,2019-05-02T10:43:51Z,,"-33.946987,18.72143",4822,266,166
1556793839,2019-05-02T10:43:59Z,,"-33.957924,18.723835",4616,267,168
1556793850,2019-05-02T10:44:10Z,,"-33.97229,18.727425",4364,272,168
1556793863,2019-05-02T10:44:23Z,,"-33.987381,18.730621",4135,273,169
1556793870,2019-05-02T10:44:30Z,,"-33.996632,18.732544",3996,271,169
1556793879,2019-05-02T10:44:39Z,,"-34.006382,18.734409",3843,270,169
1556793886,2019-05-02T10:44:46Z,,"-34.016655,18.736177",3688,266,170
1556793896,2019-05-02T10:44:56Z,,"-34.026237,18.737698",3549,263,171
1556793910,2019-05-02T10:45:10Z,,"-34.045006,18.740166",3349,256,173
1556793918,2019-05-02T10:45:18Z,,"-34.053875,18.741091",3283,253,174
1556793926,2019-05-02T10:45:26Z,,"-34.062424,18.741938",3224,247,174
1556793934,2019-05-02T10:45:34Z,,"-34.072044,18.742868",3214,248,174
1556793940,2019-05-02T10:45:40Z,,"-34.076233,18.743242",3200,248,174
1556793946,2019-05-02T10:45:46Z,,"-34.086739,18.744226",3125,248,174
1556793955,2019-05-02T10:45:55Z,,"-34.095669,18.74502",3000,248,174
1556793962,2019-05-02T10:46:02Z,,"-34.104591,18.745781",2929,248,174
1556793970,2019-05-02T10:46:10Z,,"-34.114227,18.746567",2925,252,174
1556793979,2019-05-02T10:46:19Z,,"-34.12323,18.747002",2943,251,175
1556794002,2019-05-02T10:46:42Z,,"-34.148888,18.742437",2949,239,187
1556794008,2019-05-02T10:46:48Z,,"-34.15274,18.739748",2928,231,203
1556794015,2019-05-02T10:46:55Z,,"-34.158054,18.733742",2941,222,218
1556794026,2019-05-02T10:47:06Z,,"-34.165508,18.722076",2950,217,229
1556794034,2019-05-02T10:47:14Z,,"-34.168259,18.714045",2949,214,238
1556794042,2019-05-02T10:47:22Z,,"-34.170856,18.705189",2949,212,243
1556794051,2019-05-02T10:47:31Z,,"-34.172539,18.69602",2924,215,256
1556794084,2019-05-02T10:48:04Z,,"-34.16671,18.667652",2949,190,293
1556794090,2019-05-02T10:48:10Z,,"-34.161575,18.65814",2950,174,291
1556794096,2019-05-02T10:48:16Z,,"-34.158298,18.656122",2950,188,317
1556794107,2019-05-02T10:48:27Z,,"-34.14843,18.649893",2925,192,327
1556794115,2019-05-02T10:48:35Z,,"-34.141666,18.646309",2900,199,335
1556794123,2019-05-02T10:48:43Z,,"-34.134888,18.643614",2850,195,338
1556794130,2019-05-02T10:48:50Z,,"-34.127964,18.641466",2750,193,342
1556794138,2019-05-02T10:48:58Z,,"-34.121265,18.639879",2617,191,345
1556794148,2019-05-02T10:49:08Z,,"-34.113995,18.638054",2475,190,350
1556794158,2019-05-02T10:49:18Z,,"-34.10453,18.636805",2313,183,352
1556794171,2019-05-02T10:49:31Z,,"-34.095119,18.635569",2175,177,353
1556794178,2019-05-02T10:49:38Z,,"-34.088943,18.634809",2090,174,353
1556794186,2019-05-02T10:49:46Z,,"-34.086006,18.634487",2050,172,354
1556794198,2019-05-02T10:49:58Z,,"-34.075005,18.63274",1897,157,355
1556794204,2019-05-02T10:50:04Z,,"-34.072643,18.632706",1850,157,355
1556794211,2019-05-02T10:50:11Z,,"-34.067154,18.631845",1767,150,355
1556794222,2019-05-02T10:50:22Z,,"-34.059864,18.630371",1624,143,351
1556794228,2019-05-02T10:50:28Z,,"-34.057713,18.630026",1579,143,351
1556794238,2019-05-02T10:50:38Z,,"-34.050793,18.62859",1434,127,351
1556794246,2019-05-02T10:50:46Z,,"-34.046082,18.627441",1350,124,349
1556794259,2019-05-02T10:50:59Z,,"-34.041908,18.626347",1275,122,348
1556794268,2019-05-02T10:51:08Z,,"-34.035694,18.624607",1150,121,348
1556794275,2019-05-02T10:51:15Z,,"-34.031925,18.62347",1078,116,347
1556794287,2019-05-02T10:51:27Z,,"-34.027672,18.622141",1007,113,346
1556794298,2019-05-02T10:51:38Z,,"-34.020275,18.619766",879,107,345
1556794307,2019-05-02T10:51:47Z,,"-34.016697,18.618561",800,104,345
1556794330,2019-05-02T10:52:10Z,,"-34.004791,18.614841",525,102,345
1556794342,2019-05-02T10:52:22Z,,"-33.999565,18.613098",425,101,345
1556794354,2019-05-02T10:52:34Z,,"-33.993317,18.611031",304,106,345
1556794364,2019-05-02T10:52:44Z,,"-33.989693,18.609821",216,107,345
