Timestamp,UTC,Callsign,Position,Altitude,Speed,Direction
1556607723,2019-04-30T07:02:03Z,SAA317,"-26.13665,28.229832",0,0,5
1556607767,2019-04-30T07:02:47Z,SAA317,"-26.136883,28.229805",0,9,5
1556607793,2019-04-30T07:03:13Z,SAA317,"-26.137138,28.229794",0,2,42
1556607972,2019-04-30T07:06:12Z,SAA317,"-26.13731,28.229589",0,9,92
1556607989,2019-04-30T07:06:29Z,SAA317,"-26.137447,28.2299",0,19,135
1556608003,2019-04-30T07:06:43Z,SAA317,"-26.137777,28.230175",0,18,123
1556608011,2019-04-30T07:06:51Z,SAA317,"-26.137791,28.230471",0,19,92
1556608021,2019-04-30T07:07:01Z,SAA317,"-26.137825,28.230808",0,19,95
1556608035,2019-04-30T07:07:15Z,SAA317,"-26.137882,28.231312",0,17,95
1556608043,2019-04-30T07:07:23Z,SAA317,"-26.137905,28.231586",0,20,95
1556608056,2019-04-30T07:07:36Z,SAA317,"-26.137974,28.23226",0,28,95
1556608066,2019-04-30T07:07:46Z,SAA317,"-26.13801,28.232712",0,18,95
1556608076,2019-04-30T07:07:56Z,SAA317,"-26.138123,28.233076",0,24,123
1556608091,2019-04-30T07:08:11Z,SAA317,"-26.13858,28.233557",0,18,120
1556608101,2019-04-30T07:08:21Z,SAA317,"-26.138662,28.233913",0,21,106
1556608121,2019-04-30T07:08:41Z,SAA317,"-26.138861,28.234665",0,21,106
1556608131,2019-04-30T07:08:51Z,SAA317,"-26.138935,28.23498",0,14,106
1556608156,2019-04-30T07:09:16Z,SAA317,"-26.139071,28.235523",0,15,104
1556608171,2019-04-30T07:09:31Z,SAA317,"-26.139187,28.23596",0,16,106
1556608180,2019-04-30T07:09:40Z,SAA317,"-26.139256,28.236237",0,15,106
1556608192,2019-04-30T07:09:52Z,SAA317,"-26.139324,28.236521",0,13,98
1556608206,2019-04-30T07:10:06Z,SAA317,"-26.139082,28.236633",0,13,19
1556608322,2019-04-30T07:12:02Z,SAA317,"-26.138872,28.236671",0,15,14
1556608336,2019-04-30T07:12:16Z,SAA317,"-26.135468,28.237726",0,80,14
1556608348,2019-04-30T07:12:28Z,SAA317,"-26.129887,28.239458",0,125,14
1556608354,2019-04-30T07:12:34Z,SAA317,"-26.125338,28.240858",0,150,14
1556608367,2019-04-30T07:12:47Z,SAA317,"-26.116516,28.243517",5500,160,15
1556608383,2019-04-30T07:13:03Z,SAA317,"-26.105072,28.24699",6150,156,15
1556608397,2019-04-30T07:13:17Z,SAA317,"-26.094717,28.250023",6700,160,14
1556608414,2019-04-30T07:13:34Z,SAA317,"-26.083557,28.253365",7075,173,14
1556608428,2019-04-30T07:13:48Z,SAA317,"-26.07065,28.257311",7400,192,15
1556608444,2019-04-30T07:14:04Z,SAA317,"-26.05687,28.260851",7700,209,9
1556608454,2019-04-30T07:14:14Z,SAA317,"-26.046204,28.258701",7850,224,341
1556608464,2019-04-30T07:14:24Z,SAA317,"-26.037411,28.251713",8000,243,316
1556608473,2019-04-30T07:14:33Z,SAA317,"-26.030893,28.240461",8200,263,294
1556608479,2019-04-30T07:14:39Z,SAA317,"-26.028847,28.233173",8325,272,284
1556608489,2019-04-30T07:14:49Z,SAA317,"-26.028288,28.219334",8675,289,267
1556608495,2019-04-30T07:14:55Z,SAA317,"-26.028992,28.210817",8900,297,264
1556608504,2019-04-30T07:15:04Z,SAA317,"-26.03064,28.195011",9475,298,262
1556608514,2019-04-30T07:15:14Z,SAA317,"-26.032333,28.180553",9975,302,262
1556608529,2019-04-30T07:15:29Z,SAA317,"-26.035223,28.156216",10650,309,262
1556608544,2019-04-30T07:15:44Z,SAA317,"-26.038193,28.131529",11025,325,261
1556608554,2019-04-30T07:15:54Z,SAA317,"-26.04174,28.116972",11225,338,249
1556608564,2019-04-30T07:16:04Z,SAA317,"-26.050678,28.100651",11500,350,233
1556608589,2019-04-30T07:16:29Z,SAA317,"-26.079895,28.066751",12350,364,225
1556608625,2019-04-30T07:17:05Z,SAA317,"-26.122929,28.019732",13825,371,224
1556608654,2019-04-30T07:17:34Z,SAA317,"-26.159958,27.979172",14925,382,224
1556608690,2019-04-30T07:18:10Z,SAA317,"-26.204773,27.929525",16425,386,225
1556608724,2019-04-30T07:18:44Z,SAA317,"-26.248154,27.881083",17950,386,225
1556608760,2019-04-30T07:19:20Z,SAA317,"-26.294128,27.829613",19200,394,225
1556608821,2019-04-30T07:20:21Z,SAA317,"-26.372169,27.742115",21175,408,225
1556608885,2019-04-30T07:21:25Z,SAA317,"-26.461533,27.641758",23225,417,225
1556608952,2019-04-30T07:22:32Z,SAA317,"-26.550751,27.541119",25150,423,225
1556609011,2019-04-30T07:23:31Z,SAA317,"-26.633419,27.447598",26850,430,225
1556609076,2019-04-30T07:24:36Z,SAA317,"-26.726578,27.342068",28550,437,225
1556609142,2019-04-30T07:25:42Z,SAA317,"-26.820141,27.235689",30125,444,225
1556609208,2019-04-30T07:26:48Z,SAA317,"-26.914078,27.128664",31500,451,225
1556609268,2019-04-30T07:27:48Z,SAA317,"-27.003616,27.026575",32750,454,225
1556609332,2019-04-30T07:28:52Z,SAA317,"-27.097961,26.918266",34175,452,225
1556609397,2019-04-30T07:29:57Z,SAA317,"-27.191582,26.810919",35700,446,225
1556609458,2019-04-30T07:30:58Z,SAA317,"-27.278866,26.710457",37125,435,225
1556609521,2019-04-30T07:32:01Z,SAA317,"-27.365826,26.609943",38000,427,225
1556609581,2019-04-30T07:33:01Z,SAA317,"-27.451263,26.51115",38000,432,225
1556609642,2019-04-30T07:34:02Z,SAA317,"-27.536301,26.412611",38000,432,225
1556609705,2019-04-30T07:35:05Z,SAA317,"-27.620094,26.315214",38025,429,225
1556609768,2019-04-30T07:36:08Z,SAA317,"-27.705471,26.215809",38000,427,225
1556609827,2019-04-30T07:37:07Z,SAA317,"-27.789413,26.117819",37950,429,226
1556609890,2019-04-30T07:38:10Z,SAA317,"-27.877947,26.014252",37975,432,226
1556609919,2019-04-30T07:38:39Z,SAA317,"-27.919098,25.965979",37975,434,226
1556610009,2019-04-30T07:40:09Z,SAA317,"-28.042557,25.821371",38050,434,225
1556610072,2019-04-30T07:41:12Z,SAA317,"-28.129656,25.723356",38025,433,225
1556610133,2019-04-30T07:42:13Z,SAA317,"-28.217405,25.623779",37975,433,225
1556610193,2019-04-30T07:43:13Z,SAA317,"-28.302658,25.526522",37975,435,225
1556610255,2019-04-30T07:44:15Z,SAA317,"-28.38965,25.427048",38025,436,225
1556610317,2019-04-30T07:45:17Z,SAA317,"-28.479403,25.324348",38000,437,225
1556610378,2019-04-30T07:46:18Z,SAA317,"-28.56678,25.224072",38000,437,225
1556610442,2019-04-30T07:47:22Z,SAA317,"-28.657139,25.11997",38025,436,225
1556610505,2019-04-30T07:48:25Z,SAA317,"-28.743168,25.020769",38025,430,225
1556610564,2019-04-30T07:49:24Z,SAA317,"-28.828451,24.922001",37975,429,225
1556610630,2019-04-30T07:50:30Z,SAA317,"-28.917892,24.81822",37975,428,225
1556610691,2019-04-30T07:51:31Z,SAA317,"-29.004547,24.717442",37975,432,225
1556610750,2019-04-30T07:52:30Z,SAA317,"-29.088409,24.619728",38000,434,225
1556610815,2019-04-30T07:53:35Z,SAA317,"-29.177994,24.515251",38000,437,225
1556610876,2019-04-30T07:54:36Z,SAA317,"-29.264786,24.413237",38025,438,225
1556610936,2019-04-30T07:55:36Z,SAA317,"-29.349697,24.313391",38025,438,225
1556610999,2019-04-30T07:56:39Z,SAA317,"-29.436447,24.211332",38025,434,225
1556611052,2019-04-30T07:57:32Z,SAA317,"-29.511383,24.122807",38000,431,225
1556611200,2019-04-30T08:00:00Z,SAA317,"-29.718111,23.877707",37975,431,226
1556611261,2019-04-30T08:01:01Z,SAA317,"-29.801067,23.778776",38000,431,226
1556611326,2019-04-30T08:02:06Z,SAA317,"-29.892263,23.669882",38000,432,226
1556611389,2019-04-30T08:03:09Z,SAA317,"-29.979538,23.565296",38025,432,226
1556611452,2019-04-30T08:04:12Z,SAA317,"-30.066879,23.460316",38000,432,226
1556611515,2019-04-30T08:05:15Z,SAA317,"-30.152939,23.356611",37975,434,226
1556611577,2019-04-30T08:06:17Z,SAA317,"-30.241104,23.250355",38050,431,226
1556611640,2019-04-30T08:07:20Z,SAA317,"-30.326408,23.147039",38025,427,226
1556611701,2019-04-30T08:08:21Z,SAA317,"-30.408737,23.047054",38025,421,226
1556611720,2019-04-30T08:08:40Z,SAA317,"-30.434782,23.015369",38025,420,226
1556611782,2019-04-30T08:09:42Z,SAA317,"-30.516249,22.915943",37950,421,226
1556611844,2019-04-30T08:10:44Z,SAA317,"-30.599945,22.81381",38025,423,226
1556611905,2019-04-30T08:11:45Z,SAA317,"-30.68272,22.712311",38050,417,226
1556611967,2019-04-30T08:12:47Z,SAA317,"-30.76268,22.614279",37950,415,226
1556612027,2019-04-30T08:13:47Z,SAA317,"-30.843018,22.515295",37950,418,226
1556612090,2019-04-30T08:14:50Z,SAA317,"-30.926422,22.412378",38000,423,226
1556612151,2019-04-30T08:15:51Z,SAA317,"-31.010101,22.30817",38050,426,227
1556612213,2019-04-30T08:16:53Z,SAA317,"-31.092087,22.205847",38025,428,226
1556612274,2019-04-30T08:17:54Z,SAA317,"-31.176174,22.101032",38000,431,226
1556612336,2019-04-30T08:18:56Z,SAA317,"-31.259874,21.996166",38025,433,227
1556612397,2019-04-30T08:19:57Z,SAA317,"-31.344131,21.89069",38000,436,227
1556612461,2019-04-30T08:21:01Z,SAA317,"-31.433048,21.778528",38025,433,227
1556612523,2019-04-30T08:22:03Z,SAA317,"-31.515701,21.673817",38000,430,227
1556612584,2019-04-30T08:23:04Z,SAA317,"-31.599152,21.567993",37950,433,227
1556612647,2019-04-30T08:24:07Z,SAA317,"-31.682419,21.462061",38000,434,227
1556612707,2019-04-30T08:25:07Z,SAA317,"-31.766876,21.354513",38000,437,227
1556612768,2019-04-30T08:26:08Z,SAA317,"-31.850739,21.247559",38000,439,227
1556612830,2019-04-30T08:27:10Z,SAA317,"-31.934097,21.140606",38025,441,227
1556612891,2019-04-30T08:28:11Z,SAA317,"-32.019279,21.030972",38025,440,227
1556612953,2019-04-30T08:29:13Z,SAA317,"-32.103104,20.923023",38000,441,227
1556613014,2019-04-30T08:30:14Z,SAA317,"-32.189117,20.811895",38025,440,227
1556613076,2019-04-30T08:31:16Z,SAA317,"-32.27285,20.7034",38000,436,227
1556613137,2019-04-30T08:32:17Z,SAA317,"-32.354736,20.596838",38025,429,227
1556613198,2019-04-30T08:33:18Z,SAA317,"-32.435257,20.491699",38000,420,228
1556613261,2019-04-30T08:34:21Z,SAA317,"-32.514458,20.387766",37950,418,228
1556613323,2019-04-30T08:35:23Z,SAA317,"-32.595364,20.281546",38000,417,228
1556613384,2019-04-30T08:36:24Z,SAA317,"-32.674038,20.177961",37100,429,228
1556613447,2019-04-30T08:37:27Z,SAA317,"-32.757229,20.067986",34750,428,228
1556613508,2019-04-30T08:38:28Z,SAA317,"-32.837761,19.961765",32775,430,228
1556613569,2019-04-30T08:39:29Z,SAA317,"-32.921127,19.85268",30475,428,224
1556613579,2019-04-30T08:39:39Z,SAA317,"-32.938293,19.835541",30050,434,218
1556613586,2019-04-30T08:39:46Z,SAA317,"-32.949783,19.825708",29800,435,215
1556613592,2019-04-30T08:39:52Z,SAA317,"-32.960037,19.817194",29600,435,215
1556613654,2019-04-30T08:40:54Z,SAA317,"-33.059303,19.736322",27400,423,214
1556613715,2019-04-30T08:41:55Z,SAA317,"-33.156876,19.657288",25575,403,213
1556613775,2019-04-30T08:42:55Z,SAA317,"-33.24939,19.582855",23525,395,214
1556613837,2019-04-30T08:43:57Z,SAA317,"-33.343964,19.514904",21575,391,210
1556613902,2019-04-30T08:45:02Z,SAA317,"-33.443592,19.441933",19575,379,211
1556613965,2019-04-30T08:46:05Z,SAA317,"-33.53952,19.379389",17700,378,201
1556613994,2019-04-30T08:46:34Z,SAA317,"-33.588089,19.359255",17025,375,199
1556614026,2019-04-30T08:47:06Z,SAA317,"-33.637066,19.329872",16275,355,213
1556614036,2019-04-30T08:47:16Z,SAA317,"-33.649681,19.318314",15900,349,218
1556614042,2019-04-30T08:47:22Z,SAA317,"-33.655872,19.312134",15750,349,220
1556614078,2019-04-30T08:47:58Z,SAA317,"-33.699306,19.267731",15200,337,220
1556614108,2019-04-30T08:48:28Z,SAA317,"-33.734684,19.231853",14825,324,220
1556614140,2019-04-30T08:49:00Z,SAA317,"-33.766293,19.192085",14050,315,228
1556614170,2019-04-30T08:49:30Z,SAA317,"-33.792389,19.147993",13400,303,238
1556614205,2019-04-30T08:50:05Z,SAA317,"-33.81752,19.09861",12800,297,238
1556614235,2019-04-30T08:50:35Z,SAA317,"-33.840363,19.05629",12550,298,231
1556614242,2019-04-30T08:50:42Z,SAA317,"-33.846405,19.04962",12500,305,222
1556614251,2019-04-30T08:50:51Z,SAA317,"-33.857437,19.041269",12425,314,210
1556614260,2019-04-30T08:51:00Z,SAA317,"-33.869732,19.033699",12400,318,206
1556614266,2019-04-30T08:51:06Z,SAA317,"-33.879089,19.028208",12350,321,206
1556614277,2019-04-30T08:51:17Z,SAA317,"-33.891769,19.020864",12275,324,205
1556614305,2019-04-30T08:51:45Z,SAA317,"-33.931831,18.997364",12025,324,205
1556614339,2019-04-30T08:52:19Z,SAA317,"-33.976616,18.971729",11325,320,205
1556614351,2019-04-30T08:52:31Z,SAA317,"-33.992203,18.963076",11050,318,204
1556614363,2019-04-30T08:52:43Z,SAA317,"-34.009388,18.953648",10775,317,204
1556614375,2019-04-30T08:52:55Z,SAA317,"-34.024292,18.945587",10550,314,204
1556614387,2019-04-30T08:53:07Z,SAA317,"-34.041279,18.936596",10275,313,203
1556614414,2019-04-30T08:53:34Z,SAA317,"-34.074982,18.919659",9750,306,201
1556614426,2019-04-30T08:53:46Z,SAA317,"-34.091629,18.911507",9175,303,202
1556614437,2019-04-30T08:53:57Z,SAA317,"-34.105286,18.904438",8525,311,203
1556614451,2019-04-30T08:54:11Z,SAA317,"-34.124405,18.894241",7875,315,204
1556614463,2019-04-30T08:54:23Z,SAA317,"-34.139503,18.886127",7450,310,204
1556614474,2019-04-30T08:54:34Z,SAA317,"-34.1544,18.877659",7075,305,206
1556614493,2019-04-30T08:54:53Z,SAA317,"-34.172417,18.856373",6350,273,236
1556614500,2019-04-30T08:55:00Z,SAA317,"-34.175949,18.84783",6200,267,244
1556614517,2019-04-30T08:55:17Z,SAA317,"-34.183777,18.824289",5900,259,248
1556614531,2019-04-30T08:55:31Z,SAA317,"-34.188492,18.806015",5725,236,255
1556614537,2019-04-30T08:55:37Z,SAA317,"-34.18922,18.799038",5450,232,264
1556614543,2019-04-30T08:55:43Z,SAA317,"-34.189312,18.791027",5175,233,270
1556614551,2019-04-30T08:55:51Z,SAA317,"-34.188995,18.781801",4825,236,272
1556614559,2019-04-30T08:55:59Z,SAA317,"-34.1884,18.770758",4250,243,273
1556614565,2019-04-30T08:56:05Z,SAA317,"-34.187805,18.761677",3900,249,274
1556614573,2019-04-30T08:56:13Z,SAA317,"-34.187263,18.753262",3600,252,274
1556614582,2019-04-30T08:56:22Z,SAA317,"-34.186157,18.736118",3175,251,274
1556614589,2019-04-30T08:56:29Z,SAA317,"-34.185635,18.726768",3025,247,273
1556614596,2019-04-30T08:56:36Z,SAA317,"-34.18515,18.718124",2925,240,273
1556614602,2019-04-30T08:56:42Z,SAA317,"-34.18438,18.709545",2875,232,276
1556614610,2019-04-30T08:56:50Z,SAA317,"-34.182938,18.703766",2875,225,286
1556614618,2019-04-30T08:56:58Z,SAA317,"-34.178326,18.693695",2875,213,301
1556614624,2019-04-30T08:57:04Z,SAA317,"-34.175079,18.687912",2875,207,304
1556614631,2019-04-30T08:57:11Z,SAA317,"-34.171764,18.682194",2850,201,305
1556614640,2019-04-30T08:57:20Z,SAA317,"-34.166737,18.673782",2850,191,305
1556614648,2019-04-30T08:57:28Z,SAA317,"-34.161392,18.666555",2875,184,316
1556614654,2019-04-30T08:57:34Z,SAA317,"-34.157593,18.663866",2875,182,332
1556614660,2019-04-30T08:57:40Z,SAA317,"-34.152538,18.661594",2875,177,340
1556614666,2019-04-30T08:57:46Z,SAA317,"-34.148163,18.659935",2900,168,342
1556614673,2019-04-30T08:57:53Z,SAA317,"-34.143414,18.658218",2875,161,343
1556614679,2019-04-30T08:57:59Z,SAA317,"-34.139362,18.656902",2875,156,344
1556614685,2019-04-30T08:58:05Z,SAA317,"-34.1353,18.655626",2875,149,345
1556614692,2019-04-30T08:58:12Z,SAA317,"-34.129215,18.653755",2800,141,345
1556614702,2019-04-30T08:58:22Z,SAA317,"-34.125072,18.652439",2750,140,345
1556614708,2019-04-30T08:58:28Z,SAA317,"-34.121887,18.651423",2675,140,345
1556614718,2019-04-30T08:58:38Z,SAA317,"-34.113712,18.648834",2525,138,345
1556614729,2019-04-30T08:58:49Z,SAA317,"-34.106915,18.64666",2375,137,345
1556614737,2019-04-30T08:58:57Z,SAA317,"-34.1031,18.645458",2300,136,344
1556614744,2019-04-30T08:59:04Z,SAA317,"-34.09877,18.644028",2225,134,344
1556614754,2019-04-30T08:59:14Z,SAA317,"-34.091766,18.641836",2075,133,345
1556614761,2019-04-30T08:59:21Z,SAA317,"-34.088062,18.640652",2000,132,345
1556614768,2019-04-30T08:59:28Z,SAA317,"-34.084351,18.639482",1950,128,345
1556614779,2019-04-30T08:59:39Z,SAA317,"-34.077915,18.637447",1825,122,344
1556614785,2019-04-30T08:59:45Z,SAA317,"-34.074326,18.636288",1775,122,344
1556614791,2019-04-30T08:59:51Z,SAA317,"-34.070839,18.635159",1725,121,345
1556614797,2019-04-30T08:59:57Z,SAA317,"-34.068146,18.634325",1650,120,345
1556614803,2019-04-30T09:00:03Z,SAA317,"-34.064552,18.633213",1575,122,345
1556614810,2019-04-30T09:00:10Z,SAA317,"-34.060921,18.632069",1500,121,345
1556614821,2019-04-30T09:00:21Z,SAA317,"-34.054871,18.630121",1350,121,345
1556614828,2019-04-30T09:00:28Z,SAA317,"-34.051208,18.628944",1300,120,345
1556614834,2019-04-30T09:00:34Z,SAA317,"-34.047867,18.62788",1225,121,345
1556614841,2019-04-30T09:00:41Z,SAA317,"-34.044525,18.626816",1175,120,345
1556614848,2019-04-30T09:00:48Z,SAA317,"-34.041916,18.625975",1100,121,345
1556614859,2019-04-30T09:00:59Z,SAA317,"-34.034573,18.623714",975,120,345
1556614871,2019-04-30T09:01:11Z,SAA317,"-34.028412,18.621714",850,122,345
1556614877,2019-04-30T09:01:17Z,SAA317,"-34.024796,18.620592",800,122,345
1556614883,2019-04-30T09:01:23Z,SAA317,"-34.021408,18.619528",725,122,345
1556614889,2019-04-30T09:01:29Z,SAA317,"-34.017792,18.618351",650,122,344
1556614895,2019-04-30T09:01:35Z,SAA317,"-34.014927,18.61742",600,122,344
1556614901,2019-04-30T09:01:41Z,SAA317,"-34.011429,18.616333",525,122,345
1556614908,2019-04-30T09:01:48Z,SAA317,"-34.007713,18.615131",475,122,345
1556614914,2019-04-30T09:01:54Z,SAA317,"-34.004288,18.61409",400,122,345
1556614920,2019-04-30T09:02:00Z,SAA317,"-34.001266,18.613138",325,121,344
1556614929,2019-04-30T09:02:09Z,SAA317,"-33.99617,18.611526",250,122,345
1556614937,2019-04-30T09:02:17Z,SAA317,"-33.992661,18.610392",175,122,345
1556614947,2019-04-30T09:02:27Z,SAA317,"-33.986252,18.608379",25,121,345
1556614953,2019-04-30T09:02:33Z,SAA317,"-33.982903,18.607349",0,120,345
1556614959,2019-04-30T09:02:39Z,SAA317,"-33.979759,18.606361",0,110,345
1556614967,2019-04-30T09:02:47Z,SAA317,"-33.977398,18.605618",0,90,345
1556614976,2019-04-30T09:02:56Z,SAA317,"-33.974442,18.604673",0,60,345
1556614987,2019-04-30T09:03:07Z,SAA317,"-33.972393,18.604015",0,26,343
1556614993,2019-04-30T09:03:13Z,SAA317,"-33.971867,18.60376",0,21,334
1556615003,2019-04-30T09:03:23Z,SAA317,"-33.971386,18.603287",0,27,312
1556615010,2019-04-30T09:03:30Z,SAA317,"-33.971249,18.602993",0,23,295
1556615017,2019-04-30T09:03:37Z,SAA317,"-33.971123,18.602571",0,23,286
1556615024,2019-04-30T09:03:44Z,SAA317,"-33.971043,18.602257",0,22,286
1556615030,2019-04-30T09:03:50Z,SAA317,"-33.97097,18.601971",0,21,286
1556615036,2019-04-30T09:03:56Z,SAA317,"-33.970905,18.601704",0,21,284
1556615042,2019-04-30T09:04:02Z,SAA317,"-33.970848,18.601465",0,22,286
1556615048,2019-04-30T09:04:08Z,SAA317,"-33.970791,18.601185",0,21,284
1556615060,2019-04-30T09:04:20Z,SAA317,"-33.970642,18.600595",0,21,286
1556615066,2019-04-30T09:04:26Z,SAA317,"-33.970585,18.600357",0,19,284
1556615072,2019-04-30T09:04:32Z,SAA317,"-33.970551,18.600134",0,17,278
1556615082,2019-04-30T09:04:42Z,SAA317,"-33.970619,18.599882",0,14,250
1556615093,2019-04-30T09:04:53Z,SAA317,"-33.970802,18.59967",0,17,219
1556615105,2019-04-30T09:05:05Z,SAA317,"-33.970982,18.599354",0,14,247
1556615115,2019-04-30T09:05:15Z,SAA317,"-33.971043,18.599054",0,16,255
1556615125,2019-04-30T09:05:25Z,SAA317,"-33.971088,18.598824",0,11,255
1556615146,2019-04-30T09:05:46Z,SAA317,"-33.971134,18.59861",0,2,255
