HDR_SIZE            4096
HDR_VERSION         1.0
COMMAND             START
SOURCE              J1644-4559_R
RA                  None
DEC                 None
TOBS                None
OBSERVER            Sarah
PID                 None
MODE                CAL
CALFREQ             11.1111111111
OBS_OFFSET          0
PERFORM_FOLD        1
PERFORM_SEARCH      0
PERFORM_TRANS       0
ADC_SYNC_TIME       1501586468.0
ANTENNAE            m006
SCHEDULE_BLOCK_ID   20170801-0030
EXPERIMENT_ID       20170801-0030
PROPOSAL_ID         None
PROGRAM_BLOCK_ID    TBD
DESCRIPTION         Noise diode test
UTC_START           2017-08-01-15:53:29
NCHAN               768
NBIT                16
NPOL                2
NDIM                2
TSAMP               1.28
FREQ                1000
BW                  800
START_CHANNEL       0
END_CHANNEL         768
LOCAL_HOST          127.0.0.1
DATA_HOST           127.0.0.1
DATA_PORT           12345
BYTES_PER_SECOND    3200000000
DATA_KEY            dddd
WEIGHTS_KEY         eeee
UDP_FORMAT          LowPST
UDP_NSAMP           32
WT_NSAMP            32
UDP_NCHAN           24
FRONTEND            beam1
FD_POLN             CIRC
FD_HAND             1
FD_SANG             10.0
FD_MODE             FA
FA_REQ              0.0
NANT                1
ANT_WEIGHTS         1
OS_FACTOR           4/3
NSUBBAND            1
START_CHANNEL_OUT   0
END_CHANNEL_OUT     768
NCHAN_OUT           768
BW_OUT              800
FREQ_OUT            1000
ACTIVATION_TIME     2022-01-19T23:07:45Z
SCAN_ID             1
OBSERVER            jdoe
PROJID              pstproject
PNT_ID              pointing1
SUBARRAY_ID         subarray42
SOURCE              J1921+2153
ITRF                5109360.133,2006852.586,-3238948.127
COORD_MD            J2000
EQUINOX             2000.
STT_CRD1            19:21:44.815
STT_CRD2            21:53:02.250
TRK_MODE            TRACK
SCANLEN_MAX         30
BEAM_ID             1