$ ls . data weights
.:
data  monitoring_stats  scan_completed  scan_configuration.json  ska-data-product.yaml  stat  weights

data:
2000-01-01-00:03:40_0000000000000000_000000.dada
2000-01-01-00:03:40_0000008068792320_000001.dada
2000-01-01-00:03:40_0000016137584640_000002.dada
2000-01-01-00:03:40_0000024206376960_000003.dada
2000-01-01-00:03:40_0000032275169280_000004.dada

weights:
2000-01-01-00:03:40_0000000000000000_000000.dada
2000-01-01-00:03:40_0000000068290560_000001.dada
2000-01-01-00:03:40_0000000136581120_000002.dada
2000-01-01-00:03:40_0000000204871680_000003.dada
2000-01-01-00:03:40_0000000273162240_000004.dada
