@startuml Health check LMC to App
actor Operator as OP
participant LMC
boundary "App Service" as AS
participant "App [Instance 1]" as A1
participant "App [Instance 2]" as A2
activate LMC
activate AS
activate A1
A1 --> AS : register
LMC -> AS : connect
AS -> A1 : connect [forward]
A1 --> AS : connected [service_name, uuid]
AS --> LMC : connected [service_name, uuid]
LMC -> AS : start health check
AS -> A1: start health check [forward]
loop stream in background
A1 --> AS : health state
AS --> LMC : health state
LMC --> LMC : handle health state
end
OP -> LMC : ""Reset             ""
LMC -> AS : reset
AS -> A1 : reset [forward]
activate LMC
LMC -> LMC : wait for health check connection closed
A1 --> A1 : exit
destroy A1
AS -> AS : deregister App [instance 1]
AS --> LMC : health check connection closed
deactivate LMC
alt loop until connected
LMC -> AS : try connect
AS --> LMC : service unavailable
else
activate A2
A2 --> AS : register
LMC -> AS : try connect
AS -> A2 : connect [forward]
A2 --> AS : connected [service_name, uuid]
AS --> LMC : connected [service_name, uuid]
end
LMC -> AS : start health check
AS -> A2: start health check [forward]
deactivate LMC
deactivate AS
deactivate A2
@enduml
