HDR_SIZE            4096
HDR_VERSION         1.0
TELESCOPE           SKALow
RECEIVER            LFAA
INSTRUMENT          LowCBF
NBIT                16
NANT                1
NPOL                1
NDIM                1
TSAMP               207.36
BAND                Low
WT_NSAMP            32
UDP_NSAMP           32
UDP_NCHAN           24
UDP_FORMAT          LowPST
OS_FACTOR           4/3
NCHAN               6624
FREQ                61.994
BW                  23.98726852
START_CHANNEL       0
END_CHANNEL         6624
RESOLUTION          26496
DATA_HOST           127.0.0.1
DATA_PORT           9510
LOCAL_HOST          127.0.0.1
CALFREQ             11.1111111111
OBS_OFFSET          0
SOURCE              J0437-4715
DATA_KEY            a000
WEIGHTS_KEY         a010
NUMA_NODE           0
HB_NBUFS            8
HB_BUFSZ            4096
DB_NBUFS            8
DB_BUFSZ            11059200
WB_NBUFS            8
WB_BUFSZ            847872
SCAN_ID             1
BEAM_ID             1
DATA_GENERATOR      Sine
ORDER               TSFP
NSAMP_PER_WEIGHT    32
UTC_START           2023-02-14-22:15:37
PICOSECONDS         0
FILE_NUMBER         0
PACKET_WEIGHTS_SIZE 48
PACKET_SCALES_SIZE  4