HDR_SIZE          4096
HDR_VERSION       1.0

DATA_KEY          a000
WEIGHTS_KEY       a002

NCHAN             128
NPOL              2
NDIM              2
NBIT              16
TSAMP             207.36

NSAMP_PP          1

# NCHAN * NPOL * NDIM * NBIT/8 * NSAMP_PP
RESOLUTION        32768

BYTES_PER_SECOND  4938271.604938271
SCANLEN_MAX       300
UTC_START         1970-01-01-00:00:00
OBS_OFFSET        0
SCAN_ID           12345
EB_ID             eb-m001-20230921-12345
TELESCOPE         SKALow