  DEPRECATION: ansible-core is being installed using the legacy 'setup.py install' method, because it does not have a 'pyproject.toml' and the 'wheel' package is not installed. pip 23.1 will enforce this behaviour change. A possible replacement is to enable the '--use-pep517' option. Discussion can be found at https://github.com/pypa/pip/issues/8559
  DEPRECATION: ansible is being installed using the legacy 'setup.py install' method, because it does not have a 'pyproject.toml' and the 'wheel' package is not installed. pip 23.1 will enforce this behaviour change. A possible replacement is to enable the '--use-pep517' option. Discussion can be found at https://github.com/pypa/pip/issues/8559

PLAY [Configure tengu] *********************************************************

TASK [Gathering Facts] *********************************************************
Wednesday 15 February 2023  19:09:47 +0000 (0:00:00.047)       0:00:00.047 **** 
ok: [tengu]

TASK [Include common variable check task] **************************************
Wednesday 15 February 2023  19:09:50 +0000 (0:00:03.136)       0:00:03.184 **** 

TASK [common : Fail if deploy_mode value is invalid] ***************************
Wednesday 15 February 2023  19:09:50 +0000 (0:00:00.044)       0:00:03.228 **** 
skipping: [tengu]

TASK [common : Fail if OS variable doesn't match discovered OS] ****************
Wednesday 15 February 2023  19:09:51 +0000 (0:00:00.031)       0:00:03.260 **** 
skipping: [tengu]

TASK [cuda : Import rollback steps] ********************************************
Wednesday 15 February 2023  19:09:51 +0000 (0:00:00.072)       0:00:03.332 **** 
included: /tmp/tmp4rljus20/ansible/roles/cuda/tasks/rollback/main.yml for tengu

TASK [cuda : Include OS-specific import task] **********************************
Wednesday 15 February 2023  19:09:51 +0000 (0:00:00.040)       0:00:03.373 **** 
included: /tmp/tmp4rljus20/ansible/roles/common/tasks/import_os_steps.yml for tengu

TASK [cuda : Set default variables for import OS steps task if necessary] ******
Wednesday 15 February 2023  19:09:51 +0000 (0:00:00.044)       0:00:03.417 **** 
ok: [tengu]

TASK [cuda : Import OS-specific steps] *****************************************
Wednesday 15 February 2023  19:09:51 +0000 (0:00:00.050)       0:00:03.467 **** 

PLAY RECAP *********************************************************************
tengu                      : ok=4    changed=0    unreachable=0    failed=0    skipped=2    rescued=0    ignored=0   

Wednesday 15 February 2023  19:09:51 +0000 (0:00:00.100)       0:00:03.567 **** 
=============================================================================== 
Gathering Facts --------------------------------------------------------- 3.14s
cuda : Import OS-specific steps ----------------------------------------- 0.10s
common : Fail if OS variable doesn't match discovered OS ---------------- 0.07s
cuda : Set default variables for import OS steps task if necessary ------ 0.05s
Include common variable check task -------------------------------------- 0.04s
cuda : Include OS-specific import task ---------------------------------- 0.04s
cuda : Import rollback steps -------------------------------------------- 0.04s
common : Fail if deploy_mode value is invalid --------------------------- 0.03s
