
PLAY [Configure tengu] *********************************************************

TASK [Gathering Facts] *********************************************************
Friday 31 March 2023  15:36:15 +0100 (0:00:00.047)       0:00:00.047 ********** 
ok: [tengu]

TASK [Include common variable check task] **************************************
Friday 31 March 2023  15:36:16 +0100 (0:00:01.417)       0:00:01.464 ********** 

TASK [common : Fail if deploy_mode value is invalid] ***************************
Friday 31 March 2023  15:36:16 +0100 (0:00:00.045)       0:00:01.509 ********** 
skipping: [tengu]

TASK [common : Fail if OS variable doesn't match discovered OS] ****************
Friday 31 March 2023  15:36:16 +0100 (0:00:00.040)       0:00:01.549 ********** 
skipping: [tengu]

TASK [cuda : Import deploy steps] **********************************************
Friday 31 March 2023  15:36:16 +0100 (0:00:00.093)       0:00:01.642 ********** 
included: /home/grace/gitRep/ska-pss-ci-systems/ansible/roles/cuda/tasks/deploy/main.yml for tengu

TASK [cuda : Include OS-specific import task] **********************************
Friday 31 March 2023  15:36:16 +0100 (0:00:00.065)       0:00:01.708 ********** 
included: /home/grace/gitRep/ska-pss-ci-systems/ansible/roles/common/tasks/import_os_steps.yml for tengu

TASK [cuda : Set default variables for import OS steps task if necessary] ******
Friday 31 March 2023  15:36:16 +0100 (0:00:00.058)       0:00:01.767 ********** 
ok: [tengu]

TASK [cuda : Import OS-specific steps] *****************************************
Friday 31 March 2023  15:36:16 +0100 (0:00:00.066)       0:00:01.833 ********** 
included: /home/grace/gitRep/ska-pss-ci-systems/ansible/roles/cuda/tasks/deploy/ubuntu.yml for tengu

TASK [cuda : Get Cuda toolkit for Ubuntu] **************************************
Friday 31 March 2023  15:36:17 +0100 (0:00:00.099)       0:00:01.933 ********** 
changed: [tengu]

PLAY RECAP *********************************************************************
tengu                      : ok=6    changed=1    unreachable=0    failed=0    skipped=2    rescued=0    ignored=0   

Friday 31 March 2023  17:02:03 +0100 (1:25:46.752)       1:25:48.685 ********** 
=============================================================================== 
cuda : Get Cuda toolkit for Ubuntu ----------------------------------- 5146.75s
Gathering Facts --------------------------------------------------------- 1.42s
cuda : Import OS-specific steps ----------------------------------------- 0.10s
common : Fail if OS variable doesn't match discovered OS ---------------- 0.09s
cuda : Set default variables for import OS steps task if necessary ------ 0.07s
cuda : Import deploy steps ---------------------------------------------- 0.07s
cuda : Include OS-specific import task ---------------------------------- 0.06s
Include common variable check task -------------------------------------- 0.05s
common : Fail if deploy_mode value is invalid --------------------------- 0.04s
