
{
  "cheetah": {
    "beams": {
      "beam": {
        "active": "true",
        "cpu": {
          "affinity": "0,1"
        },
        "sinks": {
          "list-output-streams": "false",
          "threads": "3",
          "channels": {
            "sps_events": {
              "active": "true",
              "sink": [
                {
                  "id": "spccl_files"
                },
                {
                  "id": "candidate_files"
                }
              ]
            }
          },
          "sink_configs": {
            "spccl_files": {
              "extension": ".spccl",
              "dir": "/tmp",
              "id": "spccl_files"
            },
            "spccl_sigproc_files": {
              "spectra_per_file": "0",
              "dir": "/tmp",
              "extension": ".fil",
              "candidate_window": {
                "ms_before": "500",
                "ms_after": "1000"
              },
              "id": "candidate_files"
            }
          }
        },
        "source": {
          "sigproc": {
            "file": "/raid/tvcache//SPS-MID_747e95f_0.125_0.00125_2000.0_0.0_Gaussian_50.0_0000_123123123.fil",
            "chunk_samples": "1024",
            "default-nbits": "8"
          }
        },
        "id": "1"
      }
    },
    "ddtr": {
      "pool-id": "default",
      "priority": "0",
      "dedispersion_samples": "131072",
      "klotski": {
        "active": "true",
        "precise": "false"
      },
      "dedispersion": [
        {
          "start": "0.0",
          "end": "100.0",
          "step": "0.1"
        },
        {
          "start": "100.0",
          "end": "300.0",
          "step": "0.2"
        },
        {
          "start": "300.0",
          "end": "700.0",
          "step": "0.4"
        },
        {
          "start": "700.0",
          "end": "1500.0",
          "step": "0.8"
        },
        {
          "start": "1500.0",
          "end": "3100.0",
          "step": "1.6"
        }
      ]
    },
    "sps": {
      "pool-id": "default",
      "priority": "0",
      "threshold": "6.0",
      "klotski": {
        "active": "true",
        "widths": "1,2,4,8,16,32,64,128,256,512,1024,2048,4096,8192,15000"
      }
    }
  }
}

