@startuml ska_oso_pdm.sb_definition.dish.dish_allocation
!pragma useIntermediatePackages false

class ska_oso_pdm.sb_definition.dish.dish_allocation.DishAllocation {
  dish_allocation_id: str {static}
  selected_subarray_definition: str {static}
  dish_ids: frozenset[str] {static}
}

@enduml

