@startuml
!pragma useIntermediatePackages false
hide empty members

class ska_oso_pdm._shared.ids.SBDefinitionID

class ska_oso_pdm.sb_definition.sb_definition.SBDefinition {
    interface: str
    sbd_id: SBDefinitionID
    metadata: MetaData
    telescope: TelescopeType
    activities: dict[str, PythonProcedure]
    targets: List[Target]
    csp_configurations: List[CSPConfiguration]
    scan_definitions: List[ScanDefinition]
    scan_sequence: List[ScanDefinitionID]
    sdp_configurations: List[SDPConfiguration]
    .. SKA LOW ..
    mccs_allocation: MCCSAllocation
    .. SKA MID ..
    dish_allocation: DishAllocation
    }


enum ska_oso_pdm._shared.atoms.TelescopeType {
    SKA1_MID
    SKA1_LOW
    MeerKAT
}

class ska_oso_pdm._shared.metadata.MetaData{
    version: int
    created_by: str
    created_on: datetime.datetime
    last_modified_on:datetime.datetime
    last_modified_by: str
    pdm_version: str
}

@enduml
