{
  "metadata": {
    "version": 1,
    "created_by": "TestUser",
    "created_on": "2022-09-23T15:43:53.971548Z",
    "last_modified_on": "2022-09-23T15:43:53.971548Z",
    "last_modified_by": "TestUser",
    "pdm_version": "15.3.0"
  },
  "interface": "https://schema.skao.int/ska-oso-pdm-sbi/0.1",
  "sbi_id": "sbi-mvp01-20220923-00001",
  "sbd_ref": "sbd-mvp01-20220923-00001",
  "sbd_version": 1,
  "eb_ref": "eb-mvp01-20220923-00001",
  "telescope": "ska_mid",
  "subarray_id": 3,
  "activities": [
    {
      "activity_ref": "test activity",
      "executed_at": "2022-09-23T15:43:53.971548Z",
      "runtime_args": [
        {
          "function_name": "test_fn",
          "function_args": {
            "kwargs": {
              "foo": "bar"
            }
          }
        }
      ]
    }
  ]
}
