@startuml ska_oso_pdm.sb_definition.procedures
!pragma useIntermediatePackages false

class ska_oso_pdm.sb_definition.procedures.FilesystemScript {
  kind: Literal[ScriptKind] {static}
  path: str {static}
}
class ska_oso_pdm.sb_definition.procedures.GitScript {
  kind: Literal[ScriptKind] {static}
  repo: str {static}
  path: str {static}
  branch: Optional[str] {static}
  commit: Optional[str] {static}
}
class ska_oso_pdm.sb_definition.procedures.InlineScript {
  kind: Literal[ScriptKind] {static}
  content: str {static}
}
abstract class ska_oso_pdm.sb_definition.procedures.PythonProcedure {
  function_args: dict[str, PythonArguments] {static}
}
enum ska_oso_pdm.sb_definition.procedures.ScriptKind {
  INLINE: inline {static}
  FILESYSTEM: filesystem {static}
  GIT: git {static}
}
ska_oso_pdm.sb_definition.procedures.FilesystemScript *-- ska_oso_pdm.sb_definition.procedures.ScriptKind
ska_oso_pdm.sb_definition.procedures.PythonProcedure <|-- ska_oso_pdm.sb_definition.procedures.FilesystemScript
ska_oso_pdm.sb_definition.procedures.GitScript *-- ska_oso_pdm.sb_definition.procedures.ScriptKind
ska_oso_pdm.sb_definition.procedures.FilesystemScript <|-- ska_oso_pdm.sb_definition.procedures.GitScript
ska_oso_pdm.sb_definition.procedures.InlineScript *-- ska_oso_pdm.sb_definition.procedures.ScriptKind
ska_oso_pdm.sb_definition.procedures.PythonProcedure <|-- ska_oso_pdm.sb_definition.procedures.InlineScript
@enduml

