{
    "$schema": "https://json-schema.org/draft/2020-12/schema",
    "$id": "https://schema.skao.int/ska-low-mccs-station-getpointingdelays/3.0",
    "title": "Station GetPointingDelays schema",
    "description": "Schema for Station's GetPointingDelays command",
    "type": "object",
    "required": [
        "pointing_type",
        "values"
    ],
    "properties": {
        "interface": {
            "description": "The schema version which you expect to run against",
            "type": "string",
            "pattern": "^https?:\/\/.+\/.+\/[0-9]+.[0-9]+$"
        },
        "pointing_type": {
            "description": "The type of pointing requested",
            "type": "string",
            "enum": [
                "alt_az",
                "ra_dec"
            ]
        },
        "pointing_time": {
            "description": "Time of observation (in format astropy time)",
            "type": "string",
            "format": "date-time"
        },
        "scan_time": {
            "description": "the total scan time in seconds",
            "type": "number"
        },
        "values": {
            "description": "The values provided for either the right ascension and declination or the alitude and azimuth",
            "type": "object",
            "oneOf": [
                {
                    "type": "object",
                    "required": [
                        "altitude",
                        "azimuth"
                    ],
                    "properties": {
                        "altitude": {
                            "type": "number",
                            "description": "the altitude of the target"
                        },
                        "azimuth": {
                            "type": "number",
                            "description": "the azimuth of the target"
                        },
                        "altitude_rate": {
                            "type": "number",
                            "description": "the rate of altitude of the target"
                        },
                        "azimuth_rate": {
                            "type": "number",
                            "description": "the rate of  azimuth of the target"
                        }
                    }
                },
                {
                    "type": "object",
                    "required": [
                        "right_ascension",
                        "declination"
                    ],
                    "properties": {
                        "right_ascension": {
                            "type": "number",
                            "description": "the right_ascension of the target"
                        },
                        "declination": {
                            "type": "number",
                            "description": "the declination of the target"
                        },
                        "right_ascension_rate": {
                            "type": "number",
                            "description": "the rate of right_ascension of the target"
                        },
                        "declination_rate": {
                            "type": "number",
                            "description": "the rate of declination of the target"
                        }
                    }
                }
            ]
        }
    }
}