{
    "$schema": "https://json-schema.org/draft/2020-12/schema",
    "$id": "https://skao.int/MccsCalibrationStore_UpdateSelectionPolicy.json",
    "title": "MccsCalibrationStore UpdateSelectionPolicy schema",
    "description": "Schema for MccsCalibrationStore's UpdateSelectionPolicy command",
    "type": "object",
    "properties": {
        "policy_name": {
            "description": "The name of the policy. Please see details in ReadTheDocs https://developer.skao.int/projects/ska-low-mccs/en/latest/api/calibration_store/selection_policy/index.html",
            "type": "string",
            "enum": [
                "preferred",
                "closest_in_range"
            ]
        },
        "frequency_tolerance": {
            "description": "The absolute tolerance on the frequency",
            "type": "integer",
            "units": "channelizer channel"
        },
        "temperature_tolerance": {
            "description": "The absolute tolerance on the temperature",
            "type": "number",
            "units": "Degree Celcius"
        }
    },
    "required": [
        "policy_name"
    ]
}