{
  "$schema": "https://json-schema.org/draft/2020-12/schema",
  "$id": "https://schema.skao.int/ska-low-mccs-stationbeam-assignresources/3.0",
  "title": "StationBeam AssignResources schema",
  "description": "Schema for StationBeam's AssignResources command",
  "type": "object",
  "required": [
    "subarray_id",
    "subarray_beam_id",
    "station_id",
    "station_trl",
    "channel_blocks",
    "hardware_beam"
  ],
  "properties": {
    "interface": {
      "description": "The schema version which you expect to run against",
      "type": "string",
      "pattern": "^https?:\/\/.+\/.+\/[0-9]+.[0-9]+$"
    },
    "subarray_id": {
      "description": "The ID of the subarray to which resources are allocated",
      "type": "integer",
      "minimum": 1,
      "maximum": 16
    },
    "subarray_beam_id": {
      "description": "The ID of the subarray beam to which resources are allocated",
      "type": "integer",
      "minimum": 1,
      "maximum": 768
    },
    "station_id": {
      "type": "integer",
      "minimum": 1,
      "maximum": 512
    },
    "aperture_id": {
      "description": "Aperture ID, of the form APXXX.YY, XXX=station YY=substation",
      "type": "string",
      "pattern": "^AP(?!0{3})\\d{3}\\.\\d{2}$"
    },
    "station_trl": {
      "description": "TRL of the Tango station device used by the aperture",
      "type": "string"
    },
    "channel_blocks": {
      "description": "SPS channel blocks allocated to this station beam",
      "type": "array",
      "items": {
        "type": "integer",
        "minimum": 0,
        "maximum": 47
      },
      "maxItems": 48
    },
    "hardware_beam": {
      "type": "integer",
      "minimum": 0,
      "maximum": 47
    },
    "first_subarray_channel": {
      "description": "First SPS subarray channel ID",
      "type": "integer",
      "minimum": 0,
      "maximum": 376,
      "multipleof": 8
    },
    "number_of_channels": {
      "description": "The allocated number of SPS channels",
      "type": "integer",
      "minimum": 8,
      "maximum": 384,
      "multipleof": 8
    }
  }
}