{
   "latitude":[-26.70331940],
   "longitude":[116.67081524],
   "altitude":[400],
   "offsets":
      [[4400,660],
       [780,3200],
       [2630,175],
       [3600,2000],
       [3900,4800],
       [4300,4040],
       [2265,4165],
       [4361,860]]
}