{
   "latitude":[-26.70331940],
   "longitude":[116.67081524],
   "altitude":[400],
   "offsets":
      [[0,0],
       [1000,0],
       [1000,1000],
       [0,1000],
       [500,100],
       [600,300],
       [250,800],
       [700,400]]
}