{"sky":
   [
      [
         {"index":[1],
          "ascension":[20],
          "declination":[10],
          "rate":[0],
          "coarse":[66],
          "fine":[-2048],
          "RMS":[20],
          "sinusoids":[0],
          "pulseWidth":[512],
          "polarisation":[1,0,0,1],
          "BW":[5000],
          "skyImage":["twoDots.png"],
          "skyImageDimension":[3]
          }
      ]

   ]
}