  -3.4000000e+01
  -3.4000000e+01
  -3.4000000e+01
  -3.4000000e+01
  -3.3000000e+01
  -3.3000000e+01
  -3.3000000e+01
  -3.2000000e+01
  -3.1000000e+01
  -3.1000000e+01
  -3.0000000e+01
  -2.9000000e+01
  -2.8000000e+01
  -2.7000000e+01
  -2.6000000e+01
  -2.6000000e+01
  -2.5000000e+01
  -2.4000000e+01
  -2.2000000e+01
  -2.1000000e+01
  -2.0000000e+01
  -1.9000000e+01
  -1.8000000e+01
  -1.7000000e+01
  -1.6000000e+01
  -1.5000000e+01
  -1.4000000e+01
  -1.3000000e+01
  -1.2000000e+01
  -1.1000000e+01
  -1.0000000e+01
  -9.0000000e+00
  -8.0000000e+00
  -7.0000000e+00
  -6.0000000e+00
  -5.0000000e+00
  -4.0000000e+00
  -3.0000000e+00
  -3.0000000e+00
  -2.0000000e+00
  -1.0000000e+00
  -1.0000000e+00
  -0.0000000e+00
   0.0000000e+00
   1.0000000e+00
   1.0000000e+00
   2.0000000e+00
   2.0000000e+00
   2.0000000e+00
   3.0000000e+00
   3.0000000e+00
   3.0000000e+00
   4.0000000e+00
   4.0000000e+00
   4.0000000e+00
   4.0000000e+00
   5.0000000e+00
   5.0000000e+00
   6.0000000e+00
   6.0000000e+00
   6.0000000e+00
   7.0000000e+00
   8.0000000e+00
   8.0000000e+00
   9.0000000e+00
   1.0000000e+01
   1.1000000e+01
   1.2000000e+01
   1.4000000e+01
   1.5000000e+01
   1.7000000e+01
   1.8000000e+01
   2.0000000e+01
   2.2000000e+01
   2.5000000e+01
   2.7000000e+01
   3.0000000e+01
   3.3000000e+01
   3.6000000e+01
   3.9000000e+01
   4.3000000e+01
   4.7000000e+01
   5.1000000e+01
   5.5000000e+01
   6.0000000e+01
   6.5000000e+01
   7.0000000e+01
   7.5000000e+01
   8.0000000e+01
   8.6000000e+01
   9.2000000e+01
   9.8000000e+01
   1.0400000e+02
   1.1000000e+02
   1.1600000e+02
   1.2300000e+02
   1.2900000e+02
   1.3600000e+02
   1.4200000e+02
   1.4900000e+02
   1.5500000e+02
   1.6100000e+02
   1.6800000e+02
   1.7400000e+02
   1.7900000e+02
   1.8500000e+02
   1.9000000e+02
   1.9500000e+02
   1.9900000e+02
   2.0300000e+02
   2.0700000e+02
   2.1000000e+02
   2.1200000e+02
   2.1400000e+02
   2.1500000e+02
   2.1500000e+02
   2.1400000e+02
   2.1300000e+02
   2.1000000e+02
   2.0700000e+02
   2.0200000e+02
   1.9700000e+02
   1.9000000e+02
   1.8200000e+02
   1.7300000e+02
   1.6200000e+02
   1.5100000e+02
   1.3800000e+02
   1.2300000e+02
   1.0800000e+02
   9.1000000e+01
   7.2000000e+01
   5.2000000e+01
   3.1000000e+01
   8.0000000e+00
  -1.6000000e+01
  -4.2000000e+01
  -6.9000000e+01
  -9.7000000e+01
  -1.2700000e+02
  -1.5800000e+02
  -1.9000000e+02
  -2.2300000e+02
  -2.5800000e+02
  -2.9300000e+02
  -3.2900000e+02
  -3.6700000e+02
  -4.0500000e+02
  -4.4300000e+02
  -4.8200000e+02
  -5.2200000e+02
  -5.6200000e+02
  -6.0100000e+02
  -6.4100000e+02
  -6.8100000e+02
  -7.2000000e+02
  -7.5900000e+02
  -7.9700000e+02
  -8.3500000e+02
  -8.7100000e+02
  -9.0600000e+02
  -9.3900000e+02
  -9.7100000e+02
  -1.0010000e+03
  -1.0290000e+03
  -1.0550000e+03
  -1.0780000e+03
  -1.0980000e+03
  -1.1160000e+03
  -1.1300000e+03
  -1.1420000e+03
  -1.1490000e+03
  -1.1530000e+03
  -1.1530000e+03
  -1.1490000e+03
  -1.1410000e+03
  -1.1280000e+03
  -1.1110000e+03
  -1.0890000e+03
  -1.0620000e+03
  -1.0300000e+03
  -9.9200000e+02
  -9.5000000e+02
  -9.0200000e+02
  -8.4900000e+02
  -7.9100000e+02
  -7.2600000e+02
  -6.5700000e+02
  -5.8200000e+02
  -5.0100000e+02
  -4.1600000e+02
  -3.2400000e+02
  -2.2800000e+02
  -1.2600000e+02
  -2.0000000e+01
   9.1000000e+01
   2.0700000e+02
   3.2800000e+02
   4.5200000e+02
   5.8000000e+02
   7.1200000e+02
   8.4700000e+02
   9.8500000e+02
   1.1260000e+03
   1.2690000e+03
   1.4130000e+03
   1.5590000e+03
   1.7060000e+03
   1.8530000e+03
   2.0000000e+03
   2.1460000e+03
   2.2900000e+03
   2.4330000e+03
   2.5740000e+03
   2.7120000e+03
   2.8460000e+03
   2.9760000e+03
   3.1010000e+03
   3.2200000e+03
   3.3340000e+03
   3.4410000e+03
   3.5400000e+03
   3.6310000e+03
   3.7140000e+03
   3.7870000e+03
   3.8510000e+03
   3.9040000e+03
   3.9460000e+03
   3.9760000e+03
   3.9940000e+03
   3.9990000e+03
   3.9900000e+03
   3.9680000e+03
   3.9320000e+03
   3.8810000e+03
   3.8140000e+03
   3.7330000e+03
   3.6350000e+03
   3.5220000e+03
   3.3920000e+03
   3.2460000e+03
   3.0840000e+03
   2.9050000e+03
   2.7090000e+03
   2.4960000e+03
   2.2670000e+03
   2.0220000e+03
   1.7610000e+03
   1.4830000e+03
   1.1900000e+03
   8.8300000e+02
   5.6000000e+02
   2.2300000e+02
  -1.2700000e+02
  -4.9000000e+02
  -8.6500000e+02
  -1.2510000e+03
  -1.6480000e+03
  -2.0540000e+03
  -2.4690000e+03
  -2.8910000e+03
  -3.3200000e+03
  -3.7530000e+03
  -4.1900000e+03
  -4.6300000e+03
  -5.0710000e+03
  -5.5120000e+03
  -5.9510000e+03
  -6.3870000e+03
  -6.8180000e+03
  -7.2430000e+03
  -7.6590000e+03
  -8.0670000e+03
  -8.4620000e+03
  -8.8450000e+03
  -9.2130000e+03
  -9.5650000e+03
  -9.8980000e+03
  -1.0211000e+04
  -1.0502000e+04
  -1.0770000e+04
  -1.1013000e+04
  -1.1228000e+04
  -1.1415000e+04
  -1.1571000e+04
  -1.1695000e+04
  -1.1786000e+04
  -1.1841000e+04
  -1.1859000e+04
  -1.1839000e+04
  -1.1779000e+04
  -1.1677000e+04
  -1.1534000e+04
  -1.1347000e+04
  -1.1115000e+04
  -1.0837000e+04
  -1.0512000e+04
  -1.0139000e+04
  -9.7180000e+03
  -9.2480000e+03
  -8.7280000e+03
  -8.1580000e+03
  -7.5370000e+03
  -6.8650000e+03
  -6.1420000e+03
  -5.3680000e+03
  -4.5430000e+03
  -3.6680000e+03
  -2.7420000e+03
  -1.7660000e+03
  -7.4100000e+02
   3.3200000e+02
   1.4530000e+03
   2.6210000e+03
   3.8340000e+03
   5.0920000e+03
   6.3920000e+03
   7.7340000e+03
   9.1150000e+03
   1.0534000e+04
   1.1990000e+04
   1.3479000e+04
   1.5001000e+04
   1.6553000e+04
   1.8132000e+04
   1.9736000e+04
   2.1363000e+04
   2.3010000e+04
   2.4675000e+04
   2.6354000e+04
   2.8046000e+04
   2.9746000e+04
   3.1453000e+04
   3.3162000e+04
   3.4872000e+04
   3.6579000e+04
   3.8280000e+04
   3.9972000e+04
   4.1652000e+04
   4.3316000e+04
   4.4962000e+04
   4.6586000e+04
   4.8186000e+04
   4.9758000e+04
   5.1299000e+04
   5.2806000e+04
   5.4276000e+04
   5.5706000e+04
   5.7094000e+04
   5.8437000e+04
   5.9731000e+04
   6.0975000e+04
   6.2166000e+04
   6.3301000e+04
   6.4378000e+04
   6.5395000e+04
   6.6350000e+04
   6.7240000e+04
   6.8065000e+04
   6.8821000e+04
   6.9509000e+04
   7.0125000e+04
   7.0670000e+04
   7.1141000e+04
   7.1538000e+04
   7.1860000e+04
   7.2106000e+04
   7.2276000e+04
   7.2370000e+04
   7.2386000e+04
   7.2326000e+04
   7.2189000e+04
   7.1975000e+04
   7.1686000e+04
   7.1321000e+04
   7.0881000e+04
   7.0368000e+04
   6.9782000e+04
   6.9124000e+04
   6.8397000e+04
   6.7601000e+04
   6.6738000e+04
   6.5809000e+04
   6.4818000e+04
   6.3765000e+04
   6.2654000e+04
   6.1485000e+04
   6.0262000e+04
   5.8987000e+04
   5.7663000e+04
   5.6292000e+04
   5.4878000e+04
   5.3422000e+04
   5.1928000e+04
   5.0398000e+04
   4.8836000e+04
   4.7245000e+04
   4.5628000e+04
   4.3988000e+04
   4.2328000e+04
   4.0651000e+04
   3.8960000e+04
   3.7259000e+04
   3.5550000e+04
   3.3837000e+04
   3.2123000e+04
   3.0411000e+04
   2.8703000e+04
   2.7003000e+04
   2.5314000e+04
   2.3639000e+04
   2.1979000e+04
   2.0339000e+04
   1.8721000e+04
   1.7126000e+04
   1.5559000e+04
   1.4020000e+04
   1.2512000e+04
   1.1038000e+04
   9.6000000e+03
   8.1980000e+03
   6.8360000e+03
   5.5150000e+03
   4.2360000e+03
   3.0010000e+03
   1.8110000e+03
   6.6800000e+02
  -4.2800000e+02
  -1.4760000e+03
  -2.4750000e+03
  -3.4230000e+03
  -4.3210000e+03
  -5.1690000e+03
  -5.9650000e+03
  -6.7100000e+03
  -7.4040000e+03
  -8.0460000e+03
  -8.6370000e+03
  -9.1780000e+03
  -9.6680000e+03
  -1.0108000e+04
  -1.0500000e+04
  -1.0843000e+04
  -1.1138000e+04
  -1.1387000e+04
  -1.1590000e+04
  -1.1749000e+04
  -1.1864000e+04
  -1.1938000e+04
  -1.1971000e+04
  -1.1964000e+04
  -1.1920000e+04
  -1.1840000e+04
  -1.1725000e+04
  -1.1578000e+04
  -1.1398000e+04
  -1.1190000e+04
  -1.0953000e+04
  -1.0690000e+04
  -1.0403000e+04
  -1.0093000e+04
  -9.7620000e+03
  -9.4120000e+03
  -9.0450000e+03
  -8.6620000e+03
  -8.2660000e+03
  -7.8570000e+03
  -7.4380000e+03
  -7.0110000e+03
  -6.5770000e+03
  -6.1370000e+03
  -5.6940000e+03
  -5.2480000e+03
  -4.8020000e+03
  -4.3570000e+03
  -3.9130000e+03
  -3.4740000e+03
  -3.0380000e+03
  -2.6090000e+03
  -2.1880000e+03
  -1.7740000e+03
  -1.3700000e+03
  -9.7600000e+02
  -5.9300000e+02
  -2.2300000e+02
   1.3500000e+02
   4.7900000e+02
   8.0900000e+02
   1.1250000e+03
   1.4250000e+03
   1.7090000e+03
   1.9780000e+03
   2.2300000e+03
   2.4650000e+03
   2.6840000e+03
   2.8860000e+03
   3.0700000e+03
   3.2380000e+03
   3.3890000e+03
   3.5240000e+03
   3.6410000e+03
   3.7430000e+03
   3.8280000e+03
   3.8970000e+03
   3.9510000e+03
   3.9900000e+03
   4.0140000e+03
   4.0240000e+03
   4.0210000e+03
   4.0040000e+03
   3.9740000e+03
   3.9330000e+03
   3.8800000e+03
   3.8160000e+03
   3.7420000e+03
   3.6590000e+03
   3.5660000e+03
   3.4650000e+03
   3.3570000e+03
   3.2420000e+03
   3.1200000e+03
   2.9930000e+03
   2.8610000e+03
   2.7240000e+03
   2.5840000e+03
   2.4400000e+03
   2.2950000e+03
   2.1470000e+03
   1.9980000e+03
   1.8480000e+03
   1.6990000e+03
   1.5490000e+03
   1.4010000e+03
   1.2540000e+03
   1.1080000e+03
   9.6500000e+02
   8.2500000e+02
   6.8800000e+02
   5.5400000e+02
   4.2400000e+02
   2.9800000e+02
   1.7600000e+02
   5.9000000e+01
  -5.3000000e+01
  -1.6000000e+02
  -2.6200000e+02
  -3.5900000e+02
  -4.5000000e+02
  -5.3600000e+02
  -6.1600000e+02
  -6.9000000e+02
  -7.5800000e+02
  -8.2100000e+02
  -8.7800000e+02
  -9.3000000e+02
  -9.7500000e+02
  -1.0160000e+03
  -1.0500000e+03
  -1.0800000e+03
  -1.1040000e+03
  -1.1230000e+03
  -1.1370000e+03
  -1.1460000e+03
  -1.1510000e+03
  -1.1520000e+03
  -1.1480000e+03
  -1.1400000e+03
  -1.1280000e+03
  -1.1130000e+03
  -1.0940000e+03
  -1.0730000e+03
  -1.0480000e+03
  -1.0210000e+03
  -9.9100000e+02
  -9.5900000e+02
  -9.2500000e+02
  -8.8900000e+02
  -8.5100000e+02
  -8.1300000e+02
  -7.7300000e+02
  -7.3200000e+02
  -6.9000000e+02
  -6.4800000e+02
  -6.0600000e+02
  -5.6300000e+02
  -5.2100000e+02
  -4.7900000e+02
  -4.3700000e+02
  -3.9500000e+02
  -3.5400000e+02
  -3.1400000e+02
  -2.7500000e+02
  -2.3700000e+02
  -2.0000000e+02
  -1.6400000e+02
  -1.2900000e+02
  -9.6000000e+01
  -6.4000000e+01
  -3.4000000e+01
  -6.0000000e+00
   2.2000000e+01
   4.7000000e+01
   7.1000000e+01
   9.3000000e+01
   1.1300000e+02
   1.3200000e+02
   1.4900000e+02
   1.6500000e+02
   1.7900000e+02
   1.9100000e+02
   2.0200000e+02
   2.1100000e+02
   2.1800000e+02
   2.2500000e+02
   2.2900000e+02
   2.3300000e+02
   2.3500000e+02
   2.3600000e+02
   2.3500000e+02
   2.3400000e+02
   2.3200000e+02
   2.2800000e+02
   2.2400000e+02
   2.1900000e+02
   2.1300000e+02
   2.0600000e+02
   1.9900000e+02
   1.9100000e+02
   1.8200000e+02
   1.7400000e+02
   1.6500000e+02
   1.5500000e+02
   1.4500000e+02
   1.3600000e+02
   1.2600000e+02
   1.1600000e+02
   1.0500000e+02
   9.5000000e+01
   8.6000000e+01
   7.6000000e+01
   6.6000000e+01
   5.7000000e+01
   4.8000000e+01
   3.9000000e+01
   3.0000000e+01
   2.2000000e+01
   1.4000000e+01
   7.0000000e+00
  -1.0000000e+00
  -7.0000000e+00
  -1.3000000e+01
  -1.9000000e+01
  -2.4000000e+01
  -2.9000000e+01
  -3.4000000e+01
  -3.8000000e+01
  -4.1000000e+01
  -4.4000000e+01
  -4.7000000e+01
  -4.9000000e+01
  -5.0000000e+01
  -5.2000000e+01
  -5.2000000e+01
  -5.3000000e+01
  -5.3000000e+01
  -5.3000000e+01
  -5.2000000e+01
  -5.1000000e+01
  -5.0000000e+01
  -4.8000000e+01
  -4.6000000e+01
  -4.4000000e+01
  -4.2000000e+01
  -3.9000000e+01
  -3.7000000e+01
  -3.4000000e+01
  -3.1000000e+01
  -2.8000000e+01
  -2.4000000e+01
  -2.1000000e+01
  -1.8000000e+01
  -1.4000000e+01
  -1.1000000e+01
  -7.0000000e+00
  -4.0000000e+00
  -1.0000000e+00
   3.0000000e+00
   6.0000000e+00
   9.0000000e+00
   1.2000000e+01
   1.5000000e+01
   1.8000000e+01
   2.1000000e+01
   2.4000000e+01
   2.6000000e+01
   2.9000000e+01
   3.1000000e+01
   3.3000000e+01
   3.5000000e+01
   3.7000000e+01
   3.8000000e+01
   4.0000000e+01
   4.1000000e+01
   4.2000000e+01
   4.3000000e+01
   4.3000000e+01
   4.4000000e+01
   4.4000000e+01
   4.4000000e+01
   4.4000000e+01
   4.4000000e+01
   4.4000000e+01
   4.4000000e+01
   4.3000000e+01
   4.2000000e+01
   4.1000000e+01
   4.0000000e+01
   3.9000000e+01
   3.8000000e+01
   3.7000000e+01
   3.5000000e+01
   3.3000000e+01
   3.2000000e+01
   3.0000000e+01
   2.8000000e+01
   2.6000000e+01
   2.4000000e+01
   2.2000000e+01
   2.0000000e+01
   1.8000000e+01
   1.6000000e+01
   1.4000000e+01
   1.2000000e+01
   1.0000000e+01
   8.0000000e+00
   6.0000000e+00
   3.0000000e+00
   1.0000000e+00
  -1.0000000e+00
  -3.0000000e+00
  -5.0000000e+00
  -7.0000000e+00
  -9.0000000e+00
  -1.1000000e+01
  -1.3000000e+01
  -1.4000000e+01
  -1.6000000e+01
  -1.8000000e+01
  -1.9000000e+01
  -2.1000000e+01
  -2.2000000e+01
  -2.4000000e+01
  -2.5000000e+01
  -2.6000000e+01
  -2.7000000e+01
  -2.9000000e+01
  -3.0000000e+01
  -3.0000000e+01
  -3.1000000e+01
  -3.2000000e+01
  -3.3000000e+01
  -3.3000000e+01
  -3.4000000e+01
  -3.4000000e+01
  -3.4000000e+01
  -3.4000000e+01
  -3.4000000e+01
  -3.5000000e+01
