0.97954681510648178
0.96199938852475864
0.95641634935256492
0.96018103957889334
0.97084550482182919
0.98599149617008108
1.0031905090086812
1.020065773487618
1.0344448617241175
1.0445671947562329
1.0492874946527209
1.048209114085324
1.0416994670090711
1.030778593793449
1.0169132681869564
1.0017735372979342
0.98700781965830398
0.97407268698645744
0.96412771851151924
0.95798590366426317
0.95610080319318114
0.95857199624438727
0.96515660068567144
0.97528327871022624
0.98807351338939997
1.0023810739118482
1.0168625490940522
1.0300878062722456
1.0406885609023155
1.0475279871265295
1.0498600239430209
1.0474411672173218
1.0405652461298653
1.030011703110997
1.0169220666179242
1.0026370231652801
0.98853103381409879
0.97587329590026783
0.96572907728613167
0.95890119610045266
0.95590230477016269
0.95694580624648384
0.9619454449302155
0.97051881824511599
0.98199631767903617
0.99544267282560372
1.0097016869931952
1.023474161841478
1.0354330447834972
1.0443686706993627
1.0493434923888809
1.0498254439182571
1.0457680380933192
1.0376161674688105
1.0262361501183206
1.0127887443612738
0.99857621598069324
0.98489509243180362
0.97291699417267963
0.96360662807382569
0.95767438431498353
0.95555422618904673
0.95739614317660149
0.96306509002859209
0.97214331255668585
0.98393866548241826
0.99750651536471113
1.0116955566573116
1.025226699220622
1.0368079036679638
1.0452768116307583
1.0497502163120778
1.0497502163120778
1.0452768116307583
1.0368079036679638
1.025226699220622
1.0116955566573116
0.99750651536471113
0.98393866548241826
0.97214331255668585
0.96306509002859209
0.95739614317660149
0.95555422618904673
0.95767438431498353
0.96360662807382569
0.97291699417267963
0.98489509243180362
0.99857621598069324
1.0127887443612738
1.0262361501183206
1.0376161674688105
1.0457680380933192
1.0498254439182571
1.0493434923888809
1.0443686706993627
1.0354330447834972
1.023474161841478
1.0097016869931952
0.99544267282560372
0.98199631767903617
0.97051881824511599
0.9619454449302155
0.95694580624648384
0.95590230477016269
0.95890119610045266
0.96572907728613167
0.97587329590026783
0.98853103381409879
1.0026370231652801
1.0169220666179242
1.030011703110997
1.0405652461298653
1.0474411672173218
1.0498600239430209
1.0475279871265295
1.0406885609023155
1.0300878062722456
1.0168625490940522
1.0023810739118482
0.98807351338939997
0.97528327871022624
0.96515660068567144
0.95857199624438727
0.95610080319318114
0.95798590366426317
0.96412771851151924
0.97407268698645744
0.98700781965830398
1.0017735372979342
1.0169132681869564
1.030778593793449
1.0416994670090711
1.048209114085324
1.0492874946527209
1.0445671947562329
1.0344448617241175
1.020065773487618
1.0031905090086812
0.98599149617008108
0.97084550482182919
0.96018103957889334
0.95641634935256492
0.96199938852475864
0.97954681510648178
