<?xml version="1.0" encoding="utf-8" standalone="no"?>
<!DOCTYPE svg PUBLIC "-//W3C//DTD SVG 1.1//EN"
  "http://www.w3.org/Graphics/SVG/1.1/DTD/svg11.dtd">
<svg xmlns:xlink="http://www.w3.org/1999/xlink" width="460.8pt" height="345.6pt" viewBox="0 0 460.8 345.6" xmlns="http://www.w3.org/2000/svg" version="1.1">
 <metadata>
  <rdf:RDF xmlns:dc="http://purl.org/dc/elements/1.1/" xmlns:cc="http://creativecommons.org/ns#" xmlns:rdf="http://www.w3.org/1999/02/22-rdf-syntax-ns#">
   <cc:Work>
    <dc:type rdf:resource="http://purl.org/dc/dcmitype/StillImage"/>
    <dc:date>2023-09-18T23:32:36.844106</dc:date>
    <dc:format>image/svg+xml</dc:format>
    <dc:creator>
     <cc:Agent>
      <dc:title>Matplotlib v3.7.0, https://matplotlib.org/</dc:title>
     </cc:Agent>
    </dc:creator>
   </cc:Work>
  </rdf:RDF>
 </metadata>
 <defs>
  <style type="text/css">*{stroke-linejoin: round; stroke-linecap: butt}</style>
 </defs>
 <g id="figure_1">
  <g id="patch_1">
   <path d="M 0 345.6 
L 460.8 345.6 
L 460.8 0 
L 0 0 
z
" style="fill: #ffffff"/>
  </g>
  <g id="axes_1">
   <g id="patch_2">
    <path d="M 57.6 307.584 
L 414.72 307.584 
L 414.72 41.472 
L 57.6 41.472 
z
" style="fill: #ffffff"/>
   </g>
   <g id="matplotlib.axis_1">
    <g id="xtick_1">
     <g id="line2d_1">
      <defs>
       <path id="m8e42769368" d="M 0 0 
L 0 3.5 
" style="stroke: #000000; stroke-width: 0.8"/>
      </defs>
      <g>
       <use xlink:href="#m8e42769368" x="73.832727" y="307.584" style="stroke: #000000; stroke-width: 0.8"/>
      </g>
     </g>
     <g id="text_1">
      <!-- 0.0 -->
      <g transform="translate(65.881165 322.182437) scale(0.1 -0.1)">
       <defs>
        <path id="DejaVuSans-30" d="M 2034 4250 
Q 1547 4250 1301 3770 
Q 1056 3291 1056 2328 
Q 1056 1369 1301 889 
Q 1547 409 2034 409 
Q 2525 409 2770 889 
Q 3016 1369 3016 2328 
Q 3016 3291 2770 3770 
Q 2525 4250 2034 4250 
z
M 2034 4750 
Q 2819 4750 3233 4129 
Q 3647 3509 3647 2328 
Q 3647 1150 3233 529 
Q 2819 -91 2034 -91 
Q 1250 -91 836 529 
Q 422 1150 422 2328 
Q 422 3509 836 4129 
Q 1250 4750 2034 4750 
z
" transform="scale(0.015625)"/>
        <path id="DejaVuSans-2e" d="M 684 794 
L 1344 794 
L 1344 0 
L 684 0 
L 684 794 
z
" transform="scale(0.015625)"/>
       </defs>
       <use xlink:href="#DejaVuSans-30"/>
       <use xlink:href="#DejaVuSans-2e" x="63.623047"/>
       <use xlink:href="#DejaVuSans-30" x="95.410156"/>
      </g>
     </g>
    </g>
    <g id="xtick_2">
     <g id="line2d_2">
      <g>
       <use xlink:href="#m8e42769368" x="116.550431" y="307.584" style="stroke: #000000; stroke-width: 0.8"/>
      </g>
     </g>
     <g id="text_2">
      <!-- 2.5 -->
      <g transform="translate(108.598868 322.182437) scale(0.1 -0.1)">
       <defs>
        <path id="DejaVuSans-32" d="M 1228 531 
L 3431 531 
L 3431 0 
L 469 0 
L 469 531 
Q 828 903 1448 1529 
Q 2069 2156 2228 2338 
Q 2531 2678 2651 2914 
Q 2772 3150 2772 3378 
Q 2772 3750 2511 3984 
Q 2250 4219 1831 4219 
Q 1534 4219 1204 4116 
Q 875 4013 500 3803 
L 500 4441 
Q 881 4594 1212 4672 
Q 1544 4750 1819 4750 
Q 2544 4750 2975 4387 
Q 3406 4025 3406 3419 
Q 3406 3131 3298 2873 
Q 3191 2616 2906 2266 
Q 2828 2175 2409 1742 
Q 1991 1309 1228 531 
z
" transform="scale(0.015625)"/>
        <path id="DejaVuSans-35" d="M 691 4666 
L 3169 4666 
L 3169 4134 
L 1269 4134 
L 1269 2991 
Q 1406 3038 1543 3061 
Q 1681 3084 1819 3084 
Q 2600 3084 3056 2656 
Q 3513 2228 3513 1497 
Q 3513 744 3044 326 
Q 2575 -91 1722 -91 
Q 1428 -91 1123 -41 
Q 819 9 494 109 
L 494 744 
Q 775 591 1075 516 
Q 1375 441 1709 441 
Q 2250 441 2565 725 
Q 2881 1009 2881 1497 
Q 2881 1984 2565 2268 
Q 2250 2553 1709 2553 
Q 1456 2553 1204 2497 
Q 953 2441 691 2322 
L 691 4666 
z
" transform="scale(0.015625)"/>
       </defs>
       <use xlink:href="#DejaVuSans-32"/>
       <use xlink:href="#DejaVuSans-2e" x="63.623047"/>
       <use xlink:href="#DejaVuSans-35" x="95.410156"/>
      </g>
     </g>
    </g>
    <g id="xtick_3">
     <g id="line2d_3">
      <g>
       <use xlink:href="#m8e42769368" x="159.268134" y="307.584" style="stroke: #000000; stroke-width: 0.8"/>
      </g>
     </g>
     <g id="text_3">
      <!-- 5.0 -->
      <g transform="translate(151.316571 322.182437) scale(0.1 -0.1)">
       <use xlink:href="#DejaVuSans-35"/>
       <use xlink:href="#DejaVuSans-2e" x="63.623047"/>
       <use xlink:href="#DejaVuSans-30" x="95.410156"/>
      </g>
     </g>
    </g>
    <g id="xtick_4">
     <g id="line2d_4">
      <g>
       <use xlink:href="#m8e42769368" x="201.985837" y="307.584" style="stroke: #000000; stroke-width: 0.8"/>
      </g>
     </g>
     <g id="text_4">
      <!-- 7.5 -->
      <g transform="translate(194.034275 322.182437) scale(0.1 -0.1)">
       <defs>
        <path id="DejaVuSans-37" d="M 525 4666 
L 3525 4666 
L 3525 4397 
L 1831 0 
L 1172 0 
L 2766 4134 
L 525 4134 
L 525 4666 
z
" transform="scale(0.015625)"/>
       </defs>
       <use xlink:href="#DejaVuSans-37"/>
       <use xlink:href="#DejaVuSans-2e" x="63.623047"/>
       <use xlink:href="#DejaVuSans-35" x="95.410156"/>
      </g>
     </g>
    </g>
    <g id="xtick_5">
     <g id="line2d_5">
      <g>
       <use xlink:href="#m8e42769368" x="244.703541" y="307.584" style="stroke: #000000; stroke-width: 0.8"/>
      </g>
     </g>
     <g id="text_5">
      <!-- 10.0 -->
      <g transform="translate(233.570728 322.182437) scale(0.1 -0.1)">
       <defs>
        <path id="DejaVuSans-31" d="M 794 531 
L 1825 531 
L 1825 4091 
L 703 3866 
L 703 4441 
L 1819 4666 
L 2450 4666 
L 2450 531 
L 3481 531 
L 3481 0 
L 794 0 
L 794 531 
z
" transform="scale(0.015625)"/>
       </defs>
       <use xlink:href="#DejaVuSans-31"/>
       <use xlink:href="#DejaVuSans-30" x="63.623047"/>
       <use xlink:href="#DejaVuSans-2e" x="127.246094"/>
       <use xlink:href="#DejaVuSans-30" x="159.033203"/>
      </g>
     </g>
    </g>
    <g id="xtick_6">
     <g id="line2d_6">
      <g>
       <use xlink:href="#m8e42769368" x="287.421244" y="307.584" style="stroke: #000000; stroke-width: 0.8"/>
      </g>
     </g>
     <g id="text_6">
      <!-- 12.5 -->
      <g transform="translate(276.288432 322.182437) scale(0.1 -0.1)">
       <use xlink:href="#DejaVuSans-31"/>
       <use xlink:href="#DejaVuSans-32" x="63.623047"/>
       <use xlink:href="#DejaVuSans-2e" x="127.246094"/>
       <use xlink:href="#DejaVuSans-35" x="159.033203"/>
      </g>
     </g>
    </g>
    <g id="xtick_7">
     <g id="line2d_7">
      <g>
       <use xlink:href="#m8e42769368" x="330.138947" y="307.584" style="stroke: #000000; stroke-width: 0.8"/>
      </g>
     </g>
     <g id="text_7">
      <!-- 15.0 -->
      <g transform="translate(319.006135 322.182437) scale(0.1 -0.1)">
       <use xlink:href="#DejaVuSans-31"/>
       <use xlink:href="#DejaVuSans-35" x="63.623047"/>
       <use xlink:href="#DejaVuSans-2e" x="127.246094"/>
       <use xlink:href="#DejaVuSans-30" x="159.033203"/>
      </g>
     </g>
    </g>
    <g id="xtick_8">
     <g id="line2d_8">
      <g>
       <use xlink:href="#m8e42769368" x="372.856651" y="307.584" style="stroke: #000000; stroke-width: 0.8"/>
      </g>
     </g>
     <g id="text_8">
      <!-- 17.5 -->
      <g transform="translate(361.723838 322.182437) scale(0.1 -0.1)">
       <use xlink:href="#DejaVuSans-31"/>
       <use xlink:href="#DejaVuSans-37" x="63.623047"/>
       <use xlink:href="#DejaVuSans-2e" x="127.246094"/>
       <use xlink:href="#DejaVuSans-35" x="159.033203"/>
      </g>
     </g>
    </g>
    <g id="text_9">
     <!-- integration -->
     <g transform="translate(208.694375 335.860562) scale(0.1 -0.1)">
      <defs>
       <path id="DejaVuSans-69" d="M 603 3500 
L 1178 3500 
L 1178 0 
L 603 0 
L 603 3500 
z
M 603 4863 
L 1178 4863 
L 1178 4134 
L 603 4134 
L 603 4863 
z
" transform="scale(0.015625)"/>
       <path id="DejaVuSans-6e" d="M 3513 2113 
L 3513 0 
L 2938 0 
L 2938 2094 
Q 2938 2591 2744 2837 
Q 2550 3084 2163 3084 
Q 1697 3084 1428 2787 
Q 1159 2491 1159 1978 
L 1159 0 
L 581 0 
L 581 3500 
L 1159 3500 
L 1159 2956 
Q 1366 3272 1645 3428 
Q 1925 3584 2291 3584 
Q 2894 3584 3203 3211 
Q 3513 2838 3513 2113 
z
" transform="scale(0.015625)"/>
       <path id="DejaVuSans-74" d="M 1172 4494 
L 1172 3500 
L 2356 3500 
L 2356 3053 
L 1172 3053 
L 1172 1153 
Q 1172 725 1289 603 
Q 1406 481 1766 481 
L 2356 481 
L 2356 0 
L 1766 0 
Q 1100 0 847 248 
Q 594 497 594 1153 
L 594 3053 
L 172 3053 
L 172 3500 
L 594 3500 
L 594 4494 
L 1172 4494 
z
" transform="scale(0.015625)"/>
       <path id="DejaVuSans-65" d="M 3597 1894 
L 3597 1613 
L 953 1613 
Q 991 1019 1311 708 
Q 1631 397 2203 397 
Q 2534 397 2845 478 
Q 3156 559 3463 722 
L 3463 178 
Q 3153 47 2828 -22 
Q 2503 -91 2169 -91 
Q 1331 -91 842 396 
Q 353 884 353 1716 
Q 353 2575 817 3079 
Q 1281 3584 2069 3584 
Q 2775 3584 3186 3129 
Q 3597 2675 3597 1894 
z
M 3022 2063 
Q 3016 2534 2758 2815 
Q 2500 3097 2075 3097 
Q 1594 3097 1305 2825 
Q 1016 2553 972 2059 
L 3022 2063 
z
" transform="scale(0.015625)"/>
       <path id="DejaVuSans-67" d="M 2906 1791 
Q 2906 2416 2648 2759 
Q 2391 3103 1925 3103 
Q 1463 3103 1205 2759 
Q 947 2416 947 1791 
Q 947 1169 1205 825 
Q 1463 481 1925 481 
Q 2391 481 2648 825 
Q 2906 1169 2906 1791 
z
M 3481 434 
Q 3481 -459 3084 -895 
Q 2688 -1331 1869 -1331 
Q 1566 -1331 1297 -1286 
Q 1028 -1241 775 -1147 
L 775 -588 
Q 1028 -725 1275 -790 
Q 1522 -856 1778 -856 
Q 2344 -856 2625 -561 
Q 2906 -266 2906 331 
L 2906 616 
Q 2728 306 2450 153 
Q 2172 0 1784 0 
Q 1141 0 747 490 
Q 353 981 353 1791 
Q 353 2603 747 3093 
Q 1141 3584 1784 3584 
Q 2172 3584 2450 3431 
Q 2728 3278 2906 2969 
L 2906 3500 
L 3481 3500 
L 3481 434 
z
" transform="scale(0.015625)"/>
       <path id="DejaVuSans-72" d="M 2631 2963 
Q 2534 3019 2420 3045 
Q 2306 3072 2169 3072 
Q 1681 3072 1420 2755 
Q 1159 2438 1159 1844 
L 1159 0 
L 581 0 
L 581 3500 
L 1159 3500 
L 1159 2956 
Q 1341 3275 1631 3429 
Q 1922 3584 2338 3584 
Q 2397 3584 2469 3576 
Q 2541 3569 2628 3553 
L 2631 2963 
z
" transform="scale(0.015625)"/>
       <path id="DejaVuSans-61" d="M 2194 1759 
Q 1497 1759 1228 1600 
Q 959 1441 959 1056 
Q 959 750 1161 570 
Q 1363 391 1709 391 
Q 2188 391 2477 730 
Q 2766 1069 2766 1631 
L 2766 1759 
L 2194 1759 
z
M 3341 1997 
L 3341 0 
L 2766 0 
L 2766 531 
Q 2569 213 2275 61 
Q 1981 -91 1556 -91 
Q 1019 -91 701 211 
Q 384 513 384 1019 
Q 384 1609 779 1909 
Q 1175 2209 1959 2209 
L 2766 2209 
L 2766 2266 
Q 2766 2663 2505 2880 
Q 2244 3097 1772 3097 
Q 1472 3097 1187 3025 
Q 903 2953 641 2809 
L 641 3341 
Q 956 3463 1253 3523 
Q 1550 3584 1831 3584 
Q 2591 3584 2966 3190 
Q 3341 2797 3341 1997 
z
" transform="scale(0.015625)"/>
       <path id="DejaVuSans-6f" d="M 1959 3097 
Q 1497 3097 1228 2736 
Q 959 2375 959 1747 
Q 959 1119 1226 758 
Q 1494 397 1959 397 
Q 2419 397 2687 759 
Q 2956 1122 2956 1747 
Q 2956 2369 2687 2733 
Q 2419 3097 1959 3097 
z
M 1959 3584 
Q 2709 3584 3137 3096 
Q 3566 2609 3566 1747 
Q 3566 888 3137 398 
Q 2709 -91 1959 -91 
Q 1206 -91 779 398 
Q 353 888 353 1747 
Q 353 2609 779 3096 
Q 1206 3584 1959 3584 
z
" transform="scale(0.015625)"/>
      </defs>
      <use xlink:href="#DejaVuSans-69"/>
      <use xlink:href="#DejaVuSans-6e" x="27.783203"/>
      <use xlink:href="#DejaVuSans-74" x="91.162109"/>
      <use xlink:href="#DejaVuSans-65" x="130.371094"/>
      <use xlink:href="#DejaVuSans-67" x="191.894531"/>
      <use xlink:href="#DejaVuSans-72" x="255.371094"/>
      <use xlink:href="#DejaVuSans-61" x="296.484375"/>
      <use xlink:href="#DejaVuSans-74" x="357.763672"/>
      <use xlink:href="#DejaVuSans-69" x="396.972656"/>
      <use xlink:href="#DejaVuSans-6f" x="424.755859"/>
      <use xlink:href="#DejaVuSans-6e" x="485.9375"/>
     </g>
    </g>
   </g>
   <g id="matplotlib.axis_2">
    <g id="ytick_1">
     <g id="line2d_9">
      <defs>
       <path id="mbe74aae6e7" d="M 0 0 
L -3.5 0 
" style="stroke: #000000; stroke-width: 0.8"/>
      </defs>
      <g>
       <use xlink:href="#mbe74aae6e7" x="57.6" y="298.586655" style="stroke: #000000; stroke-width: 0.8"/>
      </g>
     </g>
     <g id="text_10">
      <!-- 0.0 -->
      <g transform="translate(34.696875 302.385874) scale(0.1 -0.1)">
       <use xlink:href="#DejaVuSans-30"/>
       <use xlink:href="#DejaVuSans-2e" x="63.623047"/>
       <use xlink:href="#DejaVuSans-30" x="95.410156"/>
      </g>
     </g>
    </g>
    <g id="ytick_2">
     <g id="line2d_10">
      <g>
       <use xlink:href="#mbe74aae6e7" x="57.6" y="266.090298" style="stroke: #000000; stroke-width: 0.8"/>
      </g>
     </g>
     <g id="text_11">
      <!-- 0.2 -->
      <g transform="translate(34.696875 269.889517) scale(0.1 -0.1)">
       <use xlink:href="#DejaVuSans-30"/>
       <use xlink:href="#DejaVuSans-2e" x="63.623047"/>
       <use xlink:href="#DejaVuSans-32" x="95.410156"/>
      </g>
     </g>
    </g>
    <g id="ytick_3">
     <g id="line2d_11">
      <g>
       <use xlink:href="#mbe74aae6e7" x="57.6" y="233.593941" style="stroke: #000000; stroke-width: 0.8"/>
      </g>
     </g>
     <g id="text_12">
      <!-- 0.4 -->
      <g transform="translate(34.696875 237.39316) scale(0.1 -0.1)">
       <defs>
        <path id="DejaVuSans-34" d="M 2419 4116 
L 825 1625 
L 2419 1625 
L 2419 4116 
z
M 2253 4666 
L 3047 4666 
L 3047 1625 
L 3713 1625 
L 3713 1100 
L 3047 1100 
L 3047 0 
L 2419 0 
L 2419 1100 
L 313 1100 
L 313 1709 
L 2253 4666 
z
" transform="scale(0.015625)"/>
       </defs>
       <use xlink:href="#DejaVuSans-30"/>
       <use xlink:href="#DejaVuSans-2e" x="63.623047"/>
       <use xlink:href="#DejaVuSans-34" x="95.410156"/>
      </g>
     </g>
    </g>
    <g id="ytick_4">
     <g id="line2d_12">
      <g>
       <use xlink:href="#mbe74aae6e7" x="57.6" y="201.097584" style="stroke: #000000; stroke-width: 0.8"/>
      </g>
     </g>
     <g id="text_13">
      <!-- 0.6 -->
      <g transform="translate(34.696875 204.896803) scale(0.1 -0.1)">
       <defs>
        <path id="DejaVuSans-36" d="M 2113 2584 
Q 1688 2584 1439 2293 
Q 1191 2003 1191 1497 
Q 1191 994 1439 701 
Q 1688 409 2113 409 
Q 2538 409 2786 701 
Q 3034 994 3034 1497 
Q 3034 2003 2786 2293 
Q 2538 2584 2113 2584 
z
M 3366 4563 
L 3366 3988 
Q 3128 4100 2886 4159 
Q 2644 4219 2406 4219 
Q 1781 4219 1451 3797 
Q 1122 3375 1075 2522 
Q 1259 2794 1537 2939 
Q 1816 3084 2150 3084 
Q 2853 3084 3261 2657 
Q 3669 2231 3669 1497 
Q 3669 778 3244 343 
Q 2819 -91 2113 -91 
Q 1303 -91 875 529 
Q 447 1150 447 2328 
Q 447 3434 972 4092 
Q 1497 4750 2381 4750 
Q 2619 4750 2861 4703 
Q 3103 4656 3366 4563 
z
" transform="scale(0.015625)"/>
       </defs>
       <use xlink:href="#DejaVuSans-30"/>
       <use xlink:href="#DejaVuSans-2e" x="63.623047"/>
       <use xlink:href="#DejaVuSans-36" x="95.410156"/>
      </g>
     </g>
    </g>
    <g id="ytick_5">
     <g id="line2d_13">
      <g>
       <use xlink:href="#mbe74aae6e7" x="57.6" y="168.601228" style="stroke: #000000; stroke-width: 0.8"/>
      </g>
     </g>
     <g id="text_14">
      <!-- 0.8 -->
      <g transform="translate(34.696875 172.400446) scale(0.1 -0.1)">
       <defs>
        <path id="DejaVuSans-38" d="M 2034 2216 
Q 1584 2216 1326 1975 
Q 1069 1734 1069 1313 
Q 1069 891 1326 650 
Q 1584 409 2034 409 
Q 2484 409 2743 651 
Q 3003 894 3003 1313 
Q 3003 1734 2745 1975 
Q 2488 2216 2034 2216 
z
M 1403 2484 
Q 997 2584 770 2862 
Q 544 3141 544 3541 
Q 544 4100 942 4425 
Q 1341 4750 2034 4750 
Q 2731 4750 3128 4425 
Q 3525 4100 3525 3541 
Q 3525 3141 3298 2862 
Q 3072 2584 2669 2484 
Q 3125 2378 3379 2068 
Q 3634 1759 3634 1313 
Q 3634 634 3220 271 
Q 2806 -91 2034 -91 
Q 1263 -91 848 271 
Q 434 634 434 1313 
Q 434 1759 690 2068 
Q 947 2378 1403 2484 
z
M 1172 3481 
Q 1172 3119 1398 2916 
Q 1625 2713 2034 2713 
Q 2441 2713 2670 2916 
Q 2900 3119 2900 3481 
Q 2900 3844 2670 4047 
Q 2441 4250 2034 4250 
Q 1625 4250 1398 4047 
Q 1172 3844 1172 3481 
z
" transform="scale(0.015625)"/>
       </defs>
       <use xlink:href="#DejaVuSans-30"/>
       <use xlink:href="#DejaVuSans-2e" x="63.623047"/>
       <use xlink:href="#DejaVuSans-38" x="95.410156"/>
      </g>
     </g>
    </g>
    <g id="ytick_6">
     <g id="line2d_14">
      <g>
       <use xlink:href="#mbe74aae6e7" x="57.6" y="136.104871" style="stroke: #000000; stroke-width: 0.8"/>
      </g>
     </g>
     <g id="text_15">
      <!-- 1.0 -->
      <g transform="translate(34.696875 139.904089) scale(0.1 -0.1)">
       <use xlink:href="#DejaVuSans-31"/>
       <use xlink:href="#DejaVuSans-2e" x="63.623047"/>
       <use xlink:href="#DejaVuSans-30" x="95.410156"/>
      </g>
     </g>
    </g>
    <g id="ytick_7">
     <g id="line2d_15">
      <g>
       <use xlink:href="#mbe74aae6e7" x="57.6" y="103.608514" style="stroke: #000000; stroke-width: 0.8"/>
      </g>
     </g>
     <g id="text_16">
      <!-- 1.2 -->
      <g transform="translate(34.696875 107.407733) scale(0.1 -0.1)">
       <use xlink:href="#DejaVuSans-31"/>
       <use xlink:href="#DejaVuSans-2e" x="63.623047"/>
       <use xlink:href="#DejaVuSans-32" x="95.410156"/>
      </g>
     </g>
    </g>
    <g id="ytick_8">
     <g id="line2d_16">
      <g>
       <use xlink:href="#mbe74aae6e7" x="57.6" y="71.112157" style="stroke: #000000; stroke-width: 0.8"/>
      </g>
     </g>
     <g id="text_17">
      <!-- 1.4 -->
      <g transform="translate(34.696875 74.911376) scale(0.1 -0.1)">
       <use xlink:href="#DejaVuSans-31"/>
       <use xlink:href="#DejaVuSans-2e" x="63.623047"/>
       <use xlink:href="#DejaVuSans-34" x="95.410156"/>
      </g>
     </g>
    </g>
    <g id="text_18">
     <!-- absolute value -->
     <g transform="translate(28.617187 211.27175) rotate(-90) scale(0.1 -0.1)">
      <defs>
       <path id="DejaVuSans-62" d="M 3116 1747 
Q 3116 2381 2855 2742 
Q 2594 3103 2138 3103 
Q 1681 3103 1420 2742 
Q 1159 2381 1159 1747 
Q 1159 1113 1420 752 
Q 1681 391 2138 391 
Q 2594 391 2855 752 
Q 3116 1113 3116 1747 
z
M 1159 2969 
Q 1341 3281 1617 3432 
Q 1894 3584 2278 3584 
Q 2916 3584 3314 3078 
Q 3713 2572 3713 1747 
Q 3713 922 3314 415 
Q 2916 -91 2278 -91 
Q 1894 -91 1617 61 
Q 1341 213 1159 525 
L 1159 0 
L 581 0 
L 581 4863 
L 1159 4863 
L 1159 2969 
z
" transform="scale(0.015625)"/>
       <path id="DejaVuSans-73" d="M 2834 3397 
L 2834 2853 
Q 2591 2978 2328 3040 
Q 2066 3103 1784 3103 
Q 1356 3103 1142 2972 
Q 928 2841 928 2578 
Q 928 2378 1081 2264 
Q 1234 2150 1697 2047 
L 1894 2003 
Q 2506 1872 2764 1633 
Q 3022 1394 3022 966 
Q 3022 478 2636 193 
Q 2250 -91 1575 -91 
Q 1294 -91 989 -36 
Q 684 19 347 128 
L 347 722 
Q 666 556 975 473 
Q 1284 391 1588 391 
Q 1994 391 2212 530 
Q 2431 669 2431 922 
Q 2431 1156 2273 1281 
Q 2116 1406 1581 1522 
L 1381 1569 
Q 847 1681 609 1914 
Q 372 2147 372 2553 
Q 372 3047 722 3315 
Q 1072 3584 1716 3584 
Q 2034 3584 2315 3537 
Q 2597 3491 2834 3397 
z
" transform="scale(0.015625)"/>
       <path id="DejaVuSans-6c" d="M 603 4863 
L 1178 4863 
L 1178 0 
L 603 0 
L 603 4863 
z
" transform="scale(0.015625)"/>
       <path id="DejaVuSans-75" d="M 544 1381 
L 544 3500 
L 1119 3500 
L 1119 1403 
Q 1119 906 1312 657 
Q 1506 409 1894 409 
Q 2359 409 2629 706 
Q 2900 1003 2900 1516 
L 2900 3500 
L 3475 3500 
L 3475 0 
L 2900 0 
L 2900 538 
Q 2691 219 2414 64 
Q 2138 -91 1772 -91 
Q 1169 -91 856 284 
Q 544 659 544 1381 
z
M 1991 3584 
L 1991 3584 
z
" transform="scale(0.015625)"/>
       <path id="DejaVuSans-20" transform="scale(0.015625)"/>
       <path id="DejaVuSans-76" d="M 191 3500 
L 800 3500 
L 1894 563 
L 2988 3500 
L 3597 3500 
L 2284 0 
L 1503 0 
L 191 3500 
z
" transform="scale(0.015625)"/>
      </defs>
      <use xlink:href="#DejaVuSans-61"/>
      <use xlink:href="#DejaVuSans-62" x="61.279297"/>
      <use xlink:href="#DejaVuSans-73" x="124.755859"/>
      <use xlink:href="#DejaVuSans-6f" x="176.855469"/>
      <use xlink:href="#DejaVuSans-6c" x="238.037109"/>
      <use xlink:href="#DejaVuSans-75" x="265.820312"/>
      <use xlink:href="#DejaVuSans-74" x="329.199219"/>
      <use xlink:href="#DejaVuSans-65" x="368.408203"/>
      <use xlink:href="#DejaVuSans-20" x="429.931641"/>
      <use xlink:href="#DejaVuSans-76" x="461.71875"/>
      <use xlink:href="#DejaVuSans-61" x="520.898438"/>
      <use xlink:href="#DejaVuSans-6c" x="582.177734"/>
      <use xlink:href="#DejaVuSans-75" x="609.960938"/>
      <use xlink:href="#DejaVuSans-65" x="673.339844"/>
     </g>
    </g>
    <g id="text_19">
     <!-- 1e6 -->
     <g transform="translate(57.6 38.472) scale(0.1 -0.1)">
      <use xlink:href="#DejaVuSans-31"/>
      <use xlink:href="#DejaVuSans-65" x="63.623047"/>
      <use xlink:href="#DejaVuSans-36" x="125.146484"/>
     </g>
    </g>
   </g>
   <g id="line2d_17">
    <path d="M 73.832727 55.239046 
L 90.919809 54.666134 
L 108.00689 54.858842 
L 125.093971 54.20293 
L 142.181053 54.921837 
L 159.268134 54.629716 
L 176.355215 55.205883 
L 193.442297 54.788316 
L 210.529378 54.950562 
L 227.616459 54.406759 
L 244.703541 54.603424 
L 261.790622 54.490927 
L 278.877703 54.568974 
L 295.964785 54.255747 
L 313.051866 54.79934 
L 330.138947 54.387611 
L 347.226029 54.492086 
L 364.31311 54.791439 
L 381.400191 54.754428 
L 398.487273 54.575209 
" clip-path="url(#p79ae7671fa)" style="fill: none; stroke: #ff0000; stroke-width: 1.5; stroke-linecap: square"/>
   </g>
   <g id="line2d_18">
    <path d="M 73.832727 55.239046 
L 90.919809 54.666134 
L 108.00689 54.858842 
L 125.093971 54.20293 
L 142.181053 54.921837 
L 159.268134 54.629716 
L 176.355215 55.205883 
L 193.442297 54.788316 
L 210.529378 54.950562 
L 227.616459 54.406759 
L 244.703541 54.603424 
L 261.790622 54.490927 
L 278.877703 54.568974 
L 295.964785 54.255747 
L 313.051866 54.79934 
L 330.138947 54.387611 
L 347.226029 54.492086 
L 364.31311 54.791439 
L 381.400191 54.754428 
L 398.487273 54.575209 
" clip-path="url(#p79ae7671fa)" style="fill: none; stroke: #008000; stroke-width: 1.5; stroke-linecap: square"/>
   </g>
   <g id="line2d_19">
    <path d="M 73.832727 55.239046 
L 90.919809 54.666134 
L 108.00689 54.858842 
L 125.093971 54.20293 
L 142.181053 54.921837 
L 159.268134 54.629716 
L 176.355215 55.205883 
L 193.442297 54.788316 
L 210.529378 54.950562 
L 227.616459 54.406759 
L 244.703541 54.603424 
L 261.790622 54.490927 
L 278.877703 54.568974 
L 295.964785 54.255747 
L 313.051866 54.79934 
L 330.138947 54.387611 
L 347.226029 54.492086 
L 364.31311 54.791439 
L 381.400191 54.754428 
L 398.487273 54.575209 
" clip-path="url(#p79ae7671fa)" style="fill: none; stroke: #0000ff; stroke-width: 1.5; stroke-linecap: square"/>
   </g>
   <g id="line2d_20">
    <path d="M 73.832727 55.239046 
L 90.919809 54.666134 
L 108.00689 54.858842 
L 125.093971 54.20293 
L 142.181053 54.921837 
L 159.268134 54.629716 
L 176.355215 55.205883 
L 193.442297 54.788316 
L 210.529378 54.950562 
L 227.616459 54.406759 
L 244.703541 54.603424 
L 261.790622 54.490927 
L 278.877703 54.568974 
L 295.964785 54.255747 
L 313.051866 54.79934 
L 330.138947 54.387611 
L 347.226029 54.492086 
L 364.31311 54.791439 
L 381.400191 54.754428 
L 398.487273 54.575209 
" clip-path="url(#p79ae7671fa)" style="fill: none; stroke: #00bfbf; stroke-width: 1.5; stroke-linecap: square"/>
   </g>
   <g id="line2d_21">
    <path d="M 73.832727 55.239046 
L 90.919809 54.666134 
L 108.00689 54.858842 
L 125.093971 54.20293 
L 142.181053 54.921837 
L 159.268134 54.629716 
L 176.355215 55.205883 
L 193.442297 54.788316 
L 210.529378 54.950562 
L 227.616459 54.406759 
L 244.703541 54.603424 
L 261.790622 54.490927 
L 278.877703 54.568974 
L 295.964785 54.255747 
L 313.051866 54.79934 
L 330.138947 54.387611 
L 347.226029 54.492086 
L 364.31311 54.791439 
L 381.400191 54.754428 
L 398.487273 54.575209 
" clip-path="url(#p79ae7671fa)" style="fill: none; stroke: #bf00bf; stroke-width: 1.5; stroke-linecap: square"/>
   </g>
   <g id="line2d_22">
    <path d="M 73.832727 55.239046 
L 90.919809 54.666134 
L 108.00689 54.858842 
L 125.093971 54.20293 
L 142.181053 54.921837 
L 159.268134 54.629716 
L 176.355215 55.205883 
L 193.442297 54.788316 
L 210.529378 54.950562 
L 227.616459 54.406759 
L 244.703541 54.603424 
L 261.790622 54.490927 
L 278.877703 54.568974 
L 295.964785 54.255747 
L 313.051866 54.79934 
L 330.138947 54.387611 
L 347.226029 54.492086 
L 364.31311 54.791439 
L 381.400191 54.754428 
L 398.487273 54.575209 
" clip-path="url(#p79ae7671fa)" style="fill: none; stroke: #bfbf00; stroke-width: 1.5; stroke-linecap: square"/>
   </g>
   <g id="line2d_23">
    <path d="M 73.832727 55.239046 
L 90.919809 54.666134 
L 108.00689 54.858842 
L 125.093971 54.20293 
L 142.181053 54.921837 
L 159.268134 54.629716 
L 176.355215 55.205883 
L 193.442297 54.788316 
L 210.529378 54.950562 
L 227.616459 54.406759 
L 244.703541 54.603424 
L 261.790622 54.490927 
L 278.877703 54.568974 
L 295.964785 54.255747 
L 313.051866 54.79934 
L 330.138947 54.387611 
L 347.226029 54.492086 
L 364.31311 54.791439 
L 381.400191 54.754428 
L 398.487273 54.575209 
" clip-path="url(#p79ae7671fa)" style="fill: none; stroke: #000000; stroke-width: 1.5; stroke-linecap: square"/>
   </g>
   <g id="line2d_24">
    <path d="M 73.832727 55.239046 
L 90.919809 54.666134 
L 108.00689 54.858842 
L 125.093971 54.20293 
L 142.181053 54.921837 
L 159.268134 54.629716 
L 176.355215 55.205883 
L 193.442297 54.788316 
L 210.529378 54.950562 
L 227.616459 54.406759 
L 244.703541 54.603424 
L 261.790622 54.490927 
L 278.877703 54.568974 
L 295.964785 54.255747 
L 313.051866 54.79934 
L 330.138947 54.387611 
L 347.226029 54.492086 
L 364.31311 54.791439 
L 381.400191 54.754428 
L 398.487273 54.575209 
" clip-path="url(#p79ae7671fa)" style="fill: none; stroke: #ff0000; stroke-width: 1.5; stroke-linecap: square"/>
   </g>
   <g id="line2d_25">
    <path d="M 73.832727 55.239046 
L 90.919809 54.666134 
L 108.00689 54.858842 
L 125.093971 54.20293 
L 142.181053 54.921837 
L 159.268134 54.629716 
L 176.355215 55.205883 
L 193.442297 54.788316 
L 210.529378 54.950562 
L 227.616459 54.406759 
L 244.703541 54.603424 
L 261.790622 54.490927 
L 278.877703 54.568974 
L 295.964785 54.255747 
L 313.051866 54.79934 
L 330.138947 54.387611 
L 347.226029 54.492086 
L 364.31311 54.791439 
L 381.400191 54.754428 
L 398.487273 54.575209 
" clip-path="url(#p79ae7671fa)" style="fill: none; stroke: #008000; stroke-width: 1.5; stroke-linecap: square"/>
   </g>
   <g id="line2d_26">
    <path d="M 73.832727 55.239046 
L 90.919809 54.666134 
L 108.00689 54.858842 
L 125.093971 54.20293 
L 142.181053 54.921837 
L 159.268134 54.629716 
L 176.355215 55.205883 
L 193.442297 54.788316 
L 210.529378 54.950562 
L 227.616459 54.406759 
L 244.703541 54.603424 
L 261.790622 54.490927 
L 278.877703 54.568974 
L 295.964785 54.255747 
L 313.051866 54.79934 
L 330.138947 54.387611 
L 347.226029 54.492086 
L 364.31311 54.791439 
L 381.400191 54.754428 
L 398.487273 54.575209 
" clip-path="url(#p79ae7671fa)" style="fill: none; stroke: #0000ff; stroke-width: 1.5; stroke-linecap: square"/>
   </g>
   <g id="line2d_27">
    <path d="M 73.832727 295.160461 
L 90.919809 295.439513 
L 108.00689 295.105382 
L 125.093971 295.281236 
L 142.181053 295.14957 
L 159.268134 295.144068 
L 176.355215 295.327424 
L 193.442297 295.349241 
L 210.529378 295.283496 
L 227.616459 295.017429 
L 244.703541 295.488 
L 261.790622 295.434182 
L 278.877703 295.468837 
L 295.964785 295.227197 
L 313.051866 295.384032 
L 330.138947 295.160166 
L 347.226029 295.34248 
L 364.31311 295.395698 
L 381.400191 295.244665 
L 398.487273 295.279706 
" clip-path="url(#p79ae7671fa)" style="fill: none; stroke: #ff0000; stroke-width: 1.5; stroke-linecap: square"/>
   </g>
   <g id="line2d_28">
    <path d="M 73.832727 295.160461 
L 90.919809 295.439513 
L 108.00689 295.105382 
L 125.093971 295.281236 
L 142.181053 295.14957 
L 159.268134 295.144068 
L 176.355215 295.327424 
L 193.442297 295.349241 
L 210.529378 295.283496 
L 227.616459 295.017429 
L 244.703541 295.488 
L 261.790622 295.434182 
L 278.877703 295.468837 
L 295.964785 295.227197 
L 313.051866 295.384032 
L 330.138947 295.160166 
L 347.226029 295.34248 
L 364.31311 295.395698 
L 381.400191 295.244665 
L 398.487273 295.279706 
" clip-path="url(#p79ae7671fa)" style="fill: none; stroke: #008000; stroke-width: 1.5; stroke-linecap: square"/>
   </g>
   <g id="line2d_29">
    <path d="M 73.832727 295.160461 
L 90.919809 295.439513 
L 108.00689 295.105382 
L 125.093971 295.281236 
L 142.181053 295.14957 
L 159.268134 295.144068 
L 176.355215 295.327424 
L 193.442297 295.349241 
L 210.529378 295.283496 
L 227.616459 295.017429 
L 244.703541 295.488 
L 261.790622 295.434182 
L 278.877703 295.468837 
L 295.964785 295.227197 
L 313.051866 295.384032 
L 330.138947 295.160166 
L 347.226029 295.34248 
L 364.31311 295.395698 
L 381.400191 295.244665 
L 398.487273 295.279706 
" clip-path="url(#p79ae7671fa)" style="fill: none; stroke: #0000ff; stroke-width: 1.5; stroke-linecap: square"/>
   </g>
   <g id="line2d_30">
    <path d="M 73.832727 295.160461 
L 90.919809 295.439513 
L 108.00689 295.105382 
L 125.093971 295.281236 
L 142.181053 295.14957 
L 159.268134 295.144068 
L 176.355215 295.327424 
L 193.442297 295.349241 
L 210.529378 295.283496 
L 227.616459 295.017429 
L 244.703541 295.488 
L 261.790622 295.434182 
L 278.877703 295.468837 
L 295.964785 295.227197 
L 313.051866 295.384032 
L 330.138947 295.160166 
L 347.226029 295.34248 
L 364.31311 295.395698 
L 381.400191 295.244665 
L 398.487273 295.279706 
" clip-path="url(#p79ae7671fa)" style="fill: none; stroke: #00bfbf; stroke-width: 1.5; stroke-linecap: square"/>
   </g>
   <g id="line2d_31">
    <path d="M 73.832727 54.618807 
L 90.919809 54.523479 
L 108.00689 54.41596 
L 125.093971 54.259739 
L 142.181053 53.568 
L 159.268134 54.355357 
L 176.355215 54.823884 
L 193.442297 54.422493 
L 210.529378 54.618067 
L 227.616459 54.610942 
L 244.703541 54.583709 
L 261.790622 54.538926 
L 278.877703 54.34137 
L 295.964785 54.272261 
L 313.051866 54.675083 
L 330.138947 54.290239 
L 347.226029 54.639453 
L 364.31311 54.739263 
L 381.400191 54.816195 
L 398.487273 54.731638 
" clip-path="url(#p79ae7671fa)" style="fill: none; stroke: #bf00bf; stroke-width: 1.5; stroke-linecap: square"/>
   </g>
   <g id="line2d_32">
    <path d="M 73.832727 295.160461 
L 90.919809 295.439513 
L 108.00689 295.105382 
L 125.093971 295.281236 
L 142.181053 295.14957 
L 159.268134 295.144068 
L 176.355215 295.327424 
L 193.442297 295.349241 
L 210.529378 295.283496 
L 227.616459 295.017429 
L 244.703541 295.488 
L 261.790622 295.434182 
L 278.877703 295.468837 
L 295.964785 295.227197 
L 313.051866 295.384032 
L 330.138947 295.160166 
L 347.226029 295.34248 
L 364.31311 295.395698 
L 381.400191 295.244665 
L 398.487273 295.279706 
" clip-path="url(#p79ae7671fa)" style="fill: none; stroke: #bfbf00; stroke-width: 1.5; stroke-linecap: square"/>
   </g>
   <g id="line2d_33">
    <path d="M 73.832727 295.160461 
L 90.919809 295.439513 
L 108.00689 295.105382 
L 125.093971 295.281236 
L 142.181053 295.14957 
L 159.268134 295.144068 
L 176.355215 295.327424 
L 193.442297 295.349241 
L 210.529378 295.283496 
L 227.616459 295.017429 
L 244.703541 295.488 
L 261.790622 295.434182 
L 278.877703 295.468837 
L 295.964785 295.227197 
L 313.051866 295.384032 
L 330.138947 295.160166 
L 347.226029 295.34248 
L 364.31311 295.395698 
L 381.400191 295.244665 
L 398.487273 295.279706 
" clip-path="url(#p79ae7671fa)" style="fill: none; stroke: #000000; stroke-width: 1.5; stroke-linecap: square"/>
   </g>
   <g id="line2d_34">
    <path d="M 73.832727 295.160461 
L 90.919809 295.439513 
L 108.00689 295.105382 
L 125.093971 295.281236 
L 142.181053 295.14957 
L 159.268134 295.144068 
L 176.355215 295.327424 
L 193.442297 295.349241 
L 210.529378 295.283496 
L 227.616459 295.017429 
L 244.703541 295.488 
L 261.790622 295.434182 
L 278.877703 295.468837 
L 295.964785 295.227197 
L 313.051866 295.384032 
L 330.138947 295.160166 
L 347.226029 295.34248 
L 364.31311 295.395698 
L 381.400191 295.244665 
L 398.487273 295.279706 
" clip-path="url(#p79ae7671fa)" style="fill: none; stroke: #ff0000; stroke-width: 1.5; stroke-linecap: square"/>
   </g>
   <g id="line2d_35">
    <path d="M 73.832727 295.160461 
L 90.919809 295.439513 
L 108.00689 295.105382 
L 125.093971 295.281236 
L 142.181053 295.14957 
L 159.268134 295.144068 
L 176.355215 295.327424 
L 193.442297 295.349241 
L 210.529378 295.283496 
L 227.616459 295.017429 
L 244.703541 295.488 
L 261.790622 295.434182 
L 278.877703 295.468837 
L 295.964785 295.227197 
L 313.051866 295.384032 
L 330.138947 295.160166 
L 347.226029 295.34248 
L 364.31311 295.395698 
L 381.400191 295.244665 
L 398.487273 295.279706 
" clip-path="url(#p79ae7671fa)" style="fill: none; stroke: #008000; stroke-width: 1.5; stroke-linecap: square"/>
   </g>
   <g id="line2d_36">
    <path d="M 73.832727 54.618807 
L 90.919809 54.523479 
L 108.00689 54.41596 
L 125.093971 54.259739 
L 142.181053 53.568 
L 159.268134 54.355357 
L 176.355215 54.823884 
L 193.442297 54.422493 
L 210.529378 54.618067 
L 227.616459 54.610942 
L 244.703541 54.583709 
L 261.790622 54.538926 
L 278.877703 54.34137 
L 295.964785 54.272261 
L 313.051866 54.675083 
L 330.138947 54.290239 
L 347.226029 54.639453 
L 364.31311 54.739263 
L 381.400191 54.816195 
L 398.487273 54.731638 
" clip-path="url(#p79ae7671fa)" style="fill: none; stroke: #0000ff; stroke-width: 1.5; stroke-linecap: square"/>
   </g>
   <g id="line2d_37">
    <path d="M 73.832727 54.618807 
L 90.919809 54.523479 
L 108.00689 54.41596 
L 125.093971 54.259739 
L 142.181053 53.568 
L 159.268134 54.355357 
L 176.355215 54.823884 
L 193.442297 54.422493 
L 210.529378 54.618067 
L 227.616459 54.610942 
L 244.703541 54.583709 
L 261.790622 54.538926 
L 278.877703 54.34137 
L 295.964785 54.272261 
L 313.051866 54.675083 
L 330.138947 54.290239 
L 347.226029 54.639453 
L 364.31311 54.739263 
L 381.400191 54.816195 
L 398.487273 54.731638 
" clip-path="url(#p79ae7671fa)" style="fill: none; stroke: #ff0000; stroke-width: 1.5; stroke-linecap: square"/>
   </g>
   <g id="patch_3">
    <path d="M 57.6 307.584 
L 57.6 41.472 
" style="fill: none; stroke: #000000; stroke-width: 0.8; stroke-linejoin: miter; stroke-linecap: square"/>
   </g>
   <g id="patch_4">
    <path d="M 414.72 307.584 
L 414.72 41.472 
" style="fill: none; stroke: #000000; stroke-width: 0.8; stroke-linejoin: miter; stroke-linecap: square"/>
   </g>
   <g id="patch_5">
    <path d="M 57.6 307.584 
L 414.72 307.584 
" style="fill: none; stroke: #000000; stroke-width: 0.8; stroke-linejoin: miter; stroke-linecap: square"/>
   </g>
   <g id="patch_6">
    <path d="M 57.6 41.472 
L 414.72 41.472 
" style="fill: none; stroke: #000000; stroke-width: 0.8; stroke-linejoin: miter; stroke-linecap: square"/>
   </g>
   <g id="text_20">
    <!-- amplitude_vs_time_polarisation_XX -->
    <g transform="translate(130.135312 35.472) scale(0.12 -0.12)">
     <defs>
      <path id="DejaVuSans-6d" d="M 3328 2828 
Q 3544 3216 3844 3400 
Q 4144 3584 4550 3584 
Q 5097 3584 5394 3201 
Q 5691 2819 5691 2113 
L 5691 0 
L 5113 0 
L 5113 2094 
Q 5113 2597 4934 2840 
Q 4756 3084 4391 3084 
Q 3944 3084 3684 2787 
Q 3425 2491 3425 1978 
L 3425 0 
L 2847 0 
L 2847 2094 
Q 2847 2600 2669 2842 
Q 2491 3084 2119 3084 
Q 1678 3084 1418 2786 
Q 1159 2488 1159 1978 
L 1159 0 
L 581 0 
L 581 3500 
L 1159 3500 
L 1159 2956 
Q 1356 3278 1631 3431 
Q 1906 3584 2284 3584 
Q 2666 3584 2933 3390 
Q 3200 3197 3328 2828 
z
" transform="scale(0.015625)"/>
      <path id="DejaVuSans-70" d="M 1159 525 
L 1159 -1331 
L 581 -1331 
L 581 3500 
L 1159 3500 
L 1159 2969 
Q 1341 3281 1617 3432 
Q 1894 3584 2278 3584 
Q 2916 3584 3314 3078 
Q 3713 2572 3713 1747 
Q 3713 922 3314 415 
Q 2916 -91 2278 -91 
Q 1894 -91 1617 61 
Q 1341 213 1159 525 
z
M 3116 1747 
Q 3116 2381 2855 2742 
Q 2594 3103 2138 3103 
Q 1681 3103 1420 2742 
Q 1159 2381 1159 1747 
Q 1159 1113 1420 752 
Q 1681 391 2138 391 
Q 2594 391 2855 752 
Q 3116 1113 3116 1747 
z
" transform="scale(0.015625)"/>
      <path id="DejaVuSans-64" d="M 2906 2969 
L 2906 4863 
L 3481 4863 
L 3481 0 
L 2906 0 
L 2906 525 
Q 2725 213 2448 61 
Q 2172 -91 1784 -91 
Q 1150 -91 751 415 
Q 353 922 353 1747 
Q 353 2572 751 3078 
Q 1150 3584 1784 3584 
Q 2172 3584 2448 3432 
Q 2725 3281 2906 2969 
z
M 947 1747 
Q 947 1113 1208 752 
Q 1469 391 1925 391 
Q 2381 391 2643 752 
Q 2906 1113 2906 1747 
Q 2906 2381 2643 2742 
Q 2381 3103 1925 3103 
Q 1469 3103 1208 2742 
Q 947 2381 947 1747 
z
" transform="scale(0.015625)"/>
      <path id="DejaVuSans-5f" d="M 3263 -1063 
L 3263 -1509 
L -63 -1509 
L -63 -1063 
L 3263 -1063 
z
" transform="scale(0.015625)"/>
      <path id="DejaVuSans-58" d="M 403 4666 
L 1081 4666 
L 2241 2931 
L 3406 4666 
L 4084 4666 
L 2584 2425 
L 4184 0 
L 3506 0 
L 2194 1984 
L 872 0 
L 191 0 
L 1856 2491 
L 403 4666 
z
" transform="scale(0.015625)"/>
     </defs>
     <use xlink:href="#DejaVuSans-61"/>
     <use xlink:href="#DejaVuSans-6d" x="61.279297"/>
     <use xlink:href="#DejaVuSans-70" x="158.691406"/>
     <use xlink:href="#DejaVuSans-6c" x="222.167969"/>
     <use xlink:href="#DejaVuSans-69" x="249.951172"/>
     <use xlink:href="#DejaVuSans-74" x="277.734375"/>
     <use xlink:href="#DejaVuSans-75" x="316.943359"/>
     <use xlink:href="#DejaVuSans-64" x="380.322266"/>
     <use xlink:href="#DejaVuSans-65" x="443.798828"/>
     <use xlink:href="#DejaVuSans-5f" x="505.322266"/>
     <use xlink:href="#DejaVuSans-76" x="555.322266"/>
     <use xlink:href="#DejaVuSans-73" x="614.501953"/>
     <use xlink:href="#DejaVuSans-5f" x="666.601562"/>
     <use xlink:href="#DejaVuSans-74" x="716.601562"/>
     <use xlink:href="#DejaVuSans-69" x="755.810547"/>
     <use xlink:href="#DejaVuSans-6d" x="783.59375"/>
     <use xlink:href="#DejaVuSans-65" x="881.005859"/>
     <use xlink:href="#DejaVuSans-5f" x="942.529297"/>
     <use xlink:href="#DejaVuSans-70" x="992.529297"/>
     <use xlink:href="#DejaVuSans-6f" x="1056.005859"/>
     <use xlink:href="#DejaVuSans-6c" x="1117.1875"/>
     <use xlink:href="#DejaVuSans-61" x="1144.970703"/>
     <use xlink:href="#DejaVuSans-72" x="1206.25"/>
     <use xlink:href="#DejaVuSans-69" x="1247.363281"/>
     <use xlink:href="#DejaVuSans-73" x="1275.146484"/>
     <use xlink:href="#DejaVuSans-61" x="1327.246094"/>
     <use xlink:href="#DejaVuSans-74" x="1388.525391"/>
     <use xlink:href="#DejaVuSans-69" x="1427.734375"/>
     <use xlink:href="#DejaVuSans-6f" x="1455.517578"/>
     <use xlink:href="#DejaVuSans-6e" x="1516.699219"/>
     <use xlink:href="#DejaVuSans-5f" x="1580.078125"/>
     <use xlink:href="#DejaVuSans-58" x="1630.078125"/>
     <use xlink:href="#DejaVuSans-58" x="1698.583984"/>
    </g>
   </g>
   <g id="legend_1">
    <g id="patch_7">
     <path d="M 61.8 231.216375 
L 92.18625 231.216375 
Q 93.38625 231.216375 93.38625 230.016375 
L 93.38625 45.672 
Q 93.38625 44.472 92.18625 44.472 
L 61.8 44.472 
Q 60.6 44.472 60.6 45.672 
L 60.6 230.016375 
Q 60.6 231.216375 61.8 231.216375 
z
" style="fill: #ffffff; opacity: 0.8; stroke: #cccccc; stroke-linejoin: miter"/>
    </g>
    <g id="line2d_38">
     <path d="M 63 49.331062 
L 69 49.331062 
L 75 49.331062 
" style="fill: none; stroke: #ff0000; stroke-width: 1.5; stroke-linecap: square"/>
    </g>
    <g id="text_21">
     <!-- 1x1 -->
     <g transform="translate(79.8 51.431062) scale(0.06 -0.06)">
      <defs>
       <path id="DejaVuSans-78" d="M 3513 3500 
L 2247 1797 
L 3578 0 
L 2900 0 
L 1881 1375 
L 863 0 
L 184 0 
L 1544 1831 
L 300 3500 
L 978 3500 
L 1906 2253 
L 2834 3500 
L 3513 3500 
z
" transform="scale(0.015625)"/>
      </defs>
      <use xlink:href="#DejaVuSans-31"/>
      <use xlink:href="#DejaVuSans-78" x="63.623047"/>
      <use xlink:href="#DejaVuSans-31" x="122.802734"/>
     </g>
    </g>
    <g id="line2d_39">
     <path d="M 63 58.137937 
L 69 58.137937 
L 75 58.137937 
" style="fill: none; stroke: #008000; stroke-width: 1.5; stroke-linecap: square"/>
    </g>
    <g id="text_22">
     <!-- 2x1 -->
     <g transform="translate(79.8 60.237937) scale(0.06 -0.06)">
      <use xlink:href="#DejaVuSans-32"/>
      <use xlink:href="#DejaVuSans-78" x="63.623047"/>
      <use xlink:href="#DejaVuSans-31" x="122.802734"/>
     </g>
    </g>
    <g id="line2d_40">
     <path d="M 63 66.944812 
L 69 66.944812 
L 75 66.944812 
" style="fill: none; stroke: #0000ff; stroke-width: 1.5; stroke-linecap: square"/>
    </g>
    <g id="text_23">
     <!-- 2x2 -->
     <g transform="translate(79.8 69.044812) scale(0.06 -0.06)">
      <use xlink:href="#DejaVuSans-32"/>
      <use xlink:href="#DejaVuSans-78" x="63.623047"/>
      <use xlink:href="#DejaVuSans-32" x="122.802734"/>
     </g>
    </g>
    <g id="line2d_41">
     <path d="M 63 75.751687 
L 69 75.751687 
L 75 75.751687 
" style="fill: none; stroke: #00bfbf; stroke-width: 1.5; stroke-linecap: square"/>
    </g>
    <g id="text_24">
     <!-- 3x1 -->
     <g transform="translate(79.8 77.851687) scale(0.06 -0.06)">
      <defs>
       <path id="DejaVuSans-33" d="M 2597 2516 
Q 3050 2419 3304 2112 
Q 3559 1806 3559 1356 
Q 3559 666 3084 287 
Q 2609 -91 1734 -91 
Q 1441 -91 1130 -33 
Q 819 25 488 141 
L 488 750 
Q 750 597 1062 519 
Q 1375 441 1716 441 
Q 2309 441 2620 675 
Q 2931 909 2931 1356 
Q 2931 1769 2642 2001 
Q 2353 2234 1838 2234 
L 1294 2234 
L 1294 2753 
L 1863 2753 
Q 2328 2753 2575 2939 
Q 2822 3125 2822 3475 
Q 2822 3834 2567 4026 
Q 2313 4219 1838 4219 
Q 1578 4219 1281 4162 
Q 984 4106 628 3988 
L 628 4550 
Q 988 4650 1302 4700 
Q 1616 4750 1894 4750 
Q 2613 4750 3031 4423 
Q 3450 4097 3450 3541 
Q 3450 3153 3228 2886 
Q 3006 2619 2597 2516 
z
" transform="scale(0.015625)"/>
      </defs>
      <use xlink:href="#DejaVuSans-33"/>
      <use xlink:href="#DejaVuSans-78" x="63.623047"/>
      <use xlink:href="#DejaVuSans-31" x="122.802734"/>
     </g>
    </g>
    <g id="line2d_42">
     <path d="M 63 84.558562 
L 69 84.558562 
L 75 84.558562 
" style="fill: none; stroke: #bf00bf; stroke-width: 1.5; stroke-linecap: square"/>
    </g>
    <g id="text_25">
     <!-- 3x2 -->
     <g transform="translate(79.8 86.658562) scale(0.06 -0.06)">
      <use xlink:href="#DejaVuSans-33"/>
      <use xlink:href="#DejaVuSans-78" x="63.623047"/>
      <use xlink:href="#DejaVuSans-32" x="122.802734"/>
     </g>
    </g>
    <g id="line2d_43">
     <path d="M 63 93.365437 
L 69 93.365437 
L 75 93.365437 
" style="fill: none; stroke: #bfbf00; stroke-width: 1.5; stroke-linecap: square"/>
    </g>
    <g id="text_26">
     <!-- 3x3 -->
     <g transform="translate(79.8 95.465437) scale(0.06 -0.06)">
      <use xlink:href="#DejaVuSans-33"/>
      <use xlink:href="#DejaVuSans-78" x="63.623047"/>
      <use xlink:href="#DejaVuSans-33" x="122.802734"/>
     </g>
    </g>
    <g id="line2d_44">
     <path d="M 63 102.172313 
L 69 102.172313 
L 75 102.172313 
" style="fill: none; stroke: #000000; stroke-width: 1.5; stroke-linecap: square"/>
    </g>
    <g id="text_27">
     <!-- 4x1 -->
     <g transform="translate(79.8 104.272312) scale(0.06 -0.06)">
      <use xlink:href="#DejaVuSans-34"/>
      <use xlink:href="#DejaVuSans-78" x="63.623047"/>
      <use xlink:href="#DejaVuSans-31" x="122.802734"/>
     </g>
    </g>
    <g id="line2d_45">
     <path d="M 63 110.979187 
L 69 110.979187 
L 75 110.979187 
" style="fill: none; stroke: #ff0000; stroke-width: 1.5; stroke-linecap: square"/>
    </g>
    <g id="text_28">
     <!-- 4x2 -->
     <g transform="translate(79.8 113.079187) scale(0.06 -0.06)">
      <use xlink:href="#DejaVuSans-34"/>
      <use xlink:href="#DejaVuSans-78" x="63.623047"/>
      <use xlink:href="#DejaVuSans-32" x="122.802734"/>
     </g>
    </g>
    <g id="line2d_46">
     <path d="M 63 119.786062 
L 69 119.786062 
L 75 119.786062 
" style="fill: none; stroke: #008000; stroke-width: 1.5; stroke-linecap: square"/>
    </g>
    <g id="text_29">
     <!-- 4x3 -->
     <g transform="translate(79.8 121.886062) scale(0.06 -0.06)">
      <use xlink:href="#DejaVuSans-34"/>
      <use xlink:href="#DejaVuSans-78" x="63.623047"/>
      <use xlink:href="#DejaVuSans-33" x="122.802734"/>
     </g>
    </g>
    <g id="line2d_47">
     <path d="M 63 128.592937 
L 69 128.592937 
L 75 128.592937 
" style="fill: none; stroke: #0000ff; stroke-width: 1.5; stroke-linecap: square"/>
    </g>
    <g id="text_30">
     <!-- 4x4 -->
     <g transform="translate(79.8 130.692937) scale(0.06 -0.06)">
      <use xlink:href="#DejaVuSans-34"/>
      <use xlink:href="#DejaVuSans-78" x="63.623047"/>
      <use xlink:href="#DejaVuSans-34" x="122.802734"/>
     </g>
    </g>
    <g id="line2d_48">
     <path d="M 63 137.399812 
L 69 137.399812 
L 75 137.399812 
" style="fill: none; stroke: #ff0000; stroke-width: 1.5; stroke-linecap: square"/>
    </g>
    <g id="text_31">
     <!-- 5x1 -->
     <g transform="translate(79.8 139.499812) scale(0.06 -0.06)">
      <use xlink:href="#DejaVuSans-35"/>
      <use xlink:href="#DejaVuSans-78" x="63.623047"/>
      <use xlink:href="#DejaVuSans-31" x="122.802734"/>
     </g>
    </g>
    <g id="line2d_49">
     <path d="M 63 146.206688 
L 69 146.206688 
L 75 146.206688 
" style="fill: none; stroke: #008000; stroke-width: 1.5; stroke-linecap: square"/>
    </g>
    <g id="text_32">
     <!-- 5x2 -->
     <g transform="translate(79.8 148.306688) scale(0.06 -0.06)">
      <use xlink:href="#DejaVuSans-35"/>
      <use xlink:href="#DejaVuSans-78" x="63.623047"/>
      <use xlink:href="#DejaVuSans-32" x="122.802734"/>
     </g>
    </g>
    <g id="line2d_50">
     <path d="M 63 155.013563 
L 69 155.013563 
L 75 155.013563 
" style="fill: none; stroke: #0000ff; stroke-width: 1.5; stroke-linecap: square"/>
    </g>
    <g id="text_33">
     <!-- 5x3 -->
     <g transform="translate(79.8 157.113563) scale(0.06 -0.06)">
      <use xlink:href="#DejaVuSans-35"/>
      <use xlink:href="#DejaVuSans-78" x="63.623047"/>
      <use xlink:href="#DejaVuSans-33" x="122.802734"/>
     </g>
    </g>
    <g id="line2d_51">
     <path d="M 63 163.820437 
L 69 163.820437 
L 75 163.820437 
" style="fill: none; stroke: #00bfbf; stroke-width: 1.5; stroke-linecap: square"/>
    </g>
    <g id="text_34">
     <!-- 5x4 -->
     <g transform="translate(79.8 165.920437) scale(0.06 -0.06)">
      <use xlink:href="#DejaVuSans-35"/>
      <use xlink:href="#DejaVuSans-78" x="63.623047"/>
      <use xlink:href="#DejaVuSans-34" x="122.802734"/>
     </g>
    </g>
    <g id="line2d_52">
     <path d="M 63 172.627313 
L 69 172.627313 
L 75 172.627313 
" style="fill: none; stroke: #bf00bf; stroke-width: 1.5; stroke-linecap: square"/>
    </g>
    <g id="text_35">
     <!-- 5x5 -->
     <g transform="translate(79.8 174.727313) scale(0.06 -0.06)">
      <use xlink:href="#DejaVuSans-35"/>
      <use xlink:href="#DejaVuSans-78" x="63.623047"/>
      <use xlink:href="#DejaVuSans-35" x="122.802734"/>
     </g>
    </g>
    <g id="line2d_53">
     <path d="M 63 181.434188 
L 69 181.434188 
L 75 181.434188 
" style="fill: none; stroke: #bfbf00; stroke-width: 1.5; stroke-linecap: square"/>
    </g>
    <g id="text_36">
     <!-- 6x1 -->
     <g transform="translate(79.8 183.534188) scale(0.06 -0.06)">
      <use xlink:href="#DejaVuSans-36"/>
      <use xlink:href="#DejaVuSans-78" x="63.623047"/>
      <use xlink:href="#DejaVuSans-31" x="122.802734"/>
     </g>
    </g>
    <g id="line2d_54">
     <path d="M 63 190.241063 
L 69 190.241063 
L 75 190.241063 
" style="fill: none; stroke: #000000; stroke-width: 1.5; stroke-linecap: square"/>
    </g>
    <g id="text_37">
     <!-- 6x2 -->
     <g transform="translate(79.8 192.341063) scale(0.06 -0.06)">
      <use xlink:href="#DejaVuSans-36"/>
      <use xlink:href="#DejaVuSans-78" x="63.623047"/>
      <use xlink:href="#DejaVuSans-32" x="122.802734"/>
     </g>
    </g>
    <g id="line2d_55">
     <path d="M 63 199.047938 
L 69 199.047938 
L 75 199.047938 
" style="fill: none; stroke: #ff0000; stroke-width: 1.5; stroke-linecap: square"/>
    </g>
    <g id="text_38">
     <!-- 6x3 -->
     <g transform="translate(79.8 201.147938) scale(0.06 -0.06)">
      <use xlink:href="#DejaVuSans-36"/>
      <use xlink:href="#DejaVuSans-78" x="63.623047"/>
      <use xlink:href="#DejaVuSans-33" x="122.802734"/>
     </g>
    </g>
    <g id="line2d_56">
     <path d="M 63 207.854813 
L 69 207.854813 
L 75 207.854813 
" style="fill: none; stroke: #008000; stroke-width: 1.5; stroke-linecap: square"/>
    </g>
    <g id="text_39">
     <!-- 6x4 -->
     <g transform="translate(79.8 209.954813) scale(0.06 -0.06)">
      <use xlink:href="#DejaVuSans-36"/>
      <use xlink:href="#DejaVuSans-78" x="63.623047"/>
      <use xlink:href="#DejaVuSans-34" x="122.802734"/>
     </g>
    </g>
    <g id="line2d_57">
     <path d="M 63 216.661687 
L 69 216.661687 
L 75 216.661687 
" style="fill: none; stroke: #0000ff; stroke-width: 1.5; stroke-linecap: square"/>
    </g>
    <g id="text_40">
     <!-- 6x5 -->
     <g transform="translate(79.8 218.761687) scale(0.06 -0.06)">
      <use xlink:href="#DejaVuSans-36"/>
      <use xlink:href="#DejaVuSans-78" x="63.623047"/>
      <use xlink:href="#DejaVuSans-35" x="122.802734"/>
     </g>
    </g>
    <g id="line2d_58">
     <path d="M 63 225.468562 
L 69 225.468562 
L 75 225.468562 
" style="fill: none; stroke: #ff0000; stroke-width: 1.5; stroke-linecap: square"/>
    </g>
    <g id="text_41">
     <!-- 6x6 -->
     <g transform="translate(79.8 227.568562) scale(0.06 -0.06)">
      <use xlink:href="#DejaVuSans-36"/>
      <use xlink:href="#DejaVuSans-78" x="63.623047"/>
      <use xlink:href="#DejaVuSans-36" x="122.802734"/>
     </g>
    </g>
   </g>
  </g>
 </g>
 <defs>
  <clipPath id="p79ae7671fa">
   <rect x="57.6" y="41.472" width="357.12" height="266.112"/>
  </clipPath>
 </defs>
</svg>
